maven-notifications mailing list archives

Site index · List index
Message view « Date » · « Thread »
Top « Date » · « Thread »
From "GRiD .ORG" <bui...@lists.sonatype.com>
Subject Build failed in Hudson: maven-plugins-UTs » java-5x,windows #1018
Date Thu, 31 Mar 2011 23:20:04 GMT
See <https://grid.sonatype.org/ci/job/maven-plugins-UTs/./jdk=java-5x,label=windows/1018/changes>

Changes:

[Hervé Boutemy] updated code to generics from doxia-decoration-model

------------------------------------------
[...truncated 3923 lines...]
(webxml attribute is missing from war task, or ignoreWebxml attribute is specified as 'true')
[INFO] Packaging classes
[INFO] Building jar: X:\slave\workspace\maven-plugins-UTs\jdk\java-5x\label\windows\trunk\maven-war-plugin\target\test-classes\unit\warmojotest\AttachClassesCustomClassifier-output\simple-mystuff.jar
Tests run: 11, Failures: 0, Errors: 0, Skipped: 0, Time elapsed: 0.844 sec
Running org.apache.maven.plugin.war.WarOverlaysTest
[INFO] Building jar: X:\slave\workspace\maven-plugins-UTs\jdk\java-5x\label\windows\trunk\maven-war-plugin\target\test-overlays\overlay-full-1.war
[INFO] Building jar: X:\slave\workspace\maven-plugins-UTs\jdk\java-5x\label\windows\trunk\maven-war-plugin\target\test-overlays\overlay-full-2.war
[INFO] Building jar: X:\slave\workspace\maven-plugins-UTs\jdk\java-5x\label\windows\trunk\maven-war-plugin\target\test-overlays\overlay-full-3.war
[INFO] Exploding webapp
[INFO] Assembling webapp [maven-war-plugin-test] in [X:\slave\workspace\maven-plugins-UTs\jdk\java-5x\label\windows\trunk\maven-war-plugin\target\test-classes\unit\waroverlays\no-overlay]
[INFO] Processing war project
[INFO] Copying webapp resources [X:\slave\workspace\maven-plugins-UTs\jdk\java-5x\label\windows\trunk\maven-war-plugin\target\test-classes\unit\waroverlays\no-overlay-test-data\source]
[INFO] Webapp assembled in [0 msecs]
[INFO] Building jar: X:\slave\workspace\maven-plugins-UTs\jdk\java-5x\label\windows\trunk\maven-war-plugin\target\test-overlays\overlay-one.war
[INFO] Exploding webapp
[INFO] Assembling webapp [maven-war-plugin-test] in [X:\slave\workspace\maven-plugins-UTs\jdk\java-5x\label\windows\trunk\maven-war-plugin\target\test-classes\unit\waroverlays\default-overlay]
[INFO] Processing war project
[INFO] Copying webapp resources [X:\slave\workspace\maven-plugins-UTs\jdk\java-5x\label\windows\trunk\maven-war-plugin\target\test-classes\unit\waroverlays\default-overlay-test-data\source]
[INFO] Processing overlay [ id wartests:overlay-one]
[INFO] Webapp assembled in [16 msecs]
[INFO] Building jar: X:\slave\workspace\maven-plugins-UTs\jdk\java-5x\label\windows\trunk\maven-war-plugin\target\test-overlays\overlay-two.war
[INFO] Exploding webapp
[INFO] Assembling webapp [maven-war-plugin-test] in [X:\slave\workspace\maven-plugins-UTs\jdk\java-5x\label\windows\trunk\maven-war-plugin\target\test-classes\unit\waroverlays\default-overlays]
[INFO] Processing war project
[INFO] Copying webapp resources [X:\slave\workspace\maven-plugins-UTs\jdk\java-5x\label\windows\trunk\maven-war-plugin\target\test-classes\unit\waroverlays\default-overlays-test-data\source]
[INFO] Processing overlay [ id wartests:overlay-one]
[INFO] Processing overlay [ id wartests:overlay-two]
[INFO] Webapp assembled in [31 msecs]
[INFO] Exploding webapp
[INFO] Assembling webapp [maven-war-plugin-test] in [X:\slave\workspace\maven-plugins-UTs\jdk\java-5x\label\windows\trunk\maven-war-plugin\target\test-classes\unit\waroverlays\scenario-one-default-settings]
[INFO] Processing war project
[INFO] Copying webapp resources [X:\slave\workspace\maven-plugins-UTs\jdk\java-5x\label\windows\trunk\maven-war-plugin\target\test-classes\unit\waroverlays\scenario-one-default-settings-test-data\source]
[INFO] Processing overlay [ id wartests:overlay-full-1]
[INFO] Processing overlay [ id wartests:overlay-full-2]
[INFO] Processing overlay [ id wartests:overlay-full-3]
[INFO] Webapp assembled in [93 msecs]
[INFO] Exploding webapp
[INFO] Assembling webapp [maven-war-plugin-test] in [X:\slave\workspace\maven-plugins-UTs\jdk\java-5x\label\windows\trunk\maven-war-plugin\target\test-classes\unit\waroverlays\scenario-one-overlay-settings]
[INFO] Processing war project
[INFO] Copying webapp resources [X:\slave\workspace\maven-plugins-UTs\jdk\java-5x\label\windows\trunk\maven-war-plugin\target\test-classes\unit\waroverlays\scenario-one-overlay-settings-test-data\source]
[INFO] Processing overlay [ id wartests:overlay-full-1]
[INFO] Processing overlay [ id wartests:overlay-full-2]
[INFO] Processing overlay [ id wartests:overlay-full-3]
[INFO] Webapp assembled in [78 msecs]
[INFO] Exploding webapp
[INFO] Assembling webapp [maven-war-plugin-test] in [X:\slave\workspace\maven-plugins-UTs\jdk\java-5x\label\windows\trunk\maven-war-plugin\target\test-classes\unit\waroverlays\scenario-one-full-settings]
[INFO] Processing war project
[INFO] Copying webapp resources [X:\slave\workspace\maven-plugins-UTs\jdk\java-5x\label\windows\trunk\maven-war-plugin\target\test-classes\unit\waroverlays\scenario-one-full-settings-test-data\source]
[INFO] Processing overlay [ id wartests:overlay-full-1]
[INFO] Processing overlay [ id wartests:overlay-full-2]
[INFO] Processing overlay [ id wartests:overlay-full-3]
[INFO] Webapp assembled in [188 msecs]
[INFO] Exploding webapp
[INFO] Assembling webapp [maven-war-plugin-test] in [X:\slave\workspace\maven-plugins-UTs\jdk\java-5x\label\windows\trunk\maven-war-plugin\target\test-classes\unit\waroverlays\overlays-includes-excludes-multiple-defs]
[INFO] Processing overlay [ id wartests:overlay-full-3]
[INFO] Processing overlay [ id wartests:overlay-full-1]
[INFO] Processing overlay [ id wartests:overlay-full-3]
[INFO] Processing war project
[INFO] Copying webapp resources [X:\slave\workspace\maven-plugins-UTs\jdk\java-5x\label\windows\trunk\maven-war-plugin\target\test-classes\unit\waroverlays\overlays-includes-excludes-multiple-defs-test-data\source]
[INFO] Processing overlay [ id wartests:overlay-full-2]
[INFO] Webapp assembled in [78 msecs]
[INFO] Exploding webapp
[INFO] Assembling webapp [maven-war-plugin-test] in [X:\slave\workspace\maven-plugins-UTs\jdk\java-5x\label\windows\trunk\maven-war-plugin\target\test-classes\unit\waroverlays\overlays-includes-excludes-multiple-defs2]
[INFO] Processing overlay [ id wartests:overlay-full-3]
[INFO] Processing overlay [ id wartests:overlay-full-1]
[INFO] Processing overlay [ id wartests:overlay-full-3]
[INFO] Processing war project
[INFO] Copying webapp resources [X:\slave\workspace\maven-plugins-UTs\jdk\java-5x\label\windows\trunk\maven-war-plugin\target\test-classes\unit\waroverlays\overlays-includes-excludes-multiple-defs2-test-data\source]
[INFO] Processing overlay [ id wartests:overlay-full-2]
[INFO] Webapp assembled in [79 msecs]
[INFO] Exploding webapp
[INFO] Assembling webapp [maven-war-plugin-test] in [X:\slave\workspace\maven-plugins-UTs\jdk\java-5x\label\windows\trunk\maven-war-plugin\target\test-classes\unit\waroverlays\cache-updated-overlay]
[INFO] Processing war project
[INFO] Copying webapp resources [X:\slave\workspace\maven-plugins-UTs\jdk\java-5x\label\windows\trunk\maven-war-plugin\target\test-classes\unit\waroverlays\cache-updated-overlay-test-data\source]
[INFO] Processing overlay [ id wartests:overlay-one]
[INFO] Processing overlay [ id wartests:overlay-two]
[INFO] Webapp assembled in [31 msecs]
[INFO] Exploding webapp
[INFO] Assembling webapp [maven-war-plugin-test] in [X:\slave\workspace\maven-plugins-UTs\jdk\java-5x\label\windows\trunk\maven-war-plugin\target\test-classes\unit\waroverlays\cache-updated-overlay]
[INFO] Processing war project
[INFO] Copying webapp resources [X:\slave\workspace\maven-plugins-UTs\jdk\java-5x\label\windows\trunk\maven-war-plugin\target\test-classes\unit\waroverlays\cache-updated-overlay-test-data\source]
[INFO] Processing overlay [ id wartests:overlay-two]
[INFO] File [index.jsp] belonged to overlay [wartests:overlay-one] so it will be overwritten.
[INFO] File [WEB-INF/web.xml] belonged to overlay [wartests:overlay-one] so it will be overwritten.
[INFO] Processing overlay [ id wartests:overlay-one]
[INFO] Webapp assembled in [16 msecs]
[INFO] Exploding webapp
[INFO] Assembling webapp [maven-war-plugin-test] in [X:\slave\workspace\maven-plugins-UTs\jdk\java-5x\label\windows\trunk\maven-war-plugin\target\test-classes\unit\waroverlays\cache-removed-overlay]
[INFO] Processing war project
[INFO] Copying webapp resources [X:\slave\workspace\maven-plugins-UTs\jdk\java-5x\label\windows\trunk\maven-war-plugin\target\test-classes\unit\waroverlays\cache-removed-overlay-test-data\source]
[INFO] Processing overlay [ id wartests:overlay-one]
[INFO] Processing overlay [ id wartests:overlay-two]
[INFO] Webapp assembled in [31 msecs]
[INFO] Exploding webapp
[INFO] Assembling webapp [maven-war-plugin-test] in [X:\slave\workspace\maven-plugins-UTs\jdk\java-5x\label\windows\trunk\maven-war-plugin\target\test-classes\unit\waroverlays\cache-removed-overlay]
[WARNING] Dependency [Dependency {groupId=wartests, artifactId=overlay-one, version=0.0-Test,
type=war}] has been removed from the project. If it was included in the build as an overlay,
consider cleaning the target directory of the project (mvn clean)
[INFO] Processing war project
[INFO] Copying webapp resources [X:\slave\workspace\maven-plugins-UTs\jdk\java-5x\label\windows\trunk\maven-war-plugin\target\test-classes\unit\waroverlays\cache-removed-overlay-test-data\source]
[INFO] Processing overlay [ id wartests:overlay-two]
[WARNING] File [index.jsp] belonged to overlay [wartests:overlay-one] which does not exist
anymore in the current project. It is recommended to invoke clean if the dependencies of the
project changed.
[WARNING] File [WEB-INF/web.xml] belonged to overlay [wartests:overlay-one] which does not
exist anymore in the current project. It is recommended to invoke clean if the dependencies
of the project changed.
[INFO] Webapp assembled in [0 msecs]
Tests run: 11, Failures: 0, Errors: 0, Skipped: 0, Time elapsed: 1.469 sec
Running org.apache.maven.plugin.war.WarZipTest
[INFO] Packaging webapp
[INFO] Assembling webapp [maven-war-plugin-test] in [X:\slave\workspace\maven-plugins-UTs\jdk\java-5x\label\windows\trunk\maven-war-plugin\target\test-classes\unit\warziptest\one-zip]
[INFO] Processing war project
[INFO] Copying webapp resources [X:\slave\workspace\maven-plugins-UTs\jdk\java-5x\label\windows\trunk\maven-war-plugin\target\test-classes\unit\warziptest\one-zip-test-data\source]
[INFO] Processing overlay [ id zipGroupId:zipId]
[INFO] Webapp assembled in [16 msecs]
[INFO] Building war: X:\slave\workspace\maven-plugins-UTs\jdk\java-5x\label\windows\trunk\maven-war-plugin\target\test-classes\unit\warziptest\one-zip-output\simple.war
[WARNING] Warning: selected war files include a WEB-INF/web.xml which will be ignored 
(webxml attribute is missing from war task, or ignoreWebxml attribute is specified as 'true')
[INFO] Packaging webapp
[INFO] Assembling webapp [maven-war-plugin-test] in [X:\slave\workspace\maven-plugins-UTs\jdk\java-5x\label\windows\trunk\maven-war-plugin\target\test-classes\unit\warziptest\one-zip-overlay-targetPath]
[INFO] Processing war project
[INFO] Copying webapp resources [X:\slave\workspace\maven-plugins-UTs\jdk\java-5x\label\windows\trunk\maven-war-plugin\target\test-classes\unit\warziptest\one-zip-overlay-targetPath-test-data\source]
[INFO] Processing overlay [ id zipGroupId:zipId]
[INFO] Webapp assembled in [15 msecs]
[INFO] Building war: X:\slave\workspace\maven-plugins-UTs\jdk\java-5x\label\windows\trunk\maven-war-plugin\target\test-classes\unit\warziptest\one-zip-overlay-targetPath-output\simple.war
[WARNING] Warning: selected war files include a WEB-INF/web.xml which will be ignored 
(webxml attribute is missing from war task, or ignoreWebxml attribute is specified as 'true')
[INFO] Packaging webapp
[INFO] Assembling webapp [maven-war-plugin-test] in [X:\slave\workspace\maven-plugins-UTs\jdk\java-5x\label\windows\trunk\maven-war-plugin\target\test-classes\unit\warziptest\one-zip-overlay-skip]
[INFO] Processing war project
[INFO] Copying webapp resources [X:\slave\workspace\maven-plugins-UTs\jdk\java-5x\label\windows\trunk\maven-war-plugin\target\test-classes\unit\warziptest\one-zip-overlay-skip-test-data\source]
[INFO] Webapp assembled in [0 msecs]
[INFO] Building war: X:\slave\workspace\maven-plugins-UTs\jdk\java-5x\label\windows\trunk\maven-war-plugin\target\test-classes\unit\warziptest\one-zip-overlay-skip-output\simple.war
[WARNING] Warning: selected war files include a WEB-INF/web.xml which will be ignored 
(webxml attribute is missing from war task, or ignoreWebxml attribute is specified as 'true')
[INFO] Packaging webapp
[INFO] Assembling webapp [maven-war-plugin-test] in [X:\slave\workspace\maven-plugins-UTs\jdk\java-5x\label\windows\trunk\maven-war-plugin\target\test-classes\unit\warziptest\one-zip-overlay-skip]
[INFO] Processing war project
[INFO] Copying webapp resources [X:\slave\workspace\maven-plugins-UTs\jdk\java-5x\label\windows\trunk\maven-war-plugin\target\test-classes\unit\warziptest\one-zip-overlay-skip-test-data\source]
[INFO] Skipping overlay [ id zipGroupId:zipId]
[INFO] Webapp assembled in [0 msecs]
[INFO] Building war: X:\slave\workspace\maven-plugins-UTs\jdk\java-5x\label\windows\trunk\maven-war-plugin\target\test-classes\unit\warziptest\one-zip-overlay-skip-output\simple.war
[WARNING] Warning: selected war files include a WEB-INF/web.xml which will be ignored 
(webxml attribute is missing from war task, or ignoreWebxml attribute is specified as 'true')
Tests run: 4, Failures: 0, Errors: 0, Skipped: 0, Time elapsed: 0.312 sec

Results :

Tests run: 83, Failures: 0, Errors: 0, Skipped: 0

[INFO] [jar:jar {execution: default-jar}]
[INFO] Building jar: X:\slave\workspace\maven-plugins-UTs\jdk\java-5x\label\windows\trunk\maven-war-plugin\target\maven-war-plugin-2.2-SNAPSHOT.jar
[INFO] [plugin:addPluginArtifactMetadata {execution: default-addPluginArtifactMetadata}]
[INFO] [install:install {execution: default-install}]
[INFO] Installing X:\slave\workspace\maven-plugins-UTs\jdk\java-5x\label\windows\trunk\maven-war-plugin\target\maven-war-plugin-2.2-SNAPSHOT.jar
to x:\slave\workspace\maven-plugins-UTs\jdk\java-5x\label\windows\.repository\org\apache\maven\plugins\maven-war-plugin\2.2-SNAPSHOT\maven-war-plugin-2.2-SNAPSHOT.jar
[INFO] ------------------------------------------------------------------------
[INFO] Building Maven Plugins Aggregator
[INFO]    task-segment: [clean, install]
[INFO] ------------------------------------------------------------------------
[INFO] [clean:clean {execution: default-clean}]
[INFO] Deleting x:\slave\workspace\maven-plugins-UTs\jdk\java-5x\label\windows\trunk\target
[INFO] [remote-resources:process {execution: default}]
[INFO] [site:attach-descriptor {execution: default-attach-descriptor}]
[INFO] [install:install {execution: default-install}]
[INFO] Installing x:\slave\workspace\maven-plugins-UTs\jdk\java-5x\label\windows\trunk\pom.xml
to x:\slave\workspace\maven-plugins-UTs\jdk\java-5x\label\windows\.repository\org\apache\maven\plugins\maven-plugins-aggregator\1-SNAPSHOT\maven-plugins-aggregator-1-SNAPSHOT.pom
[INFO] 
[INFO] 
[INFO] ------------------------------------------------------------------------
[INFO] Reactor Summary:
[INFO] ------------------------------------------------------------------------
[INFO] Maven Plugins ......................................... SUCCESS [10.391s]
[INFO] Maven ACR Plugin ...................................... SUCCESS [8.035s]
[INFO] Maven Ant Plugin ...................................... SUCCESS [9.093s]
[INFO] Maven AntRun Plugin ................................... SUCCESS [2.542s]
[INFO] Maven Eclipse Plugin .................................. SUCCESS [25.009s]
[INFO] Maven Changelog Plugin ................................ SUCCESS [8.740s]
[INFO] Maven Changes Report Plugin ........................... SUCCESS [8.972s]
[INFO] Maven Checkstyle Plugin ............................... SUCCESS [16.557s]
[INFO] Maven Clean Plugin .................................... SUCCESS [3.473s]
[INFO] Maven Compiler Plugin ................................. SUCCESS [10.526s]
[INFO] Maven Dependency Plugin ............................... FAILED [56.262s]
[INFO] Maven Deploy Plugin ................................... SUCCESS [5.976s]
[INFO] Maven DOAP Plugin ..................................... SUCCESS [15.821s]
[INFO] Maven Documentation Checker Plugin .................... SUCCESS [1.811s]
[INFO] Maven EAR Plugin ...................................... SUCCESS [5.428s]
[INFO] Maven EJB Plugin ...................................... SUCCESS [4.773s]
[INFO] Maven GPG Plugin ...................................... SUCCESS [1.401s]
[INFO] Maven Help Plugin ..................................... SUCCESS [3.763s]
[INFO] Maven IDEA Plugin ..................................... SUCCESS [12.912s]
[INFO] Maven Install Plugin .................................. SUCCESS [5.843s]
[INFO] Maven JAR Plugin ...................................... SUCCESS [2.666s]
[INFO] Maven Jarsigner Plugin ................................ SUCCESS [1.418s]
[INFO] Maven Shade Plugin .................................... SUCCESS [8.161s]
[INFO] Maven Javadoc Plugin .................................. SUCCESS [4:15.109s]
[INFO] Maven Linkcheck Plugin ................................ SUCCESS [2.750s]
[INFO] Maven One Plugin ...................................... SUCCESS [4.641s]
[INFO] Maven Patch Plugin .................................... SUCCESS [0.937s]
[INFO] Maven PDF Plugin ...................................... SUCCESS [14.797s]
[INFO] Maven PMD Plugin ...................................... SUCCESS [9.703s]
[INFO] Maven RAR Plugin ...................................... SUCCESS [2.391s]
[INFO] Maven Reactor Plugin .................................. SUCCESS [4.375s]
[INFO] Maven Repository Plugin ............................... SUCCESS [5.750s]
[INFO] Maven Resources Plugin ................................ SUCCESS [4.937s]
[INFO] Maven Site Plugin ..................................... SUCCESS [9.375s]
[INFO] Maven Source Plugin ................................... SUCCESS [5.360s]
[INFO] Maven Stage Plugin .................................... SUCCESS [2.062s]
[INFO] Maven Toolchains Plugin ............................... SUCCESS [1.594s]
[INFO] Maven Verifier Plugin ................................. SUCCESS [1.859s]
[INFO] Maven WAR Plugin ...................................... SUCCESS [11.313s]
[INFO] Maven Plugins Aggregator .............................. SUCCESS [0.031s]
[INFO] ------------------------------------------------------------------------
[INFO] Error for project: Maven Dependency Plugin (during install)
[INFO] ------------------------------------------------------------------------
[INFO] There are test failures.

Please refer to X:\slave\workspace\maven-plugins-UTs\jdk\java-5x\label\windows\trunk\maven-dependency-plugin\target\surefire-reports
for the individual test results.
[INFO] ------------------------------------------------------------------------
[INFO] Trace
org.apache.maven.BuildFailureException: There are test failures.

Please refer to X:\slave\workspace\maven-plugins-UTs\jdk\java-5x\label\windows\trunk\maven-dependency-plugin\target\surefire-reports
for the individual test results.
	at org.apache.maven.lifecycle.DefaultLifecycleExecutor.executeGoals(DefaultLifecycleExecutor.java:715)
	at org.apache.maven.lifecycle.DefaultLifecycleExecutor.executeGoalWithLifecycle(DefaultLifecycleExecutor.java:556)
	at org.apache.maven.lifecycle.DefaultLifecycleExecutor.executeGoal(DefaultLifecycleExecutor.java:535)
	at org.apache.maven.lifecycle.DefaultLifecycleExecutor.executeGoalAndHandleFailures(DefaultLifecycleExecutor.java:387)
	at org.apache.maven.lifecycle.DefaultLifecycleExecutor.executeTaskSegments(DefaultLifecycleExecutor.java:348)
	at org.apache.maven.lifecycle.DefaultLifecycleExecutor.execute(DefaultLifecycleExecutor.java:180)
	at org.apache.maven.DefaultMaven.doExecute(DefaultMaven.java:328)
	at org.apache.maven.DefaultMaven.execute(DefaultMaven.java:138)
	at org.apache.maven.cli.MavenCli.main(MavenCli.java:362)
	at org.apache.maven.cli.compat.CompatibleMain.main(CompatibleMain.java:60)
	at sun.reflect.NativeMethodAccessorImpl.invoke0(Native Method)
	at sun.reflect.NativeMethodAccessorImpl.invoke(NativeMethodAccessorImpl.java:39)
	at sun.reflect.DelegatingMethodAccessorImpl.invoke(DelegatingMethodAccessorImpl.java:25)
	at java.lang.reflect.Method.invoke(Method.java:592)
	at org.codehaus.classworlds.Launcher.launchEnhanced(Launcher.java:315)
	at org.codehaus.classworlds.Launcher.launch(Launcher.java:255)
	at org.codehaus.classworlds.Launcher.mainWithExitCode(Launcher.java:430)
	at org.codehaus.classworlds.Launcher.main(Launcher.java:375)
Caused by: org.apache.maven.plugin.MojoFailureException: There are test failures.

Please refer to X:\slave\workspace\maven-plugins-UTs\jdk\java-5x\label\windows\trunk\maven-dependency-plugin\target\surefire-reports
for the individual test results.
	at org.apache.maven.plugin.surefire.SurefireHelper.reportExecution(SurefireHelper.java:74)
	at org.apache.maven.plugin.surefire.SurefirePlugin.execute(SurefirePlugin.java:642)
	at org.apache.maven.plugin.DefaultPluginManager.executeMojo(DefaultPluginManager.java:490)
	at org.apache.maven.lifecycle.DefaultLifecycleExecutor.executeGoals(DefaultLifecycleExecutor.java:694)
	... 17 more
[INFO] ------------------------------------------------------------------------
[INFO] BUILD ERRORS
[INFO] ------------------------------------------------------------------------
[INFO] Total time: 9 minutes 28 seconds
[INFO] Finished at: Thu Mar 31 16:20:03 PDT 2011
[INFO] Final Memory: 104M/187M
[INFO] ------------------------------------------------------------------------


Mime
View raw message