maven-notifications mailing list archives

Site index · List index
Message view « Date » · « Thread »
Top « Date » · « Thread »
From "GRiD .ORG" <bui...@lists.sonatype.com>
Subject Build failed in Hudson: surefire » java-5x,windows #236
Date Wed, 16 Feb 2011 23:15:45 GMT
See <https://grid.sonatype.org/ci/job/surefire/./jdk=java-5x,label=windows/236/changes>

Changes:

[Kristian Rosenvold] [SUREFIRE-700] Isolate surefire from itself

o Introduces a third classloader that is parent of
testClassLoader and providerClassLoader.

In this case, providerClassLoader is totatlly
unrelated to the testClassLoader, which
increases isolation.

API and booter module are still shared
Only active when forking with manifest-only-jar

------------------------------------------
[...truncated 726 lines...]
[INFO] Deleting X:\slave\workspace\surefire\jdk\java-5x\label\windows\trunk\surefire-integration-tests\target
[INFO] [enforcer:enforce {execution: require-maven-2.1.0}]
[INFO] [remote-resources:process {execution: default}]
[INFO] [resources:resources {execution: default-resources}]
[INFO] Using 'UTF-8' encoding to copy filtered resources.
[INFO] skip non existing resourceDirectory X:\slave\workspace\surefire\jdk\java-5x\label\windows\trunk\surefire-integration-tests\src\main\resources
[INFO] Copying 3 resources
[INFO] [compiler:compile {execution: default-compile}]
[INFO] No sources to compile
[INFO] [help:effective-settings {execution: settings.xml}]
[INFO] Effective-settings written to: X:\slave\workspace\surefire\jdk\java-5x\label\windows\trunk\surefire-integration-tests\target\private\settings.xml
[INFO] [resources:testResources {execution: default-testResources}]
[INFO] Using 'UTF-8' encoding to copy filtered resources.
[INFO] Copying 224 resources
[INFO] Copying 3 resources
[INFO] [compiler:testCompile {execution: default-testCompile}]
[INFO] Compiling 75 source files to X:\slave\workspace\surefire\jdk\java-5x\label\windows\trunk\surefire-integration-tests\target\test-classes
[WARNING] DEPRECATED [systemProperties]: Use systemPropertyVariables instead.
[INFO] [surefire:test {execution: default-test}]
[INFO] Surefire report directory: X:\slave\workspace\surefire\jdk\java-5x\label\windows\trunk\surefire-integration-tests\target\surefire-reports

-------------------------------------------------------
 T E S T S
-------------------------------------------------------
Running org.apache.maven.surefire.its.SetUpForIntegrationTest
Tests run: 1, Failures: 0, Errors: 0, Skipped: 0, Time elapsed: 0.068 sec

Results :

Tests run: 1, Failures: 0, Errors: 0, Skipped: 0

[INFO] [jar:jar {execution: default-jar}]
[INFO] Building jar: X:\slave\workspace\surefire\jdk\java-5x\label\windows\trunk\surefire-integration-tests\target\surefire-integration-tests-2.7.3-SNAPSHOT.jar
[INFO] [invoker:install {execution: default}]
[INFO] Installing X:\slave\workspace\surefire\jdk\java-5x\label\windows\trunk\maven-surefire-report-plugin\pom.xml
to X:\slave\workspace\surefire\jdk\java-5x\label\windows\trunk\surefire-integration-tests\target\it-repo\org\apache\maven\plugins\maven-surefire-report-plugin\2.7.3-SNAPSHOT\maven-surefire-report-plugin-2.7.3-SNAPSHOT.pom
[INFO] Installing X:\slave\workspace\surefire\jdk\java-5x\label\windows\trunk\maven-surefire-report-plugin\target\maven-surefire-report-plugin-2.7.3-SNAPSHOT.jar
to X:\slave\workspace\surefire\jdk\java-5x\label\windows\trunk\surefire-integration-tests\target\it-repo\org\apache\maven\plugins\maven-surefire-report-plugin\2.7.3-SNAPSHOT\maven-surefire-report-plugin-2.7.3-20110216.230218-8.jar
[INFO] Installing x:\slave\workspace\surefire\jdk\java-5x\label\windows\trunk\pom.xml to X:\slave\workspace\surefire\jdk\java-5x\label\windows\trunk\surefire-integration-tests\target\it-repo\org\apache\maven\surefire\surefire\2.7.3-SNAPSHOT\surefire-2.7.3-20110216.230218-8.pom
[INFO] Installing X:\slave\workspace\surefire\jdk\java-5x\label\windows\trunk\maven-surefire-plugin\pom.xml
to X:\slave\workspace\surefire\jdk\java-5x\label\windows\trunk\surefire-integration-tests\target\it-repo\org\apache\maven\plugins\maven-surefire-plugin\2.7.3-SNAPSHOT\maven-surefire-plugin-2.7.3-SNAPSHOT.pom
[INFO] Installing X:\slave\workspace\surefire\jdk\java-5x\label\windows\trunk\maven-surefire-plugin\target\maven-surefire-plugin-2.7.3-SNAPSHOT.jar
to X:\slave\workspace\surefire\jdk\java-5x\label\windows\trunk\surefire-integration-tests\target\it-repo\org\apache\maven\plugins\maven-surefire-plugin\2.7.3-SNAPSHOT\maven-surefire-plugin-2.7.3-20110216.230218-8.jar
[INFO] Installing X:\slave\workspace\surefire\jdk\java-5x\label\windows\trunk\surefire-booter\pom.xml
to X:\slave\workspace\surefire\jdk\java-5x\label\windows\trunk\surefire-integration-tests\target\it-repo\org\apache\maven\surefire\surefire-booter\2.7.3-SNAPSHOT\surefire-booter-2.7.3-SNAPSHOT.pom
[INFO] Installing X:\slave\workspace\surefire\jdk\java-5x\label\windows\trunk\surefire-booter\target\surefire-booter-2.7.3-SNAPSHOT.jar
to X:\slave\workspace\surefire\jdk\java-5x\label\windows\trunk\surefire-integration-tests\target\it-repo\org\apache\maven\surefire\surefire-booter\2.7.3-SNAPSHOT\surefire-booter-2.7.3-20110216.230218-8.jar
[INFO] Installing X:\slave\workspace\surefire\jdk\java-5x\label\windows\trunk\surefire-api\dependency-reduced-pom.xml
to X:\slave\workspace\surefire\jdk\java-5x\label\windows\trunk\surefire-integration-tests\target\it-repo\org\apache\maven\surefire\surefire-api\2.7.3-SNAPSHOT\surefire-api-2.7.3-SNAPSHOT.pom
[INFO] Installing X:\slave\workspace\surefire\jdk\java-5x\label\windows\trunk\surefire-api\target\surefire-api-2.7.3-SNAPSHOT.jar
to X:\slave\workspace\surefire\jdk\java-5x\label\windows\trunk\surefire-integration-tests\target\it-repo\org\apache\maven\surefire\surefire-api\2.7.3-SNAPSHOT\surefire-api-2.7.3-20110216.230218-8.jar
[INFO] Installing X:\slave\workspace\surefire\jdk\java-5x\label\windows\trunk\maven-surefire-common\pom.xml
to X:\slave\workspace\surefire\jdk\java-5x\label\windows\trunk\surefire-integration-tests\target\it-repo\org\apache\maven\surefire\maven-surefire-common\2.7.3-SNAPSHOT\maven-surefire-common-2.7.3-SNAPSHOT.pom
[INFO] Installing X:\slave\workspace\surefire\jdk\java-5x\label\windows\trunk\maven-surefire-common\target\maven-surefire-common-2.7.3-SNAPSHOT.jar
to X:\slave\workspace\surefire\jdk\java-5x\label\windows\trunk\surefire-integration-tests\target\it-repo\org\apache\maven\surefire\maven-surefire-common\2.7.3-SNAPSHOT\maven-surefire-common-2.7.3-20110216.230218-8.jar
[INFO] Installing X:\slave\workspace\surefire\jdk\java-5x\label\windows\trunk\surefire-providers\surefire-testng\pom.xml
to X:\slave\workspace\surefire\jdk\java-5x\label\windows\trunk\surefire-integration-tests\target\it-repo\org\apache\maven\surefire\surefire-testng\2.7.3-SNAPSHOT\surefire-testng-2.7.3-SNAPSHOT.pom
[INFO] Installing X:\slave\workspace\surefire\jdk\java-5x\label\windows\trunk\surefire-providers\surefire-testng\target\surefire-testng-2.7.3-SNAPSHOT.jar
to X:\slave\workspace\surefire\jdk\java-5x\label\windows\trunk\surefire-integration-tests\target\it-repo\org\apache\maven\surefire\surefire-testng\2.7.3-SNAPSHOT\surefire-testng-2.7.3-20110216.230218-8.jar
[INFO] Installing X:\slave\workspace\surefire\jdk\java-5x\label\windows\trunk\surefire-providers\pom.xml
to X:\slave\workspace\surefire\jdk\java-5x\label\windows\trunk\surefire-integration-tests\target\it-repo\org\apache\maven\surefire\surefire-providers\2.7.3-SNAPSHOT\surefire-providers-2.7.3-20110216.230218-8.pom
[INFO] Installing X:\slave\workspace\surefire\jdk\java-5x\label\windows\trunk\surefire-providers\surefire-junit3\dependency-reduced-pom.xml
to X:\slave\workspace\surefire\jdk\java-5x\label\windows\trunk\surefire-integration-tests\target\it-repo\org\apache\maven\surefire\surefire-junit3\2.7.3-SNAPSHOT\surefire-junit3-2.7.3-SNAPSHOT.pom
[INFO] Installing X:\slave\workspace\surefire\jdk\java-5x\label\windows\trunk\surefire-providers\surefire-junit3\target\surefire-junit3-2.7.3-SNAPSHOT.jar
to X:\slave\workspace\surefire\jdk\java-5x\label\windows\trunk\surefire-integration-tests\target\it-repo\org\apache\maven\surefire\surefire-junit3\2.7.3-SNAPSHOT\surefire-junit3-2.7.3-20110216.230218-8.jar
[INFO] Installing X:\slave\workspace\surefire\jdk\java-5x\label\windows\trunk\surefire-providers\surefire-junit4\dependency-reduced-pom.xml
to X:\slave\workspace\surefire\jdk\java-5x\label\windows\trunk\surefire-integration-tests\target\it-repo\org\apache\maven\surefire\surefire-junit4\2.7.3-SNAPSHOT\surefire-junit4-2.7.3-SNAPSHOT.pom
[INFO] Installing X:\slave\workspace\surefire\jdk\java-5x\label\windows\trunk\surefire-providers\surefire-junit4\target\surefire-junit4-2.7.3-SNAPSHOT.jar
to X:\slave\workspace\surefire\jdk\java-5x\label\windows\trunk\surefire-integration-tests\target\it-repo\org\apache\maven\surefire\surefire-junit4\2.7.3-SNAPSHOT\surefire-junit4-2.7.3-20110216.230218-8.jar
[INFO] Installing X:\slave\workspace\surefire\jdk\java-5x\label\windows\trunk\surefire-providers\surefire-junit47\dependency-reduced-pom.xml
to X:\slave\workspace\surefire\jdk\java-5x\label\windows\trunk\surefire-integration-tests\target\it-repo\org\apache\maven\surefire\surefire-junit47\2.7.3-SNAPSHOT\surefire-junit47-2.7.3-SNAPSHOT.pom
[INFO] Installing X:\slave\workspace\surefire\jdk\java-5x\label\windows\trunk\surefire-providers\surefire-junit47\target\surefire-junit47-2.7.3-SNAPSHOT.jar
to X:\slave\workspace\surefire\jdk\java-5x\label\windows\trunk\surefire-integration-tests\target\it-repo\org\apache\maven\surefire\surefire-junit47\2.7.3-SNAPSHOT\surefire-junit47-2.7.3-20110216.230218-8.jar
[INFO] Installing X:\slave\workspace\surefire\jdk\java-5x\label\windows\trunk\surefire-integration-tests\pom.xml
to X:\slave\workspace\surefire\jdk\java-5x\label\windows\trunk\surefire-integration-tests\target\it-repo\org\apache\maven\surefire\surefire-integration-tests\2.7.3-SNAPSHOT\surefire-integration-tests-2.7.3-SNAPSHOT.pom
[INFO] Installing X:\slave\workspace\surefire\jdk\java-5x\label\windows\trunk\surefire-integration-tests\target\surefire-integration-tests-2.7.3-SNAPSHOT.jar
to X:\slave\workspace\surefire\jdk\java-5x\label\windows\trunk\surefire-integration-tests\target\it-repo\org\apache\maven\surefire\surefire-integration-tests\2.7.3-SNAPSHOT\surefire-integration-tests-2.7.3-SNAPSHOT.jar
[WARNING] DEPRECATED [systemProperties]: Use systemPropertyVariables instead.
[INFO] [failsafe:integration-test {execution: default}]
[INFO] Failsafe report directory: X:\slave\workspace\surefire\jdk\java-5x\label\windows\trunk\surefire-integration-tests\target\failsafe-reports

-------------------------------------------------------
 T E S T S
-------------------------------------------------------
Running org.apache.maven.surefire.its.AbstractTestCaseIT
Tests run: 1, Failures: 0, Errors: 0, Skipped: 0, Time elapsed: 11.512 sec
Running org.apache.maven.surefire.its.AdditionalClasspathIT
Tests run: 1, Failures: 0, Errors: 0, Skipped: 0, Time elapsed: 5.102 sec
Running org.apache.maven.surefire.its.AggregateReportIT
Tests run: 1, Failures: 0, Errors: 0, Skipped: 0, Time elapsed: 7.317 sec
Running org.apache.maven.surefire.its.ArgLineIT
Tests run: 1, Failures: 0, Errors: 0, Skipped: 0, Time elapsed: 4.656 sec
Running org.apache.maven.surefire.its.CheckSingleTestIT
Tests run: 4, Failures: 0, Errors: 0, Skipped: 0, Time elapsed: 20.56 sec
Running org.apache.maven.surefire.its.CheckTestFailIfNoTestsForkModeIT
Tests run: 6, Failures: 0, Errors: 0, Skipped: 0, Time elapsed: 26.562 sec
Running org.apache.maven.surefire.its.CheckTestFailIfNoTestsIT
Tests run: 2, Failures: 0, Errors: 0, Skipped: 0, Time elapsed: 7.055 sec
Running org.apache.maven.surefire.its.CheckTestNgBeforeMethodFailureIT
Tests run: 1, Failures: 0, Errors: 0, Skipped: 0, Time elapsed: 4.822 sec
Running org.apache.maven.surefire.its.CheckTestNgBeforeMethodIT
Tests run: 1, Failures: 0, Errors: 0, Skipped: 0, Time elapsed: 4.939 sec
Running org.apache.maven.surefire.its.CheckTestNgExecuteErrorIT
Tests run: 1, Failures: 0, Errors: 0, Skipped: 0, Time elapsed: 4.728 sec
Running org.apache.maven.surefire.its.CheckTestNgGroupThreadParallelIT
Tests run: 1, Failures: 0, Errors: 0, Skipped: 0, Time elapsed: 4.944 sec
Running org.apache.maven.surefire.its.CheckTestNgJdk14IT
Tests run: 1, Failures: 0, Errors: 0, Skipped: 0, Time elapsed: 5.241 sec
Running org.apache.maven.surefire.its.CheckTestNgListenerReporterIT
Tests run: 1, Failures: 0, Errors: 0, Skipped: 0, Time elapsed: 4.871 sec
Running org.apache.maven.surefire.its.CheckTestNgPathWithSpacesIT
Tests run: 1, Failures: 0, Errors: 0, Skipped: 0, Time elapsed: 5.45 sec
Running org.apache.maven.surefire.its.CheckTestNgReportTestIT
Tests run: 1, Failures: 0, Errors: 0, Skipped: 0, Time elapsed: 14.419 sec
Running org.apache.maven.surefire.its.CheckTestNgSuiteXmlIT
Tests run: 2, Failures: 0, Errors: 0, Skipped: 0, Time elapsed: 11.203 sec
Running org.apache.maven.surefire.its.CheckTestNgSuiteXmlSingleIT
Tests run: 1, Failures: 0, Errors: 0, Skipped: 0, Time elapsed: 6.507 sec
Running org.apache.maven.surefire.its.CheckTestNgVersionsIT
Tests run: 16, Failures: 0, Errors: 0, Skipped: 0, Time elapsed: 91.664 sec
Running org.apache.maven.surefire.its.ClasspathFilteringIT
Tests run: 1, Failures: 0, Errors: 0, Skipped: 0, Time elapsed: 6.559 sec
Running org.apache.maven.surefire.its.ClassPathOrderIT
Tests run: 1, Failures: 0, Errors: 0, Skipped: 0, Time elapsed: 5.186 sec
Running org.apache.maven.surefire.its.ClasspathScopeFilteringIT
Tests run: 1, Failures: 0, Errors: 0, Skipped: 0, Time elapsed: 4.831 sec
Running org.apache.maven.surefire.its.DefaultConfigurationIT
Tests run: 1, Failures: 0, Errors: 0, Skipped: 0, Time elapsed: 5.213 sec
Running org.apache.maven.surefire.its.EnvironmentVariableIT
Tests run: 1, Failures: 0, Errors: 0, Skipped: 0, Time elapsed: 5.436 sec
Running org.apache.maven.surefire.its.ForkConsoleOutputIT
Tests run: 4, Failures: 0, Errors: 0, Skipped: 0, Time elapsed: 22.723 sec
Running org.apache.maven.surefire.its.ForkModeIT
Tests run: 5, Failures: 0, Errors: 0, Skipped: 0, Time elapsed: 24.141 sec
Running org.apache.maven.surefire.its.IncludesExcludesIT
Tests run: 1, Failures: 0, Errors: 0, Skipped: 0, Time elapsed: 5.797 sec
Running org.apache.maven.surefire.its.JUnit44HamcrestIT
Tests run: 1, Failures: 0, Errors: 0, Skipped: 0, Time elapsed: 5.646 sec
Running org.apache.maven.surefire.its.Junit47concurrencyIT
Tests run: 1, Failures: 0, Errors: 0, Skipped: 0, Time elapsed: 10.628 sec
Running org.apache.maven.surefire.its.JUnit4ForkAlwaysStaticInitPollutionIT
Tests run: 1, Failures: 0, Errors: 0, Skipped: 0, Time elapsed: 7.346 sec
Running org.apache.maven.surefire.its.Junit4IgnoreIT
Tests run: 1, Failures: 0, Errors: 0, Skipped: 0, Time elapsed: 5.367 sec
Running org.apache.maven.surefire.its.JUnit4RunListenerIT
Tests run: 2, Failures: 0, Errors: 0, Skipped: 0, Time elapsed: 11.241 sec
Running org.apache.maven.surefire.its.Junit4VersionsIT
Tests run: 9, Failures: 0, Errors: 0, Skipped: 0, Time elapsed: 53.792 sec
Running org.apache.maven.surefire.its.JUnitDepIT
Tests run: 3, Failures: 0, Errors: 0, Skipped: 0, Time elapsed: 17.732 sec
Running org.apache.maven.surefire.its.NoRunnableTestsInClassIT
Tests run: 1, Failures: 0, Errors: 0, Skipped: 0, Time elapsed: 5.34 sec
Running org.apache.maven.surefire.its.PlainOldJavaClasspathIT
Tests run: 1, Failures: 0, Errors: 0, Skipped: 0, Time elapsed: 5.294 sec
Running org.apache.maven.surefire.its.PlexusConflictIT
Tests run: 2, Failures: 0, Errors: 0, Skipped: 0, Time elapsed: 10.179 sec
Running org.apache.maven.surefire.its.PojoSimpleIT
Tests run: 1, Failures: 0, Errors: 0, Skipped: 0, Time elapsed: 4.608 sec
Running org.apache.maven.surefire.its.ReportersIT
Tests run: 1, Failures: 0, Errors: 0, Skipped: 0, Time elapsed: 5.578 sec
Running org.apache.maven.surefire.its.ResultCountingIT
Tests run: 3, Failures: 0, Errors: 0, Skipped: 0, Time elapsed: 16.025 sec
Running org.apache.maven.surefire.its.RunOrderIT
Tests run: 3, Failures: 0, Errors: 0, Skipped: 0, Time elapsed: 14.984 sec
Running org.apache.maven.surefire.its.SiblingAggregatorIT
Tests run: 1, Failures: 0, Errors: 0, Skipped: 0, Time elapsed: 6.063 sec
Running org.apache.maven.surefire.its.Surefire141PluggableProvidersIT
Tests run: 1, Failures: 0, Errors: 0, Skipped: 0, Time elapsed: 9.956 sec
Running org.apache.maven.surefire.its.Surefire146ForkPerTestNoSetupIT
Tests run: 1, Failures: 0, Errors: 0, Skipped: 0, Time elapsed: 5.659 sec
Running org.apache.maven.surefire.its.Surefire162CharsetProviderIT
Tests run: 1, Failures: 0, Errors: 0, Skipped: 0, Time elapsed: 5.477 sec
Running org.apache.maven.surefire.its.Surefire224WellFormedXmlFailuresIT
Tests run: 1, Failures: 0, Errors: 0, Skipped: 0, Time elapsed: 5.246 sec
Running org.apache.maven.surefire.its.Surefire257NotRerunningTestsIT
Tests run: 1, Failures: 0, Errors: 0, Skipped: 0, Time elapsed: 34.535 sec
Running org.apache.maven.surefire.its.Surefire260TestWithIdenticalNamesIT
Tests run: 1, Failures: 0, Errors: 0, Skipped: 0, Time elapsed: 14.152 sec
Running org.apache.maven.surefire.its.Surefire377TestNgAndJUnitTogetherIT
Tests run: 1, Failures: 0, Errors: 0, Skipped: 0, Time elapsed: 6.031 sec
Running org.apache.maven.surefire.its.Surefire408ManualProviderSelectionIT
Tests run: 1, Failures: 0, Errors: 0, Skipped: 0, Time elapsed: 5.467 sec
Running org.apache.maven.surefire.its.Surefire42NotExtendingTestCaseIT
Tests run: 1, Failures: 0, Errors: 0, Skipped: 0, Time elapsed: 5.336 sec
Running org.apache.maven.surefire.its.Surefire44InnerClassTestIT
Tests run: 1, Failures: 0, Errors: 0, Skipped: 0, Time elapsed: 6.026 sec
Running org.apache.maven.surefire.its.Surefire500PuzzlingErrorIT
Tests run: 1, Failures: 0, Errors: 0, Skipped: 0, Time elapsed: 5.999 sec
Running org.apache.maven.surefire.its.Surefire510TestClassPathForkModesIT
Tests run: 2, Failures: 0, Errors: 0, Skipped: 0, Time elapsed: 13.113 sec
Running org.apache.maven.surefire.its.Surefire570MultipleReportDirectoriesIT
Tests run: 1, Failures: 0, Errors: 0, Skipped: 0, Time elapsed: 19.65 sec
Running org.apache.maven.surefire.its.Surefire613TestCountInParallelIT
Tests run: 1, Failures: 0, Errors: 0, Skipped: 0, Time elapsed: 5.576 sec
Running org.apache.maven.surefire.its.Surefire621TestCountingJunit3InParallelIT
Tests run: 1, Failures: 1, Errors: 0, Skipped: 0, Time elapsed: 6.473 sec <<< FAILURE!
Running org.apache.maven.surefire.its.Surefire628ConsoleOutputBeforeAndAfterClassIT
Tests run: 1, Failures: 0, Errors: 0, Skipped: 0, Time elapsed: 5.348 sec
Running org.apache.maven.surefire.its.Surefire673MockitoIT
Tests run: 1, Failures: 0, Errors: 0, Skipped: 0, Time elapsed: 5.793 sec
Running org.apache.maven.surefire.its.Surefire674BuildFailingWhenErrorsIT
Tests run: 1, Failures: 0, Errors: 0, Skipped: 0, Time elapsed: 5.287 sec
Running org.apache.maven.surefire.its.Surefire685CommaSeparatedIncludesIT
Tests run: 1, Failures: 0, Errors: 0, Skipped: 0, Time elapsed: 5.288 sec
Running org.apache.maven.surefire.its.SystemPropertiesTestIT
Tests run: 2, Failures: 0, Errors: 0, Skipped: 0, Time elapsed: 11.362 sec
Running org.apache.maven.surefire.its.TimeoutForkedTestIT
Tests run: 1, Failures: 0, Errors: 0, Skipped: 0, Time elapsed: 2.939 sec
Running org.apache.maven.surefire.its.TwoTestCasesIT
Tests run: 4, Failures: 0, Errors: 0, Skipped: 0, Time elapsed: 20.515 sec
Running org.apache.maven.surefire.its.UmlautDirIT
Tests run: 2, Failures: 0, Errors: 0, Skipped: 0, Time elapsed: 9.207 sec
Running org.apache.maven.surefire.its.UseIsolatedClassLoaderIT
Tests run: 1, Failures: 0, Errors: 0, Skipped: 0, Time elapsed: 5.19 sec
Running org.apache.maven.surefire.its.WorkingDirectoryIT
Tests run: 4, Failures: 0, Errors: 0, Skipped: 0, Time elapsed: 14.997 sec
Running org.apache.maven.surefire.its.WorkingDirectoryMissingIT
Tests run: 1, Failures: 0, Errors: 0, Skipped: 0, Time elapsed: 4.721 sec

Results :

Failed tests: 
  testJunit3ParallelBuildResultCount(org.apache.maven.surefire.its.Surefire621TestCountingJunit3InParallelIT):
No reports!

Tests run: 124, Failures: 1, Errors: 0, Skipped: 0

[INFO] [failsafe:verify {execution: default}]
[INFO] Failsafe report directory: X:\slave\workspace\surefire\jdk\java-5x\label\windows\trunk\surefire-integration-tests\target\failsafe-reports
[INFO] ------------------------------------------------------------------------
[ERROR] BUILD FAILURE
[INFO] ------------------------------------------------------------------------
[INFO] There are test failures.

Please refer to X:\slave\workspace\surefire\jdk\java-5x\label\windows\trunk\surefire-integration-tests\target\failsafe-reports
for the individual test results.
[INFO] ------------------------------------------------------------------------
[INFO] Trace
org.apache.maven.BuildFailureException: There are test failures.

Please refer to X:\slave\workspace\surefire\jdk\java-5x\label\windows\trunk\surefire-integration-tests\target\failsafe-reports
for the individual test results.
	at org.apache.maven.lifecycle.DefaultLifecycleExecutor.executeGoals(DefaultLifecycleExecutor.java:715)
	at org.apache.maven.lifecycle.DefaultLifecycleExecutor.executeGoalWithLifecycle(DefaultLifecycleExecutor.java:556)
	at org.apache.maven.lifecycle.DefaultLifecycleExecutor.executeGoal(DefaultLifecycleExecutor.java:535)
	at org.apache.maven.lifecycle.DefaultLifecycleExecutor.executeGoalAndHandleFailures(DefaultLifecycleExecutor.java:387)
	at org.apache.maven.lifecycle.DefaultLifecycleExecutor.executeTaskSegments(DefaultLifecycleExecutor.java:348)
	at org.apache.maven.lifecycle.DefaultLifecycleExecutor.execute(DefaultLifecycleExecutor.java:180)
	at org.apache.maven.DefaultMaven.doExecute(DefaultMaven.java:328)
	at org.apache.maven.DefaultMaven.execute(DefaultMaven.java:138)
	at org.apache.maven.cli.MavenCli.main(MavenCli.java:362)
	at org.apache.maven.cli.compat.CompatibleMain.main(CompatibleMain.java:60)
	at sun.reflect.NativeMethodAccessorImpl.invoke0(Native Method)
	at sun.reflect.NativeMethodAccessorImpl.invoke(NativeMethodAccessorImpl.java:39)
	at sun.reflect.DelegatingMethodAccessorImpl.invoke(DelegatingMethodAccessorImpl.java:25)
	at java.lang.reflect.Method.invoke(Method.java:592)
	at org.codehaus.classworlds.Launcher.launchEnhanced(Launcher.java:315)
	at org.codehaus.classworlds.Launcher.launch(Launcher.java:255)
	at org.codehaus.classworlds.Launcher.mainWithExitCode(Launcher.java:430)
	at org.codehaus.classworlds.Launcher.main(Launcher.java:375)
Caused by: org.apache.maven.plugin.MojoFailureException: There are test failures.

Please refer to X:\slave\workspace\surefire\jdk\java-5x\label\windows\trunk\surefire-integration-tests\target\failsafe-reports
for the individual test results.
	at org.apache.maven.plugin.surefire.SurefireHelper.reportExecution(SurefireHelper.java:74)
	at org.apache.maven.plugin.failsafe.VerifyMojo.execute(VerifyMojo.java:205)
	at org.apache.maven.plugin.DefaultPluginManager.executeMojo(DefaultPluginManager.java:490)
	at org.apache.maven.lifecycle.DefaultLifecycleExecutor.executeGoals(DefaultLifecycleExecutor.java:694)
	... 17 more
[INFO] ------------------------------------------------------------------------
[INFO] Total time: 13 minutes 33 seconds
[INFO] Finished at: Wed Feb 16 15:15:43 PST 2011
[INFO] Final Memory: 47M/63M
[INFO] ------------------------------------------------------------------------


Mime
View raw message