maven-notifications mailing list archives

Site index · List index
Message view « Date » · « Thread »
Top « Date » · « Thread »
From "GRiD .ORG" <bui...@lists.sonatype.com>
Subject Build failed in Hudson: maven-scm » java-5x,windows #181
Date Mon, 03 Jan 2011 22:39:37 GMT
See <https://grid.sonatype.org/ci/job/maven-scm/./jdk=java-5x,label=windows/181/changes>

Changes:

[Olivier Lamy] [SCM-591] move to Java 1.5 : edit command

[Olivier Lamy] [SCM-591] move to Java 1.5 : diff command

[Olivier Lamy] [SCM-591] move to Java 1.5 : checkout command

------------------------------------------
[...truncated 3242 lines...]
[INFO] Maven SCM CVS Provider - Parent ................... SUCCESS [0.270s]
[INFO] Maven SCM CVS Provider TCK tests .................. SUCCESS [1.953s]
[INFO] Maven SCM CVS Provider - Common library ........... SUCCESS [5.047s]
[INFO] Maven SCM CVS Provider - CVS Executable Impl. ..... FAILURE [4.986s]
[INFO] Maven SCM CVS Provider - CVS Java Impl. ........... FAILURE [6.564s]
[INFO] Maven SCM Mercurial (Hg) Provider ................. SUCCESS [2.872s]
[INFO] Maven SCM Git Provider - Parent ................... SUCCESS [0.245s]
[INFO] Maven SCM Git Provider - Common library ........... FAILURE [4.377s]
[INFO] Maven SCM git Provider TCK Tests .................. SUCCESS [1.600s]
[INFO] Maven SCM Git Provider - Git Executable Impl. ..... SKIPPED
[INFO] Maven SCM Local Provider .......................... SUCCESS [2.666s]
[INFO] Maven SCM Perforce Provider ....................... FAILURE [4.185s]
[INFO] Maven SCM Starteam Provider ....................... SUCCESS [6.345s]
[INFO] Maven SCM Subversion Provider - Parent ............ SUCCESS [0.234s]
[INFO] Maven SCM Subversion Provider - Common library .... SUCCESS [3.333s]
[INFO] Maven SCM Subversion Provider TCK Tests ........... SUCCESS [1.607s]
[INFO] Maven SCM Subversion Provider - SVN Executable Impl.  FAILURE [47.398s]
[INFO] Maven SCM Synergy Provider ........................ SUCCESS [4.997s]
[INFO] Maven SCM Visual Source Safe Provider ............. SUCCESS [4.622s]
[INFO] Maven SCM TFS Provider ............................ SUCCESS [3.136s]
[INFO] Maven SCM Standard Providers ...................... SKIPPED
[INFO] Maven SCM Client .................................. SKIPPED
[INFO] Maven SCM Plugin .................................. SKIPPED
[INFO] ------------------------------------------------------------------------
[INFO] BUILD FAILURE
[INFO] ------------------------------------------------------------------------
[INFO] Total time: 2:26.012s
[INFO] Finished at: Mon Jan 03 14:39:29 PST 2011
[INFO] Final Memory: 22M/46M
[INFO] ------------------------------------------------------------------------
[ERROR] Failed to execute goal org.apache.maven.plugins:maven-surefire-plugin:2.7.1:test (default-test)
on project maven-scm-provider-clearcase: There are test failures.
[ERROR] 
[ERROR] Please refer to X:\slave\workspace\maven-scm\jdk\java-5x\label\windows\trunk\maven-scm-providers\maven-scm-provider-clearcase\target\surefire-reports
for the individual test results.
[ERROR] -> [Help 1]
org.apache.maven.lifecycle.LifecycleExecutionException: Failed to execute goal org.apache.maven.plugins:maven-surefire-plugin:2.7.1:test
(default-test) on project maven-scm-provider-clearcase: There are test failures.

Please refer to X:\slave\workspace\maven-scm\jdk\java-5x\label\windows\trunk\maven-scm-providers\maven-scm-provider-clearcase\target\surefire-reports
for the individual test results.
	at org.apache.maven.lifecycle.internal.MojoExecutor.execute(MojoExecutor.java:199)
	at org.apache.maven.lifecycle.internal.MojoExecutor.execute(MojoExecutor.java:148)
	at org.apache.maven.lifecycle.internal.MojoExecutor.execute(MojoExecutor.java:140)
	at org.apache.maven.lifecycle.internal.LifecycleModuleBuilder.buildProject(LifecycleModuleBuilder.java:84)
	at org.apache.maven.lifecycle.internal.LifecycleModuleBuilder.buildProject(LifecycleModuleBuilder.java:59)
	at org.apache.maven.lifecycle.internal.LifecycleStarter.singleThreadedBuild(LifecycleStarter.java:183)
	at org.apache.maven.lifecycle.internal.LifecycleStarter.execute(LifecycleStarter.java:161)
	at org.apache.maven.DefaultMaven.doExecute(DefaultMaven.java:316)
	at org.apache.maven.DefaultMaven.execute(DefaultMaven.java:153)
	at org.apache.maven.cli.MavenCli.execute(MavenCli.java:451)
	at org.apache.maven.cli.MavenCli.doMain(MavenCli.java:188)
	at org.apache.maven.cli.MavenCli.main(MavenCli.java:134)
	at sun.reflect.NativeMethodAccessorImpl.invoke0(Native Method)
	at sun.reflect.NativeMethodAccessorImpl.invoke(NativeMethodAccessorImpl.java:39)
	at sun.reflect.DelegatingMethodAccessorImpl.invoke(DelegatingMethodAccessorImpl.java:25)
	at java.lang.reflect.Method.invoke(Method.java:592)
	at org.codehaus.plexus.classworlds.launcher.Launcher.launchEnhanced(Launcher.java:290)
	at org.codehaus.plexus.classworlds.launcher.Launcher.launch(Launcher.java:230)
	at org.codehaus.plexus.classworlds.launcher.Launcher.mainWithExitCode(Launcher.java:409)
	at org.codehaus.plexus.classworlds.launcher.Launcher.main(Launcher.java:352)
Caused by: org.apache.maven.plugin.MojoFailureException: There are test failures.

Please refer to X:\slave\workspace\maven-scm\jdk\java-5x\label\windows\trunk\maven-scm-providers\maven-scm-provider-clearcase\target\surefire-reports
for the individual test results.
	at org.apache.maven.plugin.surefire.SurefireHelper.reportExecution(SurefireHelper.java:74)
	at org.apache.maven.plugin.surefire.SurefirePlugin.execute(SurefirePlugin.java:631)
	at org.apache.maven.plugin.DefaultBuildPluginManager.executeMojo(DefaultBuildPluginManager.java:107)
	at org.apache.maven.lifecycle.internal.MojoExecutor.execute(MojoExecutor.java:195)
	... 19 more
[ERROR] Failed to execute goal org.apache.maven.plugins:maven-surefire-plugin:2.7.1:test (default-test)
on project maven-scm-provider-cvsexe: There are test failures.
[ERROR] 
[ERROR] Please refer to X:\slave\workspace\maven-scm\jdk\java-5x\label\windows\trunk\maven-scm-providers\maven-scm-providers-cvs\maven-scm-provider-cvsexe\target\surefire-reports
for the individual test results.
[ERROR] -> [Help 1]
org.apache.maven.lifecycle.LifecycleExecutionException: Failed to execute goal org.apache.maven.plugins:maven-surefire-plugin:2.7.1:test
(default-test) on project maven-scm-provider-cvsexe: There are test failures.

Please refer to X:\slave\workspace\maven-scm\jdk\java-5x\label\windows\trunk\maven-scm-providers\maven-scm-providers-cvs\maven-scm-provider-cvsexe\target\surefire-reports
for the individual test results.
	at org.apache.maven.lifecycle.internal.MojoExecutor.execute(MojoExecutor.java:199)
	at org.apache.maven.lifecycle.internal.MojoExecutor.execute(MojoExecutor.java:148)
	at org.apache.maven.lifecycle.internal.MojoExecutor.execute(MojoExecutor.java:140)
	at org.apache.maven.lifecycle.internal.LifecycleModuleBuilder.buildProject(LifecycleModuleBuilder.java:84)
	at org.apache.maven.lifecycle.internal.LifecycleModuleBuilder.buildProject(LifecycleModuleBuilder.java:59)
	at org.apache.maven.lifecycle.internal.LifecycleStarter.singleThreadedBuild(LifecycleStarter.java:183)
	at org.apache.maven.lifecycle.internal.LifecycleStarter.execute(LifecycleStarter.java:161)
	at org.apache.maven.DefaultMaven.doExecute(DefaultMaven.java:316)
	at org.apache.maven.DefaultMaven.execute(DefaultMaven.java:153)
	at org.apache.maven.cli.MavenCli.execute(MavenCli.java:451)
	at org.apache.maven.cli.MavenCli.doMain(MavenCli.java:188)
	at org.apache.maven.cli.MavenCli.main(MavenCli.java:134)
	at sun.reflect.NativeMethodAccessorImpl.invoke0(Native Method)
	at sun.reflect.NativeMethodAccessorImpl.invoke(NativeMethodAccessorImpl.java:39)
	at sun.reflect.DelegatingMethodAccessorImpl.invoke(DelegatingMethodAccessorImpl.java:25)
	at java.lang.reflect.Method.invoke(Method.java:592)
	at org.codehaus.plexus.classworlds.launcher.Launcher.launchEnhanced(Launcher.java:290)
	at org.codehaus.plexus.classworlds.launcher.Launcher.launch(Launcher.java:230)
	at org.codehaus.plexus.classworlds.launcher.Launcher.mainWithExitCode(Launcher.java:409)
	at org.codehaus.plexus.classworlds.launcher.Launcher.main(Launcher.java:352)
Caused by: org.apache.maven.plugin.MojoFailureException: There are test failures.

Please refer to X:\slave\workspace\maven-scm\jdk\java-5x\label\windows\trunk\maven-scm-providers\maven-scm-providers-cvs\maven-scm-provider-cvsexe\target\surefire-reports
for the individual test results.
	at org.apache.maven.plugin.surefire.SurefireHelper.reportExecution(SurefireHelper.java:74)
	at org.apache.maven.plugin.surefire.SurefirePlugin.execute(SurefirePlugin.java:631)
	at org.apache.maven.plugin.DefaultBuildPluginManager.executeMojo(DefaultBuildPluginManager.java:107)
	at org.apache.maven.lifecycle.internal.MojoExecutor.execute(MojoExecutor.java:195)
	... 19 more
[ERROR] Failed to execute goal org.apache.maven.plugins:maven-surefire-plugin:2.7.1:test (default-test)
on project maven-scm-provider-cvsjava: There are test failures.
[ERROR] 
[ERROR] Please refer to X:\slave\workspace\maven-scm\jdk\java-5x\label\windows\trunk\maven-scm-providers\maven-scm-providers-cvs\maven-scm-provider-cvsjava\target\surefire-reports
for the individual test results.
[ERROR] -> [Help 1]
org.apache.maven.lifecycle.LifecycleExecutionException: Failed to execute goal org.apache.maven.plugins:maven-surefire-plugin:2.7.1:test
(default-test) on project maven-scm-provider-cvsjava: There are test failures.

Please refer to X:\slave\workspace\maven-scm\jdk\java-5x\label\windows\trunk\maven-scm-providers\maven-scm-providers-cvs\maven-scm-provider-cvsjava\target\surefire-reports
for the individual test results.
	at org.apache.maven.lifecycle.internal.MojoExecutor.execute(MojoExecutor.java:199)
	at org.apache.maven.lifecycle.internal.MojoExecutor.execute(MojoExecutor.java:148)
	at org.apache.maven.lifecycle.internal.MojoExecutor.execute(MojoExecutor.java:140)
	at org.apache.maven.lifecycle.internal.LifecycleModuleBuilder.buildProject(LifecycleModuleBuilder.java:84)
	at org.apache.maven.lifecycle.internal.LifecycleModuleBuilder.buildProject(LifecycleModuleBuilder.java:59)
	at org.apache.maven.lifecycle.internal.LifecycleStarter.singleThreadedBuild(LifecycleStarter.java:183)
	at org.apache.maven.lifecycle.internal.LifecycleStarter.execute(LifecycleStarter.java:161)
	at org.apache.maven.DefaultMaven.doExecute(DefaultMaven.java:316)
	at org.apache.maven.DefaultMaven.execute(DefaultMaven.java:153)
	at org.apache.maven.cli.MavenCli.execute(MavenCli.java:451)
	at org.apache.maven.cli.MavenCli.doMain(MavenCli.java:188)
	at org.apache.maven.cli.MavenCli.main(MavenCli.java:134)
	at sun.reflect.NativeMethodAccessorImpl.invoke0(Native Method)
	at sun.reflect.NativeMethodAccessorImpl.invoke(NativeMethodAccessorImpl.java:39)
	at sun.reflect.DelegatingMethodAccessorImpl.invoke(DelegatingMethodAccessorImpl.java:25)
	at java.lang.reflect.Method.invoke(Method.java:592)
	at org.codehaus.plexus.classworlds.launcher.Launcher.launchEnhanced(Launcher.java:290)
	at org.codehaus.plexus.classworlds.launcher.Launcher.launch(Launcher.java:230)
	at org.codehaus.plexus.classworlds.launcher.Launcher.mainWithExitCode(Launcher.java:409)
	at org.codehaus.plexus.classworlds.launcher.Launcher.main(Launcher.java:352)
Caused by: org.apache.maven.plugin.MojoFailureException: There are test failures.

Please refer to X:\slave\workspace\maven-scm\jdk\java-5x\label\windows\trunk\maven-scm-providers\maven-scm-providers-cvs\maven-scm-provider-cvsjava\target\surefire-reports
for the individual test results.
	at org.apache.maven.plugin.surefire.SurefireHelper.reportExecution(SurefireHelper.java:74)
	at org.apache.maven.plugin.surefire.SurefirePlugin.execute(SurefirePlugin.java:631)
	at org.apache.maven.plugin.DefaultBuildPluginManager.executeMojo(DefaultBuildPluginManager.java:107)
	at org.apache.maven.lifecycle.internal.MojoExecutor.execute(MojoExecutor.java:195)
	... 19 more
[ERROR] Failed to execute goal org.apache.maven.plugins:maven-surefire-plugin:2.7.1:test (default-test)
on project maven-scm-provider-git-commons: There are test failures.
[ERROR] 
[ERROR] Please refer to X:\slave\workspace\maven-scm\jdk\java-5x\label\windows\trunk\maven-scm-providers\maven-scm-providers-git\maven-scm-provider-git-commons\target\surefire-reports
for the individual test results.
[ERROR] -> [Help 1]
org.apache.maven.lifecycle.LifecycleExecutionException: Failed to execute goal org.apache.maven.plugins:maven-surefire-plugin:2.7.1:test
(default-test) on project maven-scm-provider-git-commons: There are test failures.

Please refer to X:\slave\workspace\maven-scm\jdk\java-5x\label\windows\trunk\maven-scm-providers\maven-scm-providers-git\maven-scm-provider-git-commons\target\surefire-reports
for the individual test results.
	at org.apache.maven.lifecycle.internal.MojoExecutor.execute(MojoExecutor.java:199)
	at org.apache.maven.lifecycle.internal.MojoExecutor.execute(MojoExecutor.java:148)
	at org.apache.maven.lifecycle.internal.MojoExecutor.execute(MojoExecutor.java:140)
	at org.apache.maven.lifecycle.internal.LifecycleModuleBuilder.buildProject(LifecycleModuleBuilder.java:84)
	at org.apache.maven.lifecycle.internal.LifecycleModuleBuilder.buildProject(LifecycleModuleBuilder.java:59)
	at org.apache.maven.lifecycle.internal.LifecycleStarter.singleThreadedBuild(LifecycleStarter.java:183)
	at org.apache.maven.lifecycle.internal.LifecycleStarter.execute(LifecycleStarter.java:161)
	at org.apache.maven.DefaultMaven.doExecute(DefaultMaven.java:316)
	at org.apache.maven.DefaultMaven.execute(DefaultMaven.java:153)
	at org.apache.maven.cli.MavenCli.execute(MavenCli.java:451)
	at org.apache.maven.cli.MavenCli.doMain(MavenCli.java:188)
	at org.apache.maven.cli.MavenCli.main(MavenCli.java:134)
	at sun.reflect.NativeMethodAccessorImpl.invoke0(Native Method)
	at sun.reflect.NativeMethodAccessorImpl.invoke(NativeMethodAccessorImpl.java:39)
	at sun.reflect.DelegatingMethodAccessorImpl.invoke(DelegatingMethodAccessorImpl.java:25)
	at java.lang.reflect.Method.invoke(Method.java:592)
	at org.codehaus.plexus.classworlds.launcher.Launcher.launchEnhanced(Launcher.java:290)
	at org.codehaus.plexus.classworlds.launcher.Launcher.launch(Launcher.java:230)
	at org.codehaus.plexus.classworlds.launcher.Launcher.mainWithExitCode(Launcher.java:409)
	at org.codehaus.plexus.classworlds.launcher.Launcher.main(Launcher.java:352)
Caused by: org.apache.maven.plugin.MojoFailureException: There are test failures.

Please refer to X:\slave\workspace\maven-scm\jdk\java-5x\label\windows\trunk\maven-scm-providers\maven-scm-providers-git\maven-scm-provider-git-commons\target\surefire-reports
for the individual test results.
	at org.apache.maven.plugin.surefire.SurefireHelper.reportExecution(SurefireHelper.java:74)
	at org.apache.maven.plugin.surefire.SurefirePlugin.execute(SurefirePlugin.java:631)
	at org.apache.maven.plugin.DefaultBuildPluginManager.executeMojo(DefaultBuildPluginManager.java:107)
	at org.apache.maven.lifecycle.internal.MojoExecutor.execute(MojoExecutor.java:195)
	... 19 more
[ERROR] Failed to execute goal org.apache.maven.plugins:maven-surefire-plugin:2.7.1:test (default-test)
on project maven-scm-provider-perforce: There are test failures.
[ERROR] 
[ERROR] Please refer to X:\slave\workspace\maven-scm\jdk\java-5x\label\windows\trunk\maven-scm-providers\maven-scm-provider-perforce\target\surefire-reports
for the individual test results.
[ERROR] -> [Help 1]
org.apache.maven.lifecycle.LifecycleExecutionException: Failed to execute goal org.apache.maven.plugins:maven-surefire-plugin:2.7.1:test
(default-test) on project maven-scm-provider-perforce: There are test failures.

Please refer to X:\slave\workspace\maven-scm\jdk\java-5x\label\windows\trunk\maven-scm-providers\maven-scm-provider-perforce\target\surefire-reports
for the individual test results.
	at org.apache.maven.lifecycle.internal.MojoExecutor.execute(MojoExecutor.java:199)
	at org.apache.maven.lifecycle.internal.MojoExecutor.execute(MojoExecutor.java:148)
	at org.apache.maven.lifecycle.internal.MojoExecutor.execute(MojoExecutor.java:140)
	at org.apache.maven.lifecycle.internal.LifecycleModuleBuilder.buildProject(LifecycleModuleBuilder.java:84)
	at org.apache.maven.lifecycle.internal.LifecycleModuleBuilder.buildProject(LifecycleModuleBuilder.java:59)
	at org.apache.maven.lifecycle.internal.LifecycleStarter.singleThreadedBuild(LifecycleStarter.java:183)
	at org.apache.maven.lifecycle.internal.LifecycleStarter.execute(LifecycleStarter.java:161)
	at org.apache.maven.DefaultMaven.doExecute(DefaultMaven.java:316)
	at org.apache.maven.DefaultMaven.execute(DefaultMaven.java:153)
	at org.apache.maven.cli.MavenCli.execute(MavenCli.java:451)
	at org.apache.maven.cli.MavenCli.doMain(MavenCli.java:188)
	at org.apache.maven.cli.MavenCli.main(MavenCli.java:134)
	at sun.reflect.NativeMethodAccessorImpl.invoke0(Native Method)
	at sun.reflect.NativeMethodAccessorImpl.invoke(NativeMethodAccessorImpl.java:39)
	at sun.reflect.DelegatingMethodAccessorImpl.invoke(DelegatingMethodAccessorImpl.java:25)
	at java.lang.reflect.Method.invoke(Method.java:592)
	at org.codehaus.plexus.classworlds.launcher.Launcher.launchEnhanced(Launcher.java:290)
	at org.codehaus.plexus.classworlds.launcher.Launcher.launch(Launcher.java:230)
	at org.codehaus.plexus.classworlds.launcher.Launcher.mainWithExitCode(Launcher.java:409)
	at org.codehaus.plexus.classworlds.launcher.Launcher.main(Launcher.java:352)
Caused by: org.apache.maven.plugin.MojoFailureException: There are test failures.

Please refer to X:\slave\workspace\maven-scm\jdk\java-5x\label\windows\trunk\maven-scm-providers\maven-scm-provider-perforce\target\surefire-reports
for the individual test results.
	at org.apache.maven.plugin.surefire.SurefireHelper.reportExecution(SurefireHelper.java:74)
	at org.apache.maven.plugin.surefire.SurefirePlugin.execute(SurefirePlugin.java:631)
	at org.apache.maven.plugin.DefaultBuildPluginManager.executeMojo(DefaultBuildPluginManager.java:107)
	at org.apache.maven.lifecycle.internal.MojoExecutor.execute(MojoExecutor.java:195)
	... 19 more
[ERROR] Failed to execute goal org.apache.maven.plugins:maven-surefire-plugin:2.7.1:test (default-test)
on project maven-scm-provider-svnexe: There are test failures.
[ERROR] 
[ERROR] Please refer to X:\slave\workspace\maven-scm\jdk\java-5x\label\windows\trunk\maven-scm-providers\maven-scm-providers-svn\maven-scm-provider-svnexe\target\surefire-reports
for the individual test results.
[ERROR] -> [Help 1]
org.apache.maven.lifecycle.LifecycleExecutionException: Failed to execute goal org.apache.maven.plugins:maven-surefire-plugin:2.7.1:test
(default-test) on project maven-scm-provider-svnexe: There are test failures.

Please refer to X:\slave\workspace\maven-scm\jdk\java-5x\label\windows\trunk\maven-scm-providers\maven-scm-providers-svn\maven-scm-provider-svnexe\target\surefire-reports
for the individual test results.
	at org.apache.maven.lifecycle.internal.MojoExecutor.execute(MojoExecutor.java:199)
	at org.apache.maven.lifecycle.internal.MojoExecutor.execute(MojoExecutor.java:148)
	at org.apache.maven.lifecycle.internal.MojoExecutor.execute(MojoExecutor.java:140)
	at org.apache.maven.lifecycle.internal.LifecycleModuleBuilder.buildProject(LifecycleModuleBuilder.java:84)
	at org.apache.maven.lifecycle.internal.LifecycleModuleBuilder.buildProject(LifecycleModuleBuilder.java:59)
	at org.apache.maven.lifecycle.internal.LifecycleStarter.singleThreadedBuild(LifecycleStarter.java:183)
	at org.apache.maven.lifecycle.internal.LifecycleStarter.execute(LifecycleStarter.java:161)
	at org.apache.maven.DefaultMaven.doExecute(DefaultMaven.java:316)
	at org.apache.maven.DefaultMaven.execute(DefaultMaven.java:153)
	at org.apache.maven.cli.MavenCli.execute(MavenCli.java:451)
	at org.apache.maven.cli.MavenCli.doMain(MavenCli.java:188)
	at org.apache.maven.cli.MavenCli.main(MavenCli.java:134)
	at sun.reflect.NativeMethodAccessorImpl.invoke0(Native Method)
	at sun.reflect.NativeMethodAccessorImpl.invoke(NativeMethodAccessorImpl.java:39)
	at sun.reflect.DelegatingMethodAccessorImpl.invoke(DelegatingMethodAccessorImpl.java:25)
	at java.lang.reflect.Method.invoke(Method.java:592)
	at org.codehaus.plexus.classworlds.launcher.Launcher.launchEnhanced(Launcher.java:290)
	at org.codehaus.plexus.classworlds.launcher.Launcher.launch(Launcher.java:230)
	at org.codehaus.plexus.classworlds.launcher.Launcher.mainWithExitCode(Launcher.java:409)
	at org.codehaus.plexus.classworlds.launcher.Launcher.main(Launcher.java:352)
Caused by: org.apache.maven.plugin.MojoFailureException: There are test failures.

Please refer to X:\slave\workspace\maven-scm\jdk\java-5x\label\windows\trunk\maven-scm-providers\maven-scm-providers-svn\maven-scm-provider-svnexe\target\surefire-reports
for the individual test results.
	at org.apache.maven.plugin.surefire.SurefireHelper.reportExecution(SurefireHelper.java:74)
	at org.apache.maven.plugin.surefire.SurefirePlugin.execute(SurefirePlugin.java:631)
	at org.apache.maven.plugin.DefaultBuildPluginManager.executeMojo(DefaultBuildPluginManager.java:107)
	at org.apache.maven.lifecycle.internal.MojoExecutor.execute(MojoExecutor.java:195)
	... 19 more
[ERROR] 
[ERROR] Re-run Maven using the -X switch to enable full debug logging.
[ERROR] 
[ERROR] For more information about the errors and possible solutions, please read the following
articles:
[ERROR] [Help 1] http://cwiki.apache.org/confluence/display/MAVEN/MojoFailureException
[ERROR] 
[ERROR] After correcting the problems, you can resume the build with the command
[ERROR]   mvn <goals> -rf :maven-scm-provider-clearcase
Recording test results


Mime
View raw message