maven-notifications mailing list archives

Site index · List index
Message view « Date » · « Thread »
Top « Date » · « Thread »
From "GRiD .ORG" <bui...@lists.sonatype.com>
Subject Build failed in Hudson: maven-scm » java-5x,ubuntu #177
Date Sat, 01 Jan 2011 10:42:17 GMT
See <https://grid.sonatype.org/ci/job/maven-scm/./jdk=java-5x,label=ubuntu/177/changes>

Changes:

[Olivier Lamy] [SCM-591] move to Java 1.5

[Olivier Lamy] [SCM-591] move to Java 1.5

[Olivier Lamy] [SCM-591] move to Java 1.5
starting with add command.

------------------------------------------
[...truncated 2767 lines...]
[INFO] Compiling 9 source files to /opt/grid/slave/workspace/maven-scm/jdk/java-5x/label/ubuntu/trunk/maven-scm-providers/maven-scm-provider-vss/target/test-classes
[INFO] 
[INFO] --- maven-surefire-plugin:2.7.1:test (default-test) @ maven-scm-provider-vss ---
[INFO] Surefire report directory: /opt/grid/slave/workspace/maven-scm/jdk/java-5x/label/ubuntu/trunk/maven-scm-providers/maven-scm-provider-vss/target/surefire-reports

-------------------------------------------------------
 T E S T S
-------------------------------------------------------
Running org.apache.maven.scm.provider.vss.VssScmProviderTest
Tests run: 1, Failures: 0, Errors: 0, Skipped: 0, Time elapsed: 0.242 sec
Running org.apache.maven.scm.provider.vss.commands.add.VssAddCommandTest
Tests run: 2, Failures: 0, Errors: 0, Skipped: 0, Time elapsed: 0.075 sec
Running org.apache.maven.scm.provider.vss.commands.update.VssUpdateCommandTest
Tests run: 1, Failures: 0, Errors: 0, Skipped: 0, Time elapsed: 0.068 sec
Running org.apache.maven.scm.provider.vss.commands.edit.VssEditCommandTest
Tests run: 4, Failures: 0, Errors: 0, Skipped: 0, Time elapsed: 0.323 sec
Running org.apache.maven.scm.provider.vss.commands.status.VssStatusCommandTest
Tests run: 1, Failures: 0, Errors: 0, Skipped: 0, Time elapsed: 0.046 sec
Running org.apache.maven.scm.provider.vss.commands.status.VssStatusConsumerTest
Tests run: 1, Failures: 0, Errors: 0, Skipped: 0, Time elapsed: 0.026 sec
Running org.apache.maven.scm.provider.vss.commands.VssCommandLineUtilsTest
Tests run: 2, Failures: 0, Errors: 0, Skipped: 0, Time elapsed: 0.064 sec
Running org.apache.maven.scm.provider.vss.commands.changelog.VssHistoryCommandTest
Tests run: 1, Failures: 0, Errors: 0, Skipped: 0, Time elapsed: 0.042 sec
Running org.apache.maven.scm.provider.vss.commands.checkout.VssCheckOutCommandTest
Tests run: 1, Failures: 0, Errors: 0, Skipped: 0, Time elapsed: 0.049 sec

Results :

Tests run: 14, Failures: 0, Errors: 0, Skipped: 0

[INFO] 
[INFO] --- maven-jar-plugin:2.3:jar (default-jar) @ maven-scm-provider-vss ---
[INFO] Building jar: /opt/grid/slave/workspace/maven-scm/jdk/java-5x/label/ubuntu/trunk/maven-scm-providers/maven-scm-provider-vss/target/maven-scm-provider-vss-1.5-SNAPSHOT.jar
[INFO] 
[INFO] --- maven-site-plugin:3.0-beta-3:attach-descriptor (attach-descriptor) @ maven-scm-provider-vss
---
[INFO] 
[INFO] --- maven-install-plugin:2.3:install (default-install) @ maven-scm-provider-vss ---
[INFO] Installing /opt/grid/slave/workspace/maven-scm/jdk/java-5x/label/ubuntu/trunk/maven-scm-providers/maven-scm-provider-vss/target/maven-scm-provider-vss-1.5-SNAPSHOT.jar
to <https://grid.sonatype.org/ci/job/maven-scm/./jdk=java-5x,label=ubuntu/ws/.repository/org/apache/maven/scm/maven-scm-provider-vss/1.5-SNAPSHOT/maven-scm-provider-vss-1.5-SNAPSHOT.jar>
[INFO] Installing /opt/grid/slave/workspace/maven-scm/jdk/java-5x/label/ubuntu/trunk/maven-scm-providers/maven-scm-provider-vss/pom.xml
to <https://grid.sonatype.org/ci/job/maven-scm/./jdk=java-5x,label=ubuntu/ws/.repository/org/apache/maven/scm/maven-scm-provider-vss/1.5-SNAPSHOT/maven-scm-provider-vss-1.5-SNAPSHOT.pom>
[INFO] Installing /opt/grid/slave/workspace/maven-scm/jdk/java-5x/label/ubuntu/trunk/maven-scm-providers/maven-scm-provider-vss/target/maven-scm-provider-vss-1.5-SNAPSHOT-site.xml
to <https://grid.sonatype.org/ci/job/maven-scm/./jdk=java-5x,label=ubuntu/ws/.repository/org/apache/maven/scm/maven-scm-provider-vss/1.5-SNAPSHOT/maven-scm-provider-vss-1.5-SNAPSHOT-site.xml>
[INFO] 
[INFO] --- maven-deploy-plugin:2.5:deploy (default-deploy) @ maven-scm-provider-vss ---
Downloading: http://repository.sonatype.org:8081/content/repositories/maven.snapshots/org/apache/maven/scm/maven-scm-provider-vss/1.5-SNAPSHOT/maven-metadata.xml
Downloaded: http://repository.sonatype.org:8081/content/repositories/maven.snapshots/org/apache/maven/scm/maven-scm-provider-vss/1.5-SNAPSHOT/maven-metadata.xml
(999 B at 3.5 KB/sec)
Uploading: http://repository.sonatype.org:8081/content/repositories/maven.snapshots/org/apache/maven/scm/maven-scm-provider-vss/1.5-SNAPSHOT/maven-scm-provider-vss-1.5-20110101.104158-20.jar
Uploaded: http://repository.sonatype.org:8081/content/repositories/maven.snapshots/org/apache/maven/scm/maven-scm-provider-vss/1.5-SNAPSHOT/maven-scm-provider-vss-1.5-20110101.104158-20.jar
(67 KB at 93.8 KB/sec)
Uploading: http://repository.sonatype.org:8081/content/repositories/maven.snapshots/org/apache/maven/scm/maven-scm-provider-vss/1.5-SNAPSHOT/maven-scm-provider-vss-1.5-20110101.104158-20.pom
Uploaded: http://repository.sonatype.org:8081/content/repositories/maven.snapshots/org/apache/maven/scm/maven-scm-provider-vss/1.5-SNAPSHOT/maven-scm-provider-vss-1.5-20110101.104158-20.pom
(3 KB at 4.2 KB/sec)
Downloading: http://repository.sonatype.org:8081/content/repositories/maven.snapshots/org/apache/maven/scm/maven-scm-provider-vss/maven-metadata.xml
Downloaded: http://repository.sonatype.org:8081/content/repositories/maven.snapshots/org/apache/maven/scm/maven-scm-provider-vss/maven-metadata.xml
(436 B at 1.7 KB/sec)
Uploading: http://repository.sonatype.org:8081/content/repositories/maven.snapshots/org/apache/maven/scm/maven-scm-provider-vss/1.5-SNAPSHOT/maven-metadata.xml
Uploaded: http://repository.sonatype.org:8081/content/repositories/maven.snapshots/org/apache/maven/scm/maven-scm-provider-vss/1.5-SNAPSHOT/maven-metadata.xml
(999 B at 2.6 KB/sec)
Uploading: http://repository.sonatype.org:8081/content/repositories/maven.snapshots/org/apache/maven/scm/maven-scm-provider-vss/maven-metadata.xml
Uploaded: http://repository.sonatype.org:8081/content/repositories/maven.snapshots/org/apache/maven/scm/maven-scm-provider-vss/maven-metadata.xml
(436 B at 1.3 KB/sec)
Uploading: http://repository.sonatype.org:8081/content/repositories/maven.snapshots/org/apache/maven/scm/maven-scm-provider-vss/1.5-SNAPSHOT/maven-scm-provider-vss-1.5-20110101.104158-20-site.xml
Uploaded: http://repository.sonatype.org:8081/content/repositories/maven.snapshots/org/apache/maven/scm/maven-scm-provider-vss/1.5-SNAPSHOT/maven-scm-provider-vss-1.5-20110101.104158-20-site.xml
(589 B at 1.5 KB/sec)
Uploading: http://repository.sonatype.org:8081/content/repositories/maven.snapshots/org/apache/maven/scm/maven-scm-provider-vss/1.5-SNAPSHOT/maven-metadata.xml
Uploaded: http://repository.sonatype.org:8081/content/repositories/maven.snapshots/org/apache/maven/scm/maven-scm-provider-vss/1.5-SNAPSHOT/maven-metadata.xml
(999 B at 2.2 KB/sec)
[INFO]                                                                         
[INFO] ------------------------------------------------------------------------
[INFO] Building Maven SCM TFS Provider 1.5-SNAPSHOT
[INFO] ------------------------------------------------------------------------
[INFO] 
[INFO] --- maven-clean-plugin:2.4.1:clean (default-clean) @ maven-scm-provider-tfs ---
[INFO] Deleting /opt/grid/slave/workspace/maven-scm/jdk/java-5x/label/ubuntu/trunk/maven-scm-providers/maven-scm-provider-tfs/target
[INFO] 
[INFO] --- maven-remote-resources-plugin:1.1:process (default) @ maven-scm-provider-tfs ---
[INFO] 
[INFO] --- plexus-maven-plugin:1.3.8:descriptor (create-component-descriptor) @ maven-scm-provider-tfs
---
[INFO] Discovered 1 component descriptors(s)
[INFO] 
[INFO] --- maven-resources-plugin:2.4:resources (default-resources) @ maven-scm-provider-tfs
---
[INFO] Using 'UTF-8' encoding to copy filtered resources.
[INFO] skip non existing resourceDirectory /opt/grid/slave/workspace/maven-scm/jdk/java-5x/label/ubuntu/trunk/maven-scm-providers/maven-scm-provider-tfs/src/main/resources
[INFO] Copying 3 resources
[INFO] 
[INFO] --- maven-compiler-plugin:2.3.2:compile (default-compile) @ maven-scm-provider-tfs
---
[INFO] Compiling 21 source files to /opt/grid/slave/workspace/maven-scm/jdk/java-5x/label/ubuntu/trunk/maven-scm-providers/maven-scm-provider-tfs/target/classes
[INFO] 
[INFO] --- maven-resources-plugin:2.4:testResources (default-testResources) @ maven-scm-provider-tfs
---
[INFO] Using 'UTF-8' encoding to copy filtered resources.
[INFO] Copying 1 resource
[INFO] Copying 3 resources
[INFO] 
[INFO] --- maven-compiler-plugin:2.3.2:testCompile (default-testCompile) @ maven-scm-provider-tfs
---
[INFO] Compiling 13 source files to /opt/grid/slave/workspace/maven-scm/jdk/java-5x/label/ubuntu/trunk/maven-scm-providers/maven-scm-provider-tfs/target/test-classes
[INFO] 
[INFO] --- maven-surefire-plugin:2.7.1:test (default-test) @ maven-scm-provider-tfs ---
[INFO] Surefire report directory: /opt/grid/slave/workspace/maven-scm/jdk/java-5x/label/ubuntu/trunk/maven-scm-providers/maven-scm-provider-tfs/target/surefire-reports

-------------------------------------------------------
 T E S T S
-------------------------------------------------------
Running org.apache.maven.scm.provider.tfs.command.TfsAddCommandTest
Tests run: 2, Failures: 0, Errors: 0, Skipped: 0, Time elapsed: 0.231 sec
Running org.apache.maven.scm.provider.tfs.command.TfsTagCommandTest
Tests run: 2, Failures: 0, Errors: 0, Skipped: 0, Time elapsed: 0.089 sec
Running org.apache.maven.scm.provider.tfs.command.TfsCommandTest
Tests run: 1, Failures: 0, Errors: 0, Skipped: 0, Time elapsed: 0.049 sec
Running org.apache.maven.scm.provider.tfs.command.TfsChangeLogCommandTest
Tests run: 4, Failures: 0, Errors: 0, Skipped: 0, Time elapsed: 0.158 sec
Running org.apache.maven.scm.provider.tfs.command.TfsStatusCommandTest
Tests run: 4, Failures: 0, Errors: 0, Skipped: 0, Time elapsed: 0.083 sec
Running org.apache.maven.scm.provider.tfs.command.TfsListCommandTest
Tests run: 3, Failures: 0, Errors: 0, Skipped: 0, Time elapsed: 0.061 sec
Running org.apache.maven.scm.provider.tfs.command.TfsCheckInCommandTest
Tests run: 2, Failures: 0, Errors: 0, Skipped: 0, Time elapsed: 0.037 sec
Running org.apache.maven.scm.provider.tfs.command.TfsUnEditCommandTest
Tests run: 2, Failures: 0, Errors: 0, Skipped: 0, Time elapsed: 0.037 sec
Running org.apache.maven.scm.provider.tfs.command.TfsBranchCommandTest
Tests run: 2, Failures: 0, Errors: 0, Skipped: 0, Time elapsed: 0.056 sec
Running org.apache.maven.scm.provider.tfs.command.TfsCheckOutCommandTest
Tests run: 4, Failures: 0, Errors: 0, Skipped: 0, Time elapsed: 0.113 sec
Running org.apache.maven.scm.provider.tfs.command.TfsEditCommandTest
Tests run: 3, Failures: 0, Errors: 0, Skipped: 0, Time elapsed: 0.063 sec
Running org.apache.maven.scm.provider.tfs.command.TfsUpdateCommandTest
Tests run: 2, Failures: 0, Errors: 0, Skipped: 0, Time elapsed: 0.036 sec
Running org.apache.maven.scm.provider.tfs.command.blame.TfsBlameConsumerTest
Tests run: 1, Failures: 0, Errors: 0, Skipped: 0, Time elapsed: 0.024 sec

Results :

Tests run: 32, Failures: 0, Errors: 0, Skipped: 0

[INFO] 
[INFO] --- maven-jar-plugin:2.3:jar (default-jar) @ maven-scm-provider-tfs ---
[INFO] Building jar: /opt/grid/slave/workspace/maven-scm/jdk/java-5x/label/ubuntu/trunk/maven-scm-providers/maven-scm-provider-tfs/target/maven-scm-provider-tfs-1.5-SNAPSHOT.jar
[INFO] 
[INFO] --- maven-site-plugin:3.0-beta-3:attach-descriptor (attach-descriptor) @ maven-scm-provider-tfs
---
[INFO] 
[INFO] --- maven-install-plugin:2.3:install (default-install) @ maven-scm-provider-tfs ---
[INFO] Installing /opt/grid/slave/workspace/maven-scm/jdk/java-5x/label/ubuntu/trunk/maven-scm-providers/maven-scm-provider-tfs/target/maven-scm-provider-tfs-1.5-SNAPSHOT.jar
to <https://grid.sonatype.org/ci/job/maven-scm/./jdk=java-5x,label=ubuntu/ws/.repository/org/apache/maven/scm/maven-scm-provider-tfs/1.5-SNAPSHOT/maven-scm-provider-tfs-1.5-SNAPSHOT.jar>
[INFO] Installing /opt/grid/slave/workspace/maven-scm/jdk/java-5x/label/ubuntu/trunk/maven-scm-providers/maven-scm-provider-tfs/pom.xml
to <https://grid.sonatype.org/ci/job/maven-scm/./jdk=java-5x,label=ubuntu/ws/.repository/org/apache/maven/scm/maven-scm-provider-tfs/1.5-SNAPSHOT/maven-scm-provider-tfs-1.5-SNAPSHOT.pom>
[INFO] 
[INFO] --- maven-deploy-plugin:2.5:deploy (default-deploy) @ maven-scm-provider-tfs ---
Downloading: http://repository.sonatype.org:8081/content/repositories/maven.snapshots/org/apache/maven/scm/maven-scm-provider-tfs/1.5-SNAPSHOT/maven-metadata.xml
Downloaded: http://repository.sonatype.org:8081/content/repositories/maven.snapshots/org/apache/maven/scm/maven-scm-provider-tfs/1.5-SNAPSHOT/maven-metadata.xml
(789 B at 3.6 KB/sec)
Uploading: http://repository.sonatype.org:8081/content/repositories/maven.snapshots/org/apache/maven/scm/maven-scm-provider-tfs/1.5-SNAPSHOT/maven-scm-provider-tfs-1.5-20110101.104207-21.jar
Uploaded: http://repository.sonatype.org:8081/content/repositories/maven.snapshots/org/apache/maven/scm/maven-scm-provider-tfs/1.5-SNAPSHOT/maven-scm-provider-tfs-1.5-20110101.104207-21.jar
(41 KB at 52.4 KB/sec)
Uploading: http://repository.sonatype.org:8081/content/repositories/maven.snapshots/org/apache/maven/scm/maven-scm-provider-tfs/1.5-SNAPSHOT/maven-scm-provider-tfs-1.5-20110101.104207-21.pom
Uploaded: http://repository.sonatype.org:8081/content/repositories/maven.snapshots/org/apache/maven/scm/maven-scm-provider-tfs/1.5-SNAPSHOT/maven-scm-provider-tfs-1.5-20110101.104207-21.pom
(3 KB at 4.0 KB/sec)
Downloading: http://repository.sonatype.org:8081/content/repositories/maven.snapshots/org/apache/maven/scm/maven-scm-provider-tfs/maven-metadata.xml
Downloaded: http://repository.sonatype.org:8081/content/repositories/maven.snapshots/org/apache/maven/scm/maven-scm-provider-tfs/maven-metadata.xml
(396 B at 1.3 KB/sec)
Uploading: http://repository.sonatype.org:8081/content/repositories/maven.snapshots/org/apache/maven/scm/maven-scm-provider-tfs/1.5-SNAPSHOT/maven-metadata.xml
Uploaded: http://repository.sonatype.org:8081/content/repositories/maven.snapshots/org/apache/maven/scm/maven-scm-provider-tfs/1.5-SNAPSHOT/maven-metadata.xml
(789 B at 2.0 KB/sec)
Uploading: http://repository.sonatype.org:8081/content/repositories/maven.snapshots/org/apache/maven/scm/maven-scm-provider-tfs/maven-metadata.xml
Uploaded: http://repository.sonatype.org:8081/content/repositories/maven.snapshots/org/apache/maven/scm/maven-scm-provider-tfs/maven-metadata.xml
(396 B at 0.5 KB/sec)
[INFO]                                                                         
[INFO] ------------------------------------------------------------------------
[INFO] Skipping Maven SCM Standard Providers
[INFO] This project has been banned from the build due to previous failures.
[INFO] ------------------------------------------------------------------------
[INFO]                                                                         
[INFO] ------------------------------------------------------------------------
[INFO] Skipping Maven SCM Client
[INFO] This project has been banned from the build due to previous failures.
[INFO] ------------------------------------------------------------------------
[INFO]                                                                         
[INFO] ------------------------------------------------------------------------
[INFO] Skipping Maven SCM Plugin
[INFO] This project has been banned from the build due to previous failures.
[INFO] ------------------------------------------------------------------------
[INFO] ------------------------------------------------------------------------
[INFO] Reactor Summary:
[INFO] 
[INFO] Maven SCM ......................................... SUCCESS [15.134s]
[INFO] Maven SCM API ..................................... SUCCESS [15.151s]
[INFO] Maven SCM Managers ................................ SUCCESS [3.723s]
[INFO] Maven SCM Manager for Plexus ...................... SUCCESS [7.219s]
[INFO] Maven SCM Test .................................... SUCCESS [9.492s]
[INFO] Maven SCM Providers ............................... SUCCESS [2.976s]
[INFO] Maven SCM AccuRev Provider ........................ SUCCESS [17.036s]
[INFO] Maven SCM Bazaar Provider ......................... SUCCESS [8.753s]
[INFO] Maven SCM Clearcase Provider ...................... SUCCESS [12.658s]
[INFO] Maven SCM CVS Provider - Parent ................... SUCCESS [4.237s]
[INFO] Maven SCM CVS Provider TCK tests .................. SUCCESS [10.531s]
[INFO] Maven SCM CVS Provider - Common library ........... SUCCESS [10.260s]
[INFO] Maven SCM CVS Provider - CVS Executable Impl. ..... SUCCESS [18.879s]
[INFO] Maven SCM CVS Provider - CVS Java Impl. ........... SUCCESS [20.748s]
[INFO] Maven SCM Mercurial (Hg) Provider ................. SUCCESS [9.768s]
[INFO] Maven SCM Git Provider - Parent ................... SUCCESS [3.300s]
[INFO] Maven SCM Git Provider - Common library ........... SUCCESS [10.522s]
[INFO] Maven SCM git Provider TCK Tests .................. SUCCESS [6.288s]
[INFO] Maven SCM Git Provider - Git Executable Impl. ..... SUCCESS [11.161s]
[INFO] Maven SCM Local Provider .......................... SUCCESS [10.283s]
[INFO] Maven SCM Perforce Provider ....................... SUCCESS [11.976s]
[INFO] Maven SCM Starteam Provider ....................... SUCCESS [16.349s]
[INFO] Maven SCM Subversion Provider - Parent ............ SUCCESS [3.634s]
[INFO] Maven SCM Subversion Provider - Common library .... SUCCESS [9.766s]
[INFO] Maven SCM Subversion Provider TCK Tests ........... SUCCESS [8.826s]
[INFO] Maven SCM Subversion Provider - SVN Executable Impl.  FAILURE [23.584s]
[INFO] Maven SCM Synergy Provider ........................ SUCCESS [9.616s]
[INFO] Maven SCM Visual Source Safe Provider ............. SUCCESS [9.532s]
[INFO] Maven SCM TFS Provider ............................ SUCCESS [8.193s]
[INFO] Maven SCM Standard Providers ...................... SKIPPED
[INFO] Maven SCM Client .................................. SKIPPED
[INFO] Maven SCM Plugin .................................. SKIPPED
[INFO] ------------------------------------------------------------------------
[INFO] BUILD FAILURE
[INFO] ------------------------------------------------------------------------
[INFO] Total time: 5:14.523s
[INFO] Finished at: Sat Jan 01 04:42:10 CST 2011
[INFO] Final Memory: 40M/362M
[INFO] ------------------------------------------------------------------------
[ERROR] Failed to execute goal org.apache.maven.plugins:maven-surefire-plugin:2.7.1:test (default-test)
on project maven-scm-provider-svnexe: There are test failures.
[ERROR] 
[ERROR] Please refer to /opt/grid/slave/workspace/maven-scm/jdk/java-5x/label/ubuntu/trunk/maven-scm-providers/maven-scm-providers-svn/maven-scm-provider-svnexe/target/surefire-reports
for the individual test results.
[ERROR] -> [Help 1]
org.apache.maven.lifecycle.LifecycleExecutionException: Failed to execute goal org.apache.maven.plugins:maven-surefire-plugin:2.7.1:test
(default-test) on project maven-scm-provider-svnexe: There are test failures.

Please refer to /opt/grid/slave/workspace/maven-scm/jdk/java-5x/label/ubuntu/trunk/maven-scm-providers/maven-scm-providers-svn/maven-scm-provider-svnexe/target/surefire-reports
for the individual test results.
	at org.apache.maven.lifecycle.internal.MojoExecutor.execute(MojoExecutor.java:199)
	at org.apache.maven.lifecycle.internal.MojoExecutor.execute(MojoExecutor.java:148)
	at org.apache.maven.lifecycle.internal.MojoExecutor.execute(MojoExecutor.java:140)
	at org.apache.maven.lifecycle.internal.LifecycleModuleBuilder.buildProject(LifecycleModuleBuilder.java:84)
	at org.apache.maven.lifecycle.internal.LifecycleModuleBuilder.buildProject(LifecycleModuleBuilder.java:59)
	at org.apache.maven.lifecycle.internal.LifecycleStarter.singleThreadedBuild(LifecycleStarter.java:183)
	at org.apache.maven.lifecycle.internal.LifecycleStarter.execute(LifecycleStarter.java:161)
	at org.apache.maven.DefaultMaven.doExecute(DefaultMaven.java:316)
	at org.apache.maven.DefaultMaven.execute(DefaultMaven.java:153)
	at org.apache.maven.cli.MavenCli.execute(MavenCli.java:451)
	at org.apache.maven.cli.MavenCli.doMain(MavenCli.java:188)
	at org.apache.maven.cli.MavenCli.main(MavenCli.java:134)
	at sun.reflect.NativeMethodAccessorImpl.invoke0(Native Method)
	at sun.reflect.NativeMethodAccessorImpl.invoke(NativeMethodAccessorImpl.java:39)
	at sun.reflect.DelegatingMethodAccessorImpl.invoke(DelegatingMethodAccessorImpl.java:25)
	at java.lang.reflect.Method.invoke(Method.java:592)
	at org.codehaus.plexus.classworlds.launcher.Launcher.launchEnhanced(Launcher.java:290)
	at org.codehaus.plexus.classworlds.launcher.Launcher.launch(Launcher.java:230)
	at org.codehaus.plexus.classworlds.launcher.Launcher.mainWithExitCode(Launcher.java:409)
	at org.codehaus.plexus.classworlds.launcher.Launcher.main(Launcher.java:352)
Caused by: org.apache.maven.plugin.MojoFailureException: There are test failures.

Please refer to /opt/grid/slave/workspace/maven-scm/jdk/java-5x/label/ubuntu/trunk/maven-scm-providers/maven-scm-providers-svn/maven-scm-provider-svnexe/target/surefire-reports
for the individual test results.
	at org.apache.maven.plugin.surefire.SurefireHelper.reportExecution(SurefireHelper.java:74)
	at org.apache.maven.plugin.surefire.SurefirePlugin.execute(SurefirePlugin.java:631)
	at org.apache.maven.plugin.DefaultBuildPluginManager.executeMojo(DefaultBuildPluginManager.java:107)
	at org.apache.maven.lifecycle.internal.MojoExecutor.execute(MojoExecutor.java:195)
	... 19 more
[ERROR] 
[ERROR] Re-run Maven using the -X switch to enable full debug logging.
[ERROR] 
[ERROR] For more information about the errors and possible solutions, please read the following
articles:
[ERROR] [Help 1] http://cwiki.apache.org/confluence/display/MAVEN/MojoFailureException
[ERROR] 
[ERROR] After correcting the problems, you can resume the build with the command
[ERROR]   mvn <goals> -rf :maven-scm-provider-svnexe
Recording test results


Mime
View raw message