maven-notifications mailing list archives

Site index · List index
Message view « Date » · « Thread »
Top « Date » · « Thread »
From "GRiD .ORG" <bui...@lists.sonatype.com>
Subject Build failed in Hudson: surefire » java-5x,ubuntu #129
Date Thu, 02 Dec 2010 20:50:34 GMT
See <https://grid.sonatype.org/ci/job/surefire/./jdk=java-5x,label=ubuntu/129/>

------------------------------------------
[...truncated 602 lines...]
WARNING: no time attribute found on testsuite element
Tests run: 8, Failures: 0, Errors: 0, Skipped: 0, Time elapsed: 0.076 sec
Running org.apache.maven.plugins.surefire.report.ReportTestCaseTest
Tests run: 4, Failures: 0, Errors: 0, Skipped: 0, Time elapsed: 0.004 sec
Running org.apache.maven.plugins.surefire.report.SurefireReportMojoTest
[WARNING] Unable to locate Test Source XRef to link to - DISABLED
Tests run: 4, Failures: 0, Errors: 0, Skipped: 0, Time elapsed: 2.066 sec

Results :

Tests run: 24, Failures: 0, Errors: 0, Skipped: 0

[INFO] [jar:jar {execution: default-jar}]
[INFO] Building jar: /opt/grid/slave/workspace/surefire/jdk/java-5x/label/ubuntu/trunk/maven-surefire-report-plugin/target/maven-surefire-report-plugin-2.7-SNAPSHOT.jar
[INFO] [plugin:addPluginArtifactMetadata {execution: default-addPluginArtifactMetadata}]
[INFO] [install:install {execution: default-install}]
[INFO] Installing /opt/grid/slave/workspace/surefire/jdk/java-5x/label/ubuntu/trunk/maven-surefire-report-plugin/target/maven-surefire-report-plugin-2.7-SNAPSHOT.jar
to <https://grid.sonatype.org/ci/job/surefire/./jdk=java-5x,label=ubuntu/ws/.repository/org/apache/maven/plugins/maven-surefire-report-plugin/2.7-SNAPSHOT/maven-surefire-report-plugin-2.7-SNAPSHOT.jar>
[INFO] [deploy:deploy {execution: default-deploy}]
[INFO] Retrieving previous build number from apache.snapshots.https
Uploading: http://repository.sonatype.org:8081/content/repositories/maven.snapshots/org/apache/maven/plugins/maven-surefire-report-plugin/2.7-SNAPSHOT/maven-surefire-report-plugin-2.7-20101202.204228-47.jar
38K uploaded  (maven-surefire-report-plugin-2.7-20101202.204228-47.jar)
[INFO] Retrieving previous metadata from apache.snapshots.https
[INFO] Uploading repository metadata for: 'snapshot org.apache.maven.plugins:maven-surefire-report-plugin:2.7-SNAPSHOT'
[INFO] Retrieving previous metadata from apache.snapshots.https
[INFO] Uploading repository metadata for: 'artifact org.apache.maven.plugins:maven-surefire-report-plugin'
[INFO] Retrieving previous metadata from apache.snapshots.https
[INFO] Uploading repository metadata for: 'org.apache.maven.plugins'
[INFO] Uploading project information for maven-surefire-report-plugin 2.7-20101202.204228-47
[INFO] ------------------------------------------------------------------------
[INFO] Building Maven Surefire Integration Tests
[INFO]    task-segment: [clean, deploy]
[INFO] ------------------------------------------------------------------------
[INFO] [clean:clean {execution: default-clean}]
[INFO] Deleting file set: /opt/grid/slave/workspace/surefire/jdk/java-5x/label/ubuntu/trunk/surefire-integration-tests/target
(included: [**], excluded: [])
[INFO] [enforcer:enforce {execution: require-maven-2.1.0}]
[INFO] [remote-resources:process {execution: default}]
[INFO] [resources:resources {execution: default-resources}]
[INFO] Using 'UTF-8' encoding to copy filtered resources.
[INFO] skip non existing resourceDirectory /opt/grid/slave/workspace/surefire/jdk/java-5x/label/ubuntu/trunk/surefire-integration-tests/src/main/resources
[INFO] Copying 3 resources
[INFO] [compiler:compile {execution: default-compile}]
[INFO] No sources to compile
[INFO] [help:effective-settings {execution: settings.xml}]
[INFO] Effective-settings written to: /opt/grid/slave/workspace/surefire/jdk/java-5x/label/ubuntu/trunk/surefire-integration-tests/target/private/settings.xml
[INFO] [resources:testResources {execution: default-testResources}]
[INFO] Using 'UTF-8' encoding to copy filtered resources.
[INFO] Copying 164 resources
[INFO] Copying 3 resources
[INFO] [compiler:testCompile {execution: default-testCompile}]
[INFO] Compiling 58 source files to /opt/grid/slave/workspace/surefire/jdk/java-5x/label/ubuntu/trunk/surefire-integration-tests/target/test-classes
[WARNING] DEPRECATED [systemProperties]: Use systemPropertyVariables instead.
[INFO] [surefire:test {execution: default-test}]
[INFO] Surefire report directory: /opt/grid/slave/workspace/surefire/jdk/java-5x/label/ubuntu/trunk/surefire-integration-tests/target/surefire-reports

-------------------------------------------------------
 T E S T S
-------------------------------------------------------
Running org.apache.maven.surefire.its.SetUpForIntegrationTest
Tests run: 1, Failures: 0, Errors: 0, Skipped: 0, Time elapsed: 0.07 sec

Results :

Tests run: 1, Failures: 0, Errors: 0, Skipped: 0

[INFO] [jar:jar {execution: default-jar}]
[INFO] Building jar: /opt/grid/slave/workspace/surefire/jdk/java-5x/label/ubuntu/trunk/surefire-integration-tests/target/surefire-integration-tests-2.7-SNAPSHOT.jar
[INFO] [invoker:install {execution: default}]
[INFO] Installing /opt/grid/slave/workspace/surefire/jdk/java-5x/label/ubuntu/trunk/maven-surefire-report-plugin/pom.xml
to /opt/grid/slave/workspace/surefire/jdk/java-5x/label/ubuntu/trunk/surefire-integration-tests/target/it-repo/org/apache/maven/plugins/maven-surefire-report-plugin/2.7-SNAPSHOT/maven-surefire-report-plugin-2.7-SNAPSHOT.pom
[INFO] Installing /opt/grid/slave/workspace/surefire/jdk/java-5x/label/ubuntu/trunk/maven-surefire-report-plugin/target/maven-surefire-report-plugin-2.7-SNAPSHOT.jar
to /opt/grid/slave/workspace/surefire/jdk/java-5x/label/ubuntu/trunk/surefire-integration-tests/target/it-repo/org/apache/maven/plugins/maven-surefire-report-plugin/2.7-SNAPSHOT/maven-surefire-report-plugin-2.7-20101202.204228-47.jar
[INFO] Installing /opt/grid/slave/workspace/surefire/jdk/java-5x/label/ubuntu/trunk/pom.xml
to /opt/grid/slave/workspace/surefire/jdk/java-5x/label/ubuntu/trunk/surefire-integration-tests/target/it-repo/org/apache/maven/surefire/surefire/2.7-SNAPSHOT/surefire-2.7-20101202.204228-47.pom
[INFO] Installing /opt/grid/slave/workspace/surefire/jdk/java-5x/label/ubuntu/trunk/maven-surefire-plugin/pom.xml
to /opt/grid/slave/workspace/surefire/jdk/java-5x/label/ubuntu/trunk/surefire-integration-tests/target/it-repo/org/apache/maven/plugins/maven-surefire-plugin/2.7-SNAPSHOT/maven-surefire-plugin-2.7-SNAPSHOT.pom
[INFO] Installing /opt/grid/slave/workspace/surefire/jdk/java-5x/label/ubuntu/trunk/maven-surefire-plugin/target/maven-surefire-plugin-2.7-SNAPSHOT.jar
to /opt/grid/slave/workspace/surefire/jdk/java-5x/label/ubuntu/trunk/surefire-integration-tests/target/it-repo/org/apache/maven/plugins/maven-surefire-plugin/2.7-SNAPSHOT/maven-surefire-plugin-2.7-20101202.204228-47.jar
[INFO] Installing /opt/grid/slave/workspace/surefire/jdk/java-5x/label/ubuntu/trunk/surefire-booter/pom.xml
to /opt/grid/slave/workspace/surefire/jdk/java-5x/label/ubuntu/trunk/surefire-integration-tests/target/it-repo/org/apache/maven/surefire/surefire-booter/2.7-SNAPSHOT/surefire-booter-2.7-SNAPSHOT.pom
[INFO] Installing /opt/grid/slave/workspace/surefire/jdk/java-5x/label/ubuntu/trunk/surefire-booter/target/surefire-booter-2.7-SNAPSHOT.jar
to /opt/grid/slave/workspace/surefire/jdk/java-5x/label/ubuntu/trunk/surefire-integration-tests/target/it-repo/org/apache/maven/surefire/surefire-booter/2.7-SNAPSHOT/surefire-booter-2.7-20101202.204228-47.jar
[INFO] Installing /opt/grid/slave/workspace/surefire/jdk/java-5x/label/ubuntu/trunk/surefire-api/target/dependency-reduced-pom.xml
to /opt/grid/slave/workspace/surefire/jdk/java-5x/label/ubuntu/trunk/surefire-integration-tests/target/it-repo/org/apache/maven/surefire/surefire-api/2.7-SNAPSHOT/surefire-api-2.7-SNAPSHOT.pom
[INFO] Installing /opt/grid/slave/workspace/surefire/jdk/java-5x/label/ubuntu/trunk/surefire-api/target/surefire-api-2.7-SNAPSHOT.jar
to /opt/grid/slave/workspace/surefire/jdk/java-5x/label/ubuntu/trunk/surefire-integration-tests/target/it-repo/org/apache/maven/surefire/surefire-api/2.7-SNAPSHOT/surefire-api-2.7-20101202.204228-47.jar
[INFO] Installing /opt/grid/slave/workspace/surefire/jdk/java-5x/label/ubuntu/trunk/maven-surefire-common/pom.xml
to /opt/grid/slave/workspace/surefire/jdk/java-5x/label/ubuntu/trunk/surefire-integration-tests/target/it-repo/org/apache/maven/surefire/maven-surefire-common/2.7-SNAPSHOT/maven-surefire-common-2.7-SNAPSHOT.pom
[INFO] Installing /opt/grid/slave/workspace/surefire/jdk/java-5x/label/ubuntu/trunk/maven-surefire-common/target/maven-surefire-common-2.7-SNAPSHOT.jar
to /opt/grid/slave/workspace/surefire/jdk/java-5x/label/ubuntu/trunk/surefire-integration-tests/target/it-repo/org/apache/maven/surefire/maven-surefire-common/2.7-SNAPSHOT/maven-surefire-common-2.7-20101202.204228-47.jar
[INFO] Installing /opt/grid/slave/workspace/surefire/jdk/java-5x/label/ubuntu/trunk/surefire-providers/surefire-testng/pom.xml
to /opt/grid/slave/workspace/surefire/jdk/java-5x/label/ubuntu/trunk/surefire-integration-tests/target/it-repo/org/apache/maven/surefire/surefire-testng/2.7-SNAPSHOT/surefire-testng-2.7-SNAPSHOT.pom
[INFO] Installing /opt/grid/slave/workspace/surefire/jdk/java-5x/label/ubuntu/trunk/surefire-providers/surefire-testng/target/surefire-testng-2.7-SNAPSHOT.jar
to /opt/grid/slave/workspace/surefire/jdk/java-5x/label/ubuntu/trunk/surefire-integration-tests/target/it-repo/org/apache/maven/surefire/surefire-testng/2.7-SNAPSHOT/surefire-testng-2.7-20101202.204228-47.jar
[INFO] Installing /opt/grid/slave/workspace/surefire/jdk/java-5x/label/ubuntu/trunk/surefire-providers/pom.xml
to /opt/grid/slave/workspace/surefire/jdk/java-5x/label/ubuntu/trunk/surefire-integration-tests/target/it-repo/org/apache/maven/surefire/surefire-providers/2.7-SNAPSHOT/surefire-providers-2.7-20101202.204228-47.pom
[INFO] Installing /opt/grid/slave/workspace/surefire/jdk/java-5x/label/ubuntu/trunk/surefire-providers/surefire-junit/pom.xml
to /opt/grid/slave/workspace/surefire/jdk/java-5x/label/ubuntu/trunk/surefire-integration-tests/target/it-repo/org/apache/maven/surefire/surefire-junit/2.7-SNAPSHOT/surefire-junit-2.7-SNAPSHOT.pom
[INFO] Installing /opt/grid/slave/workspace/surefire/jdk/java-5x/label/ubuntu/trunk/surefire-providers/surefire-junit/target/surefire-junit-2.7-SNAPSHOT.jar
to /opt/grid/slave/workspace/surefire/jdk/java-5x/label/ubuntu/trunk/surefire-integration-tests/target/it-repo/org/apache/maven/surefire/surefire-junit/2.7-SNAPSHOT/surefire-junit-2.7-20101202.204228-47.jar
[INFO] Installing /opt/grid/slave/workspace/surefire/jdk/java-5x/label/ubuntu/trunk/surefire-providers/surefire-junit4/pom.xml
to /opt/grid/slave/workspace/surefire/jdk/java-5x/label/ubuntu/trunk/surefire-integration-tests/target/it-repo/org/apache/maven/surefire/surefire-junit4/2.7-SNAPSHOT/surefire-junit4-2.7-SNAPSHOT.pom
[INFO] Installing /opt/grid/slave/workspace/surefire/jdk/java-5x/label/ubuntu/trunk/surefire-providers/surefire-junit4/target/surefire-junit4-2.7-SNAPSHOT.jar
to /opt/grid/slave/workspace/surefire/jdk/java-5x/label/ubuntu/trunk/surefire-integration-tests/target/it-repo/org/apache/maven/surefire/surefire-junit4/2.7-SNAPSHOT/surefire-junit4-2.7-20101202.204228-47.jar
[INFO] Installing /opt/grid/slave/workspace/surefire/jdk/java-5x/label/ubuntu/trunk/surefire-providers/surefire-junit47/pom.xml
to /opt/grid/slave/workspace/surefire/jdk/java-5x/label/ubuntu/trunk/surefire-integration-tests/target/it-repo/org/apache/maven/surefire/surefire-junit47/2.7-SNAPSHOT/surefire-junit47-2.7-SNAPSHOT.pom
[INFO] Installing /opt/grid/slave/workspace/surefire/jdk/java-5x/label/ubuntu/trunk/surefire-providers/surefire-junit47/target/surefire-junit47-2.7-SNAPSHOT.jar
to /opt/grid/slave/workspace/surefire/jdk/java-5x/label/ubuntu/trunk/surefire-integration-tests/target/it-repo/org/apache/maven/surefire/surefire-junit47/2.7-SNAPSHOT/surefire-junit47-2.7-20101202.204228-47.jar
[INFO] Installing /opt/grid/slave/workspace/surefire/jdk/java-5x/label/ubuntu/trunk/surefire-integration-tests/pom.xml
to /opt/grid/slave/workspace/surefire/jdk/java-5x/label/ubuntu/trunk/surefire-integration-tests/target/it-repo/org/apache/maven/surefire/surefire-integration-tests/2.7-SNAPSHOT/surefire-integration-tests-2.7-SNAPSHOT.pom
[INFO] Installing /opt/grid/slave/workspace/surefire/jdk/java-5x/label/ubuntu/trunk/surefire-integration-tests/target/surefire-integration-tests-2.7-SNAPSHOT.jar
to /opt/grid/slave/workspace/surefire/jdk/java-5x/label/ubuntu/trunk/surefire-integration-tests/target/it-repo/org/apache/maven/surefire/surefire-integration-tests/2.7-SNAPSHOT/surefire-integration-tests-2.7-SNAPSHOT.jar
[WARNING] DEPRECATED [systemProperties]: Use systemPropertyVariables instead.
[INFO] [failsafe:integration-test {execution: default}]
[INFO] Failsafe report directory: /opt/grid/slave/workspace/surefire/jdk/java-5x/label/ubuntu/trunk/surefire-integration-tests/target/failsafe-reports

-------------------------------------------------------
 T E S T S
-------------------------------------------------------
Running org.apache.maven.surefire.its.UseIsolatedClassLoaderIT
Tests run: 1, Failures: 0, Errors: 0, Skipped: 0, Time elapsed: 5.332 sec
Running org.apache.maven.surefire.its.Surefire44InnerClassTestIT
Tests run: 1, Failures: 0, Errors: 0, Skipped: 0, Time elapsed: 3.834 sec
Running org.apache.maven.surefire.its.ClassPathOrderIT
Tests run: 1, Failures: 0, Errors: 0, Skipped: 0, Time elapsed: 4.534 sec
Running org.apache.maven.surefire.its.Surefire613TestCountInParallelIT
Tests run: 1, Failures: 0, Errors: 0, Skipped: 0, Time elapsed: 4.409 sec
Running org.apache.maven.surefire.its.ForkModeIT
Tests run: 5, Failures: 0, Errors: 0, Skipped: 0, Time elapsed: 19.41 sec
Running org.apache.maven.surefire.its.PlexusConflictIT
Tests run: 2, Failures: 0, Errors: 0, Skipped: 0, Time elapsed: 8.043 sec
Running org.apache.maven.surefire.its.UmlautDirIT
Tests run: 2, Failures: 0, Errors: 0, Skipped: 0, Time elapsed: 7.315 sec
Running org.apache.maven.surefire.its.TwoTestCasesIT
Tests run: 4, Failures: 0, Errors: 0, Skipped: 0, Time elapsed: 15.391 sec
Running org.apache.maven.surefire.its.Surefire146ForkPerTestNoSetupIT
Tests run: 1, Failures: 0, Errors: 0, Skipped: 0, Time elapsed: 3.399 sec
Running org.apache.maven.surefire.its.Surefire162CharsetProviderIT
Tests run: 1, Failures: 0, Errors: 0, Skipped: 0, Time elapsed: 3.799 sec
Running org.apache.maven.surefire.its.ResultCountingIT
Tests run: 3, Failures: 0, Errors: 0, Skipped: 0, Time elapsed: 13.936 sec
Running org.apache.maven.surefire.its.JUnit44HamcrestIT
Tests run: 1, Failures: 0, Errors: 0, Skipped: 0, Time elapsed: 3.517 sec
Running org.apache.maven.surefire.its.EnvironmentVariableIT
Tests run: 1, Failures: 0, Errors: 0, Skipped: 0, Time elapsed: 3.827 sec
Running org.apache.maven.surefire.its.CheckTestFailIfNoTestsIT
Tests run: 2, Failures: 0, Errors: 0, Skipped: 0, Time elapsed: 6.253 sec
Running org.apache.maven.surefire.its.CheckTestNgJdk14IT
Tests run: 1, Failures: 0, Errors: 0, Skipped: 0, Time elapsed: 3.865 sec
Running org.apache.maven.surefire.its.Surefire621TestCountingJunit3InParallelIT
Tests run: 1, Failures: 0, Errors: 0, Skipped: 0, Time elapsed: 4.458 sec
Running org.apache.maven.surefire.its.Junit47concurrencyIT
Tests run: 1, Failures: 0, Errors: 0, Skipped: 0, Time elapsed: 3.477 sec
Running org.apache.maven.surefire.its.DefaultConfigurationIT
Tests run: 1, Failures: 0, Errors: 0, Skipped: 0, Time elapsed: 3.479 sec
Running org.apache.maven.surefire.its.CheckTestNgPathWithSpacesIT
Tests run: 1, Failures: 0, Errors: 0, Skipped: 0, Time elapsed: 3.394 sec
Running org.apache.maven.surefire.its.CheckTestNgSuiteXmlSingleIT
Tests run: 1, Failures: 0, Errors: 0, Skipped: 0, Time elapsed: 3.346 sec
Running org.apache.maven.surefire.its.CheckTestNgReportTestIT
Tests run: 1, Failures: 0, Errors: 0, Skipped: 0, Time elapsed: 5.69 sec
Running org.apache.maven.surefire.its.JUnit4ForkAlwaysStaticInitPollutionIT
Tests run: 1, Failures: 0, Errors: 0, Skipped: 0, Time elapsed: 4.813 sec
Running org.apache.maven.surefire.its.TimeoutForkedTestIT
Tests run: 1, Failures: 0, Errors: 0, Skipped: 0, Time elapsed: 6.515 sec
Running org.apache.maven.surefire.its.CheckTestFailIfNoTestsForkModeIT
Tests run: 6, Failures: 0, Errors: 0, Skipped: 0, Time elapsed: 19.939 sec
Running org.apache.maven.surefire.its.CheckTestNgGroupThreadParallelIT
Tests run: 1, Failures: 0, Errors: 0, Skipped: 0, Time elapsed: 3.656 sec
Running org.apache.maven.surefire.its.PojoSimpleIT
Tests run: 1, Failures: 0, Errors: 0, Skipped: 0, Time elapsed: 3.237 sec
Running org.apache.maven.surefire.its.ArgLineIT
Tests run: 1, Failures: 0, Errors: 0, Skipped: 0, Time elapsed: 3.611 sec
Running org.apache.maven.surefire.its.Surefire377TestNgAndJUnitTogetherIT
Tests run: 1, Failures: 0, Errors: 0, Skipped: 0, Time elapsed: 3.506 sec
Running org.apache.maven.surefire.its.CheckTestNgSuiteXmlIT
Tests run: 2, Failures: 0, Errors: 0, Skipped: 0, Time elapsed: 7.233 sec
Running org.apache.maven.surefire.its.IncludesExcludesIT
Tests run: 1, Failures: 0, Errors: 0, Skipped: 0, Time elapsed: 3.526 sec
Running org.apache.maven.surefire.its.CheckTestNgBeforeMethodIT
Tests run: 1, Failures: 0, Errors: 0, Skipped: 0, Time elapsed: 3.585 sec
Running org.apache.maven.surefire.its.AbstractTestCaseIT
Tests run: 1, Failures: 0, Errors: 0, Skipped: 0, Time elapsed: 3.582 sec
Running org.apache.maven.surefire.its.CheckTestNgBeforeMethodFailureIT
Tests run: 1, Failures: 0, Errors: 0, Skipped: 0, Time elapsed: 3.613 sec
Running org.apache.maven.surefire.its.PlainOldJavaClasspathIT
Tests run: 1, Failures: 0, Errors: 0, Skipped: 0, Time elapsed: 3.406 sec
Running org.apache.maven.surefire.its.WorkingDirectoryMissingIT
Tests run: 1, Failures: 0, Errors: 0, Skipped: 0, Time elapsed: 3.447 sec
Running org.apache.maven.surefire.its.Junit4IgnoreIT
Tests run: 1, Failures: 0, Errors: 0, Skipped: 0, Time elapsed: 3.618 sec
Running org.apache.maven.surefire.its.AdditionalClasspathIT
Tests run: 1, Failures: 0, Errors: 0, Skipped: 0, Time elapsed: 3.728 sec
Running org.apache.maven.surefire.its.CheckTestNgListenerReporterIT
Tests run: 1, Failures: 0, Errors: 0, Skipped: 0, Time elapsed: 3.673 sec
Running org.apache.maven.surefire.its.SiblingAggregatorIT
Tests run: 1, Failures: 0, Errors: 0, Skipped: 0, Time elapsed: 4.251 sec
Running org.apache.maven.surefire.its.CheckTestNgVersionsIT
Tests run: 16, Failures: 0, Errors: 0, Skipped: 0, Time elapsed: 62.422 sec
Running org.apache.maven.surefire.its.Surefire224WellFormedXmlFailuresIT
Tests run: 1, Failures: 0, Errors: 0, Skipped: 0, Time elapsed: 3.509 sec
Running org.apache.maven.surefire.its.Surefire42NotExtendingTestCaseIT
Tests run: 1, Failures: 0, Errors: 0, Skipped: 0, Time elapsed: 4.044 sec
Running org.apache.maven.surefire.its.WorkingDirectoryIT
Tests run: 4, Failures: 0, Errors: 0, Skipped: 0, Time elapsed: 12.283 sec
Running org.apache.maven.surefire.its.AggregateReportIT
Tests run: 1, Failures: 0, Errors: 0, Skipped: 0, Time elapsed: 5.496 sec
Running org.apache.maven.surefire.its.ClasspathFilteringIT
Tests run: 1, Failures: 0, Errors: 0, Skipped: 0, Time elapsed: 3.972 sec
Running org.apache.maven.surefire.its.Junit4VersionsIT
Tests run: 9, Failures: 0, Errors: 0, Skipped: 0, Time elapsed: 33.369 sec
Running org.apache.maven.surefire.its.CheckSingleTestIT
Tests run: 4, Failures: 0, Errors: 0, Skipped: 0, Time elapsed: 13.993 sec
Running org.apache.maven.surefire.its.Surefire628ConsoleOutputBeforeAndAfterClassIT
Tests run: 1, Failures: 0, Errors: 0, Skipped: 0, Time elapsed: 3.565 sec
Running org.apache.maven.surefire.its.CheckTestNgExecuteErrorIT
Tests run: 1, Failures: 1, Errors: 0, Skipped: 0, Time elapsed: 3.781 sec <<< FAILURE!
Running org.apache.maven.surefire.its.SystemPropertiesTestIT
Tests run: 2, Failures: 0, Errors: 0, Skipped: 0, Time elapsed: 8.528 sec
Running org.apache.maven.surefire.its.ClasspathScopeFilteringIT
Tests run: 1, Failures: 0, Errors: 0, Skipped: 0, Time elapsed: 4.049 sec

Results :

Failed tests: 
  testExecuteError(org.apache.maven.surefire.its.CheckTestNgExecuteErrorIT)

Tests run: 99, Failures: 1, Errors: 0, Skipped: 0

[INFO] [failsafe:verify {execution: default}]
[INFO] Failsafe report directory: /opt/grid/slave/workspace/surefire/jdk/java-5x/label/ubuntu/trunk/surefire-integration-tests/target/failsafe-reports
[INFO] ------------------------------------------------------------------------
[ERROR] BUILD FAILURE
[INFO] ------------------------------------------------------------------------
[INFO] There are test failures.

Please refer to /opt/grid/slave/workspace/surefire/jdk/java-5x/label/ubuntu/trunk/surefire-integration-tests/target/failsafe-reports
for the individual test results.
[INFO] ------------------------------------------------------------------------
[INFO] Trace
org.apache.maven.BuildFailureException: There are test failures.

Please refer to /opt/grid/slave/workspace/surefire/jdk/java-5x/label/ubuntu/trunk/surefire-integration-tests/target/failsafe-reports
for the individual test results.
	at org.apache.maven.lifecycle.DefaultLifecycleExecutor.executeGoals(DefaultLifecycleExecutor.java:715)
	at org.apache.maven.lifecycle.DefaultLifecycleExecutor.executeGoalWithLifecycle(DefaultLifecycleExecutor.java:556)
	at org.apache.maven.lifecycle.DefaultLifecycleExecutor.executeGoal(DefaultLifecycleExecutor.java:535)
	at org.apache.maven.lifecycle.DefaultLifecycleExecutor.executeGoalAndHandleFailures(DefaultLifecycleExecutor.java:387)
	at org.apache.maven.lifecycle.DefaultLifecycleExecutor.executeTaskSegments(DefaultLifecycleExecutor.java:348)
	at org.apache.maven.lifecycle.DefaultLifecycleExecutor.execute(DefaultLifecycleExecutor.java:180)
	at org.apache.maven.DefaultMaven.doExecute(DefaultMaven.java:328)
	at org.apache.maven.DefaultMaven.execute(DefaultMaven.java:138)
	at org.apache.maven.cli.MavenCli.main(MavenCli.java:362)
	at org.apache.maven.cli.compat.CompatibleMain.main(CompatibleMain.java:60)
	at sun.reflect.NativeMethodAccessorImpl.invoke0(Native Method)
	at sun.reflect.NativeMethodAccessorImpl.invoke(NativeMethodAccessorImpl.java:39)
	at sun.reflect.DelegatingMethodAccessorImpl.invoke(DelegatingMethodAccessorImpl.java:25)
	at java.lang.reflect.Method.invoke(Method.java:592)
	at org.codehaus.classworlds.Launcher.launchEnhanced(Launcher.java:315)
	at org.codehaus.classworlds.Launcher.launch(Launcher.java:255)
	at org.codehaus.classworlds.Launcher.mainWithExitCode(Launcher.java:430)
	at org.codehaus.classworlds.Launcher.main(Launcher.java:375)
Caused by: org.apache.maven.plugin.MojoFailureException: There are test failures.

Please refer to /opt/grid/slave/workspace/surefire/jdk/java-5x/label/ubuntu/trunk/surefire-integration-tests/target/failsafe-reports
for the individual test results.
	at org.apache.maven.plugin.failsafe.VerifyMojo.execute(VerifyMojo.java:217)
	at org.apache.maven.plugin.DefaultPluginManager.executeMojo(DefaultPluginManager.java:490)
	at org.apache.maven.lifecycle.DefaultLifecycleExecutor.executeGoals(DefaultLifecycleExecutor.java:694)
	... 17 more
[INFO] ------------------------------------------------------------------------
[INFO] Total time: 8 minutes 9 seconds
[INFO] Finished at: Thu Dec 02 14:50:34 CST 2010
[INFO] Final Memory: 83M/399M
[INFO] ------------------------------------------------------------------------


Mime
View raw message