maven-notifications mailing list archives

Site index · List index
Message view « Date » · « Thread »
Top « Date » · « Thread »
From "GRiD .ORG" <bui...@lists.sonatype.com>
Subject Build failed in Hudson: maven-scm » java-5x,windows #166
Date Sun, 26 Dec 2010 15:55:55 GMT
See <https://grid.sonatype.org/ci/job/maven-scm/./jdk=java-5x,label=windows/166/changes>

Changes:

[Olivier Lamy] remove unused imports.

[Olivier Lamy] fix junit.
upgrade to surefire 2.7.1

------------------------------------------
[...truncated 3225 lines...]
[INFO] Discovered 1 component descriptors(s)
[INFO] 
[INFO] --- maven-resources-plugin:2.4:resources (default-resources) @ maven-scm-provider-tfs
---
[INFO] Using 'UTF-8' encoding to copy filtered resources.
[INFO] skip non existing resourceDirectory X:\slave\workspace\maven-scm\jdk\java-5x\label\windows\trunk\maven-scm-providers\maven-scm-provider-tfs\src\main\resources
[INFO] Copying 3 resources
[INFO] 
[INFO] --- maven-compiler-plugin:2.3.2:compile (default-compile) @ maven-scm-provider-tfs
---
[INFO] Compiling 21 source files to X:\slave\workspace\maven-scm\jdk\java-5x\label\windows\trunk\maven-scm-providers\maven-scm-provider-tfs\target\classes
[INFO] 
[INFO] --- maven-resources-plugin:2.4:testResources (default-testResources) @ maven-scm-provider-tfs
---
[INFO] Using 'UTF-8' encoding to copy filtered resources.
[INFO] Copying 1 resource
[INFO] Copying 3 resources
[INFO] 
[INFO] --- maven-compiler-plugin:2.3.2:testCompile (default-testCompile) @ maven-scm-provider-tfs
---
[INFO] Compiling 13 source files to X:\slave\workspace\maven-scm\jdk\java-5x\label\windows\trunk\maven-scm-providers\maven-scm-provider-tfs\target\test-classes
[INFO] 
[INFO] --- maven-surefire-plugin:2.7.1:test (default-test) @ maven-scm-provider-tfs ---
[INFO] Surefire report directory: X:\slave\workspace\maven-scm\jdk\java-5x\label\windows\trunk\maven-scm-providers\maven-scm-provider-tfs\target\surefire-reports

-------------------------------------------------------
 T E S T S
-------------------------------------------------------
Running org.apache.maven.scm.provider.tfs.command.blame.TfsBlameConsumerTest
Tests run: 1, Failures: 0, Errors: 0, Skipped: 0, Time elapsed: 0.204 sec
Running org.apache.maven.scm.provider.tfs.command.TfsAddCommandTest
Tests run: 2, Failures: 0, Errors: 0, Skipped: 0, Time elapsed: 0.053 sec
Running org.apache.maven.scm.provider.tfs.command.TfsBranchCommandTest
Tests run: 2, Failures: 0, Errors: 0, Skipped: 0, Time elapsed: 0.021 sec
Running org.apache.maven.scm.provider.tfs.command.TfsChangeLogCommandTest
Tests run: 4, Failures: 0, Errors: 0, Skipped: 0, Time elapsed: 0.056 sec
Running org.apache.maven.scm.provider.tfs.command.TfsCheckInCommandTest
Tests run: 2, Failures: 0, Errors: 0, Skipped: 0, Time elapsed: 0.032 sec
Running org.apache.maven.scm.provider.tfs.command.TfsCheckOutCommandTest
Tests run: 4, Failures: 0, Errors: 0, Skipped: 0, Time elapsed: 0.039 sec
Running org.apache.maven.scm.provider.tfs.command.TfsCommandTest
Tests run: 1, Failures: 0, Errors: 0, Skipped: 0, Time elapsed: 0.015 sec
Running org.apache.maven.scm.provider.tfs.command.TfsEditCommandTest
Tests run: 3, Failures: 0, Errors: 0, Skipped: 0, Time elapsed: 0.045 sec
Running org.apache.maven.scm.provider.tfs.command.TfsListCommandTest
Tests run: 3, Failures: 0, Errors: 0, Skipped: 0, Time elapsed: 0.031 sec
Running org.apache.maven.scm.provider.tfs.command.TfsStatusCommandTest
Tests run: 4, Failures: 0, Errors: 0, Skipped: 0, Time elapsed: 0.064 sec
Running org.apache.maven.scm.provider.tfs.command.TfsTagCommandTest
Tests run: 2, Failures: 0, Errors: 0, Skipped: 0, Time elapsed: 0.02 sec
Running org.apache.maven.scm.provider.tfs.command.TfsUnEditCommandTest
Tests run: 2, Failures: 0, Errors: 0, Skipped: 0, Time elapsed: 0.038 sec
Running org.apache.maven.scm.provider.tfs.command.TfsUpdateCommandTest
Tests run: 2, Failures: 0, Errors: 0, Skipped: 0, Time elapsed: 0.018 sec

Results :

Tests run: 32, Failures: 0, Errors: 0, Skipped: 0

[INFO] 
[INFO] --- maven-jar-plugin:2.3:jar (default-jar) @ maven-scm-provider-tfs ---
[INFO] Building jar: X:\slave\workspace\maven-scm\jdk\java-5x\label\windows\trunk\maven-scm-providers\maven-scm-provider-tfs\target\maven-scm-provider-tfs-1.5-SNAPSHOT.jar
[INFO] 
[INFO] --- maven-site-plugin:3.0-beta-3:attach-descriptor (attach-descriptor) @ maven-scm-provider-tfs
---
[INFO] 
[INFO] --- maven-install-plugin:2.3:install (default-install) @ maven-scm-provider-tfs ---
[INFO] Installing X:\slave\workspace\maven-scm\jdk\java-5x\label\windows\trunk\maven-scm-providers\maven-scm-provider-tfs\target\maven-scm-provider-tfs-1.5-SNAPSHOT.jar
to x:\slave\workspace\maven-scm\jdk\java-5x\label\windows\.repository\org\apache\maven\scm\maven-scm-provider-tfs\1.5-SNAPSHOT\maven-scm-provider-tfs-1.5-SNAPSHOT.jar
[INFO] Installing X:\slave\workspace\maven-scm\jdk\java-5x\label\windows\trunk\maven-scm-providers\maven-scm-provider-tfs\pom.xml
to x:\slave\workspace\maven-scm\jdk\java-5x\label\windows\.repository\org\apache\maven\scm\maven-scm-provider-tfs\1.5-SNAPSHOT\maven-scm-provider-tfs-1.5-SNAPSHOT.pom
[INFO] 
[INFO] --- maven-deploy-plugin:2.5:deploy (default-deploy) @ maven-scm-provider-tfs ---
Downloading: file:/opt/repos/deploy-junk/org/apache/maven/scm/maven-scm-provider-tfs/1.5-SNAPSHOT/maven-metadata.xml
Downloaded: file:/opt/repos/deploy-junk/org/apache/maven/scm/maven-scm-provider-tfs/1.5-SNAPSHOT/maven-metadata.xml
(786 B at 24.8 KB/sec)
Uploading: file:/opt/repos/deploy-junk/org/apache/maven/scm/maven-scm-provider-tfs/1.5-SNAPSHOT/maven-scm-provider-tfs-1.5-20101226.155534-5.jar
Uploaded: file:/opt/repos/deploy-junk/org/apache/maven/scm/maven-scm-provider-tfs/1.5-SNAPSHOT/maven-scm-provider-tfs-1.5-20101226.155534-5.jar
(41 KB at 3091.7 KB/sec)
Uploading: file:/opt/repos/deploy-junk/org/apache/maven/scm/maven-scm-provider-tfs/1.5-SNAPSHOT/maven-scm-provider-tfs-1.5-20101226.155534-5.pom
Uploaded: file:/opt/repos/deploy-junk/org/apache/maven/scm/maven-scm-provider-tfs/1.5-SNAPSHOT/maven-scm-provider-tfs-1.5-20101226.155534-5.pom
(3 KB at 577.1 KB/sec)
Downloading: file:/opt/repos/deploy-junk/org/apache/maven/scm/maven-scm-provider-tfs/maven-metadata.xml
Downloaded: file:/opt/repos/deploy-junk/org/apache/maven/scm/maven-scm-provider-tfs/maven-metadata.xml
(300 B at 97.7 KB/sec)
Uploading: file:/opt/repos/deploy-junk/org/apache/maven/scm/maven-scm-provider-tfs/1.5-SNAPSHOT/maven-metadata.xml
Uploaded: file:/opt/repos/deploy-junk/org/apache/maven/scm/maven-scm-provider-tfs/1.5-SNAPSHOT/maven-metadata.xml
(786 B at 153.5 KB/sec)
Uploading: file:/opt/repos/deploy-junk/org/apache/maven/scm/maven-scm-provider-tfs/maven-metadata.xml
Uploaded: file:/opt/repos/deploy-junk/org/apache/maven/scm/maven-scm-provider-tfs/maven-metadata.xml
(300 B at 73.2 KB/sec)
[INFO]                                                                         
[INFO] ------------------------------------------------------------------------
[INFO] Skipping Maven SCM Standard Providers
[INFO] This project has been banned from the build due to previous failures.
[INFO] ------------------------------------------------------------------------
[INFO]                                                                         
[INFO] ------------------------------------------------------------------------
[INFO] Skipping Maven SCM Client
[INFO] This project has been banned from the build due to previous failures.
[INFO] ------------------------------------------------------------------------
[INFO]                                                                         
[INFO] ------------------------------------------------------------------------
[INFO] Skipping Maven SCM Plugin
[INFO] This project has been banned from the build due to previous failures.
[INFO] ------------------------------------------------------------------------
[INFO] ------------------------------------------------------------------------
[INFO] Reactor Summary:
[INFO] 
[INFO] Maven SCM ......................................... SUCCESS [42.523s]
[INFO] Maven SCM API ..................................... SUCCESS [7.602s]
[INFO] Maven SCM Managers ................................ SUCCESS [0.167s]
[INFO] Maven SCM Manager for Plexus ...................... SUCCESS [3.889s]
[INFO] Maven SCM Test .................................... SUCCESS [2.137s]
[INFO] Maven SCM Providers ............................... SUCCESS [0.220s]
[INFO] Maven SCM AccuRev Provider ........................ SUCCESS [6.334s]
[INFO] Maven SCM Bazaar Provider ......................... SUCCESS [2.426s]
[INFO] Maven SCM Clearcase Provider ...................... SUCCESS [4.211s]
[INFO] Maven SCM CVS Provider - Parent ................... SUCCESS [0.151s]
[INFO] Maven SCM CVS Provider TCK tests .................. SUCCESS [3.428s]
[INFO] Maven SCM CVS Provider - Common library ........... SUCCESS [2.843s]
[INFO] Maven SCM CVS Provider - CVS Executable Impl. ..... FAILURE [4.160s]
[INFO] Maven SCM CVS Provider - CVS Java Impl. ........... FAILURE [5.985s]
[INFO] Maven SCM Mercurial (Hg) Provider ................. SUCCESS [3.830s]
[INFO] Maven SCM Git Provider - Parent ................... SUCCESS [0.196s]
[INFO] Maven SCM Git Provider - Common library ........... SUCCESS [2.577s]
[INFO] Maven SCM git Provider TCK Tests .................. SUCCESS [1.198s]
[INFO] Maven SCM Git Provider - Git Executable Impl. ..... SUCCESS [3.968s]
[INFO] Maven SCM Local Provider .......................... SUCCESS [4.140s]
[INFO] Maven SCM Perforce Provider ....................... SUCCESS [3.738s]
[INFO] Maven SCM Starteam Provider ....................... SUCCESS [5.207s]
[INFO] Maven SCM Subversion Provider - Parent ............ SUCCESS [0.175s]
[INFO] Maven SCM Subversion Provider - Common library .... SUCCESS [4.076s]
[INFO] Maven SCM Subversion Provider TCK Tests ........... SUCCESS [1.525s]
[INFO] Maven SCM Subversion Provider - SVN Executable Impl.  FAILURE [51.302s]
[INFO] Maven SCM Synergy Provider ........................ SUCCESS [4.567s]
[INFO] Maven SCM Visual Source Safe Provider ............. SUCCESS [3.615s]
[INFO] Maven SCM TFS Provider ............................ SUCCESS [2.963s]
[INFO] Maven SCM Standard Providers ...................... SKIPPED
[INFO] Maven SCM Client .................................. SKIPPED
[INFO] Maven SCM Plugin .................................. SKIPPED
[INFO] ------------------------------------------------------------------------
[INFO] BUILD FAILURE
[INFO] ------------------------------------------------------------------------
[INFO] Total time: 3:00.408s
[INFO] Finished at: Sun Dec 26 07:55:34 PST 2010
[INFO] Final Memory: 23M/47M
[INFO] ------------------------------------------------------------------------
[ERROR] Failed to execute goal org.apache.maven.plugins:maven-surefire-plugin:2.7.1:test (default-test)
on project maven-scm-provider-cvsexe: There are test failures.
[ERROR] 
[ERROR] Please refer to X:\slave\workspace\maven-scm\jdk\java-5x\label\windows\trunk\maven-scm-providers\maven-scm-providers-cvs\maven-scm-provider-cvsexe\target\surefire-reports
for the individual test results.
[ERROR] -> [Help 1]
org.apache.maven.lifecycle.LifecycleExecutionException: Failed to execute goal org.apache.maven.plugins:maven-surefire-plugin:2.7.1:test
(default-test) on project maven-scm-provider-cvsexe: There are test failures.

Please refer to X:\slave\workspace\maven-scm\jdk\java-5x\label\windows\trunk\maven-scm-providers\maven-scm-providers-cvs\maven-scm-provider-cvsexe\target\surefire-reports
for the individual test results.
	at org.apache.maven.lifecycle.internal.MojoExecutor.execute(MojoExecutor.java:199)
	at org.apache.maven.lifecycle.internal.MojoExecutor.execute(MojoExecutor.java:148)
	at org.apache.maven.lifecycle.internal.MojoExecutor.execute(MojoExecutor.java:140)
	at org.apache.maven.lifecycle.internal.LifecycleModuleBuilder.buildProject(LifecycleModuleBuilder.java:84)
	at org.apache.maven.lifecycle.internal.LifecycleModuleBuilder.buildProject(LifecycleModuleBuilder.java:59)
	at org.apache.maven.lifecycle.internal.LifecycleStarter.singleThreadedBuild(LifecycleStarter.java:183)
	at org.apache.maven.lifecycle.internal.LifecycleStarter.execute(LifecycleStarter.java:161)
	at org.apache.maven.DefaultMaven.doExecute(DefaultMaven.java:316)
	at org.apache.maven.DefaultMaven.execute(DefaultMaven.java:153)
	at org.apache.maven.cli.MavenCli.execute(MavenCli.java:451)
	at org.apache.maven.cli.MavenCli.doMain(MavenCli.java:188)
	at org.apache.maven.cli.MavenCli.main(MavenCli.java:134)
	at sun.reflect.NativeMethodAccessorImpl.invoke0(Native Method)
	at sun.reflect.NativeMethodAccessorImpl.invoke(NativeMethodAccessorImpl.java:39)
	at sun.reflect.DelegatingMethodAccessorImpl.invoke(DelegatingMethodAccessorImpl.java:25)
	at java.lang.reflect.Method.invoke(Method.java:592)
	at org.codehaus.plexus.classworlds.launcher.Launcher.launchEnhanced(Launcher.java:290)
	at org.codehaus.plexus.classworlds.launcher.Launcher.launch(Launcher.java:230)
	at org.codehaus.plexus.classworlds.launcher.Launcher.mainWithExitCode(Launcher.java:409)
	at org.codehaus.plexus.classworlds.launcher.Launcher.main(Launcher.java:352)
Caused by: org.apache.maven.plugin.MojoFailureException: There are test failures.

Please refer to X:\slave\workspace\maven-scm\jdk\java-5x\label\windows\trunk\maven-scm-providers\maven-scm-providers-cvs\maven-scm-provider-cvsexe\target\surefire-reports
for the individual test results.
	at org.apache.maven.plugin.surefire.SurefireHelper.reportExecution(SurefireHelper.java:74)
	at org.apache.maven.plugin.surefire.SurefirePlugin.execute(SurefirePlugin.java:631)
	at org.apache.maven.plugin.DefaultBuildPluginManager.executeMojo(DefaultBuildPluginManager.java:107)
	at org.apache.maven.lifecycle.internal.MojoExecutor.execute(MojoExecutor.java:195)
	... 19 more
[ERROR] Failed to execute goal org.apache.maven.plugins:maven-surefire-plugin:2.7.1:test (default-test)
on project maven-scm-provider-cvsjava: There are test failures.
[ERROR] 
[ERROR] Please refer to X:\slave\workspace\maven-scm\jdk\java-5x\label\windows\trunk\maven-scm-providers\maven-scm-providers-cvs\maven-scm-provider-cvsjava\target\surefire-reports
for the individual test results.
[ERROR] -> [Help 1]
org.apache.maven.lifecycle.LifecycleExecutionException: Failed to execute goal org.apache.maven.plugins:maven-surefire-plugin:2.7.1:test
(default-test) on project maven-scm-provider-cvsjava: There are test failures.

Please refer to X:\slave\workspace\maven-scm\jdk\java-5x\label\windows\trunk\maven-scm-providers\maven-scm-providers-cvs\maven-scm-provider-cvsjava\target\surefire-reports
for the individual test results.
	at org.apache.maven.lifecycle.internal.MojoExecutor.execute(MojoExecutor.java:199)
	at org.apache.maven.lifecycle.internal.MojoExecutor.execute(MojoExecutor.java:148)
	at org.apache.maven.lifecycle.internal.MojoExecutor.execute(MojoExecutor.java:140)
	at org.apache.maven.lifecycle.internal.LifecycleModuleBuilder.buildProject(LifecycleModuleBuilder.java:84)
	at org.apache.maven.lifecycle.internal.LifecycleModuleBuilder.buildProject(LifecycleModuleBuilder.java:59)
	at org.apache.maven.lifecycle.internal.LifecycleStarter.singleThreadedBuild(LifecycleStarter.java:183)
	at org.apache.maven.lifecycle.internal.LifecycleStarter.execute(LifecycleStarter.java:161)
	at org.apache.maven.DefaultMaven.doExecute(DefaultMaven.java:316)
	at org.apache.maven.DefaultMaven.execute(DefaultMaven.java:153)
	at org.apache.maven.cli.MavenCli.execute(MavenCli.java:451)
	at org.apache.maven.cli.MavenCli.doMain(MavenCli.java:188)
	at org.apache.maven.cli.MavenCli.main(MavenCli.java:134)
	at sun.reflect.NativeMethodAccessorImpl.invoke0(Native Method)
	at sun.reflect.NativeMethodAccessorImpl.invoke(NativeMethodAccessorImpl.java:39)
	at sun.reflect.DelegatingMethodAccessorImpl.invoke(DelegatingMethodAccessorImpl.java:25)
	at java.lang.reflect.Method.invoke(Method.java:592)
	at org.codehaus.plexus.classworlds.launcher.Launcher.launchEnhanced(Launcher.java:290)
	at org.codehaus.plexus.classworlds.launcher.Launcher.launch(Launcher.java:230)
	at org.codehaus.plexus.classworlds.launcher.Launcher.mainWithExitCode(Launcher.java:409)
	at org.codehaus.plexus.classworlds.launcher.Launcher.main(Launcher.java:352)
Caused by: org.apache.maven.plugin.MojoFailureException: There are test failures.

Please refer to X:\slave\workspace\maven-scm\jdk\java-5x\label\windows\trunk\maven-scm-providers\maven-scm-providers-cvs\maven-scm-provider-cvsjava\target\surefire-reports
for the individual test results.
	at org.apache.maven.plugin.surefire.SurefireHelper.reportExecution(SurefireHelper.java:74)
	at org.apache.maven.plugin.surefire.SurefirePlugin.execute(SurefirePlugin.java:631)
	at org.apache.maven.plugin.DefaultBuildPluginManager.executeMojo(DefaultBuildPluginManager.java:107)
	at org.apache.maven.lifecycle.internal.MojoExecutor.execute(MojoExecutor.java:195)
	... 19 more
[ERROR] Failed to execute goal org.apache.maven.plugins:maven-surefire-plugin:2.7.1:test (default-test)
on project maven-scm-provider-svnexe: There are test failures.
[ERROR] 
[ERROR] Please refer to X:\slave\workspace\maven-scm\jdk\java-5x\label\windows\trunk\maven-scm-providers\maven-scm-providers-svn\maven-scm-provider-svnexe\target\surefire-reports
for the individual test results.
[ERROR] -> [Help 1]
org.apache.maven.lifecycle.LifecycleExecutionException: Failed to execute goal org.apache.maven.plugins:maven-surefire-plugin:2.7.1:test
(default-test) on project maven-scm-provider-svnexe: There are test failures.

Please refer to X:\slave\workspace\maven-scm\jdk\java-5x\label\windows\trunk\maven-scm-providers\maven-scm-providers-svn\maven-scm-provider-svnexe\target\surefire-reports
for the individual test results.
	at org.apache.maven.lifecycle.internal.MojoExecutor.execute(MojoExecutor.java:199)
	at org.apache.maven.lifecycle.internal.MojoExecutor.execute(MojoExecutor.java:148)
	at org.apache.maven.lifecycle.internal.MojoExecutor.execute(MojoExecutor.java:140)
	at org.apache.maven.lifecycle.internal.LifecycleModuleBuilder.buildProject(LifecycleModuleBuilder.java:84)
	at org.apache.maven.lifecycle.internal.LifecycleModuleBuilder.buildProject(LifecycleModuleBuilder.java:59)
	at org.apache.maven.lifecycle.internal.LifecycleStarter.singleThreadedBuild(LifecycleStarter.java:183)
	at org.apache.maven.lifecycle.internal.LifecycleStarter.execute(LifecycleStarter.java:161)
	at org.apache.maven.DefaultMaven.doExecute(DefaultMaven.java:316)
	at org.apache.maven.DefaultMaven.execute(DefaultMaven.java:153)
	at org.apache.maven.cli.MavenCli.execute(MavenCli.java:451)
	at org.apache.maven.cli.MavenCli.doMain(MavenCli.java:188)
	at org.apache.maven.cli.MavenCli.main(MavenCli.java:134)
	at sun.reflect.NativeMethodAccessorImpl.invoke0(Native Method)
	at sun.reflect.NativeMethodAccessorImpl.invoke(NativeMethodAccessorImpl.java:39)
	at sun.reflect.DelegatingMethodAccessorImpl.invoke(DelegatingMethodAccessorImpl.java:25)
	at java.lang.reflect.Method.invoke(Method.java:592)
	at org.codehaus.plexus.classworlds.launcher.Launcher.launchEnhanced(Launcher.java:290)
	at org.codehaus.plexus.classworlds.launcher.Launcher.launch(Launcher.java:230)
	at org.codehaus.plexus.classworlds.launcher.Launcher.mainWithExitCode(Launcher.java:409)
	at org.codehaus.plexus.classworlds.launcher.Launcher.main(Launcher.java:352)
Caused by: org.apache.maven.plugin.MojoFailureException: There are test failures.

Please refer to X:\slave\workspace\maven-scm\jdk\java-5x\label\windows\trunk\maven-scm-providers\maven-scm-providers-svn\maven-scm-provider-svnexe\target\surefire-reports
for the individual test results.
	at org.apache.maven.plugin.surefire.SurefireHelper.reportExecution(SurefireHelper.java:74)
	at org.apache.maven.plugin.surefire.SurefirePlugin.execute(SurefirePlugin.java:631)
	at org.apache.maven.plugin.DefaultBuildPluginManager.executeMojo(DefaultBuildPluginManager.java:107)
	at org.apache.maven.lifecycle.internal.MojoExecutor.execute(MojoExecutor.java:195)
	... 19 more
[ERROR] 
[ERROR] Re-run Maven using the -X switch to enable full debug logging.
[ERROR] 
[ERROR] For more information about the errors and possible solutions, please read the following
articles:
[ERROR] [Help 1] http://cwiki.apache.org/confluence/display/MAVEN/MojoFailureException
[ERROR] 
[ERROR] After correcting the problems, you can resume the build with the command
[ERROR]   mvn <goals> -rf :maven-scm-provider-cvsexe
Recording test results


Mime
View raw message