maven-notifications mailing list archives

Site index · List index
Message view « Date » · « Thread »
Top « Date » · « Thread »
From "GRiD .ORG" <bui...@lists.sonatype.com>
Subject Build failed in Hudson: surefire » java-5x,windows #189
Date Mon, 27 Dec 2010 18:09:58 GMT
See <https://grid.sonatype.org/ci/job/surefire/./jdk=java-5x,label=windows/189/changes>

Changes:

[Kristian Rosenvold] o Disbled a test temporarily so it should be possible to get hold
of output from failing test.

Because it doesnt build on grid

------------------------------------------
[...truncated 601 lines...]
[INFO] [deploy:deploy {execution: default-deploy}]
[INFO] Retrieving previous build number from apache.snapshots.https
Uploading: file:/opt/repos/deploy-junk/org/apache/maven/plugins/maven-surefire-report-plugin/2.7.2-SNAPSHOT/maven-surefire-report-plugin-2.7.2-20101227.175919-5.jar
38K uploaded  (maven-surefire-report-plugin-2.7.2-20101227.175919-5.jar)
[INFO] Retrieving previous metadata from apache.snapshots.https
[INFO] Uploading repository metadata for: 'snapshot org.apache.maven.plugins:maven-surefire-report-plugin:2.7.2-SNAPSHOT'
[INFO] Retrieving previous metadata from apache.snapshots.https
[INFO] Uploading repository metadata for: 'artifact org.apache.maven.plugins:maven-surefire-report-plugin'
[INFO] Retrieving previous metadata from apache.snapshots.https
[INFO] Uploading repository metadata for: 'org.apache.maven.plugins'
[INFO] Uploading project information for maven-surefire-report-plugin 2.7.2-20101227.175919-5
[INFO] ------------------------------------------------------------------------
[INFO] Building Maven Surefire Integration Tests
[INFO]    task-segment: [clean, deploy]
[INFO] ------------------------------------------------------------------------
[INFO] [clean:clean {execution: default-clean}]
[INFO] Deleting X:\slave\workspace\surefire\jdk\java-5x\label\windows\trunk\surefire-integration-tests\target
[INFO] [enforcer:enforce {execution: require-maven-2.1.0}]
[INFO] [remote-resources:process {execution: default}]
[INFO] [resources:resources {execution: default-resources}]
[INFO] Using 'UTF-8' encoding to copy filtered resources.
[INFO] skip non existing resourceDirectory X:\slave\workspace\surefire\jdk\java-5x\label\windows\trunk\surefire-integration-tests\src\main\resources
[INFO] Copying 3 resources
[INFO] [compiler:compile {execution: default-compile}]
[INFO] No sources to compile
[INFO] [help:effective-settings {execution: settings.xml}]
[INFO] Effective-settings written to: X:\slave\workspace\surefire\jdk\java-5x\label\windows\trunk\surefire-integration-tests\target\private\settings.xml
[INFO] [resources:testResources {execution: default-testResources}]
[INFO] Using 'UTF-8' encoding to copy filtered resources.
[INFO] Copying 185 resources
[INFO] Copying 3 resources
[INFO] [compiler:testCompile {execution: default-testCompile}]
[INFO] Compiling 66 source files to X:\slave\workspace\surefire\jdk\java-5x\label\windows\trunk\surefire-integration-tests\target\test-classes
[WARNING] DEPRECATED [systemProperties]: Use systemPropertyVariables instead.
[INFO] [surefire:test {execution: default-test}]
[INFO] Surefire report directory: X:\slave\workspace\surefire\jdk\java-5x\label\windows\trunk\surefire-integration-tests\target\surefire-reports

-------------------------------------------------------
 T E S T S
-------------------------------------------------------
Running org.apache.maven.surefire.its.SetUpForIntegrationTest
Tests run: 1, Failures: 0, Errors: 0, Skipped: 0, Time elapsed: 0.07 sec

Results :

Tests run: 1, Failures: 0, Errors: 0, Skipped: 0

[INFO] [jar:jar {execution: default-jar}]
[INFO] Building jar: X:\slave\workspace\surefire\jdk\java-5x\label\windows\trunk\surefire-integration-tests\target\surefire-integration-tests-2.7.2-SNAPSHOT.jar
[INFO] [invoker:install {execution: default}]
[INFO] Installing X:\slave\workspace\surefire\jdk\java-5x\label\windows\trunk\maven-surefire-report-plugin\pom.xml
to X:\slave\workspace\surefire\jdk\java-5x\label\windows\trunk\surefire-integration-tests\target\it-repo\org\apache\maven\plugins\maven-surefire-report-plugin\2.7.2-SNAPSHOT\maven-surefire-report-plugin-2.7.2-SNAPSHOT.pom
[INFO] Installing X:\slave\workspace\surefire\jdk\java-5x\label\windows\trunk\maven-surefire-report-plugin\target\maven-surefire-report-plugin-2.7.2-SNAPSHOT.jar
to X:\slave\workspace\surefire\jdk\java-5x\label\windows\trunk\surefire-integration-tests\target\it-repo\org\apache\maven\plugins\maven-surefire-report-plugin\2.7.2-SNAPSHOT\maven-surefire-report-plugin-2.7.2-20101227.175919-5.jar
[INFO] Installing x:\slave\workspace\surefire\jdk\java-5x\label\windows\trunk\pom.xml to X:\slave\workspace\surefire\jdk\java-5x\label\windows\trunk\surefire-integration-tests\target\it-repo\org\apache\maven\surefire\surefire\2.7.2-SNAPSHOT\surefire-2.7.2-20101227.175919-5.pom
[INFO] Installing X:\slave\workspace\surefire\jdk\java-5x\label\windows\trunk\maven-surefire-plugin\pom.xml
to X:\slave\workspace\surefire\jdk\java-5x\label\windows\trunk\surefire-integration-tests\target\it-repo\org\apache\maven\plugins\maven-surefire-plugin\2.7.2-SNAPSHOT\maven-surefire-plugin-2.7.2-SNAPSHOT.pom
[INFO] Installing X:\slave\workspace\surefire\jdk\java-5x\label\windows\trunk\maven-surefire-plugin\target\maven-surefire-plugin-2.7.2-SNAPSHOT.jar
to X:\slave\workspace\surefire\jdk\java-5x\label\windows\trunk\surefire-integration-tests\target\it-repo\org\apache\maven\plugins\maven-surefire-plugin\2.7.2-SNAPSHOT\maven-surefire-plugin-2.7.2-20101227.175919-5.jar
[INFO] Installing X:\slave\workspace\surefire\jdk\java-5x\label\windows\trunk\surefire-booter\pom.xml
to X:\slave\workspace\surefire\jdk\java-5x\label\windows\trunk\surefire-integration-tests\target\it-repo\org\apache\maven\surefire\surefire-booter\2.7.2-SNAPSHOT\surefire-booter-2.7.2-SNAPSHOT.pom
[INFO] Installing X:\slave\workspace\surefire\jdk\java-5x\label\windows\trunk\surefire-booter\target\surefire-booter-2.7.2-SNAPSHOT.jar
to X:\slave\workspace\surefire\jdk\java-5x\label\windows\trunk\surefire-integration-tests\target\it-repo\org\apache\maven\surefire\surefire-booter\2.7.2-SNAPSHOT\surefire-booter-2.7.2-20101227.175919-5.jar
[INFO] Installing X:\slave\workspace\surefire\jdk\java-5x\label\windows\trunk\surefire-api\dependency-reduced-pom.xml
to X:\slave\workspace\surefire\jdk\java-5x\label\windows\trunk\surefire-integration-tests\target\it-repo\org\apache\maven\surefire\surefire-api\2.7.2-SNAPSHOT\surefire-api-2.7.2-SNAPSHOT.pom
[INFO] Installing X:\slave\workspace\surefire\jdk\java-5x\label\windows\trunk\surefire-api\target\surefire-api-2.7.2-SNAPSHOT.jar
to X:\slave\workspace\surefire\jdk\java-5x\label\windows\trunk\surefire-integration-tests\target\it-repo\org\apache\maven\surefire\surefire-api\2.7.2-SNAPSHOT\surefire-api-2.7.2-20101227.175919-5.jar
[INFO] Installing X:\slave\workspace\surefire\jdk\java-5x\label\windows\trunk\maven-surefire-common\pom.xml
to X:\slave\workspace\surefire\jdk\java-5x\label\windows\trunk\surefire-integration-tests\target\it-repo\org\apache\maven\surefire\maven-surefire-common\2.7.2-SNAPSHOT\maven-surefire-common-2.7.2-SNAPSHOT.pom
[INFO] Installing X:\slave\workspace\surefire\jdk\java-5x\label\windows\trunk\maven-surefire-common\target\maven-surefire-common-2.7.2-SNAPSHOT.jar
to X:\slave\workspace\surefire\jdk\java-5x\label\windows\trunk\surefire-integration-tests\target\it-repo\org\apache\maven\surefire\maven-surefire-common\2.7.2-SNAPSHOT\maven-surefire-common-2.7.2-20101227.175919-5.jar
[INFO] Installing X:\slave\workspace\surefire\jdk\java-5x\label\windows\trunk\surefire-providers\surefire-testng\pom.xml
to X:\slave\workspace\surefire\jdk\java-5x\label\windows\trunk\surefire-integration-tests\target\it-repo\org\apache\maven\surefire\surefire-testng\2.7.2-SNAPSHOT\surefire-testng-2.7.2-SNAPSHOT.pom
[INFO] Installing X:\slave\workspace\surefire\jdk\java-5x\label\windows\trunk\surefire-providers\surefire-testng\target\surefire-testng-2.7.2-SNAPSHOT.jar
to X:\slave\workspace\surefire\jdk\java-5x\label\windows\trunk\surefire-integration-tests\target\it-repo\org\apache\maven\surefire\surefire-testng\2.7.2-SNAPSHOT\surefire-testng-2.7.2-20101227.175919-5.jar
[INFO] Installing X:\slave\workspace\surefire\jdk\java-5x\label\windows\trunk\surefire-providers\pom.xml
to X:\slave\workspace\surefire\jdk\java-5x\label\windows\trunk\surefire-integration-tests\target\it-repo\org\apache\maven\surefire\surefire-providers\2.7.2-SNAPSHOT\surefire-providers-2.7.2-20101227.175919-5.pom
[INFO] Installing X:\slave\workspace\surefire\jdk\java-5x\label\windows\trunk\surefire-providers\surefire-junit\pom.xml
to X:\slave\workspace\surefire\jdk\java-5x\label\windows\trunk\surefire-integration-tests\target\it-repo\org\apache\maven\surefire\surefire-junit3\2.7.2-SNAPSHOT\surefire-junit3-2.7.2-SNAPSHOT.pom
[INFO] Installing X:\slave\workspace\surefire\jdk\java-5x\label\windows\trunk\surefire-providers\surefire-junit\target\surefire-junit3-2.7.2-SNAPSHOT.jar
to X:\slave\workspace\surefire\jdk\java-5x\label\windows\trunk\surefire-integration-tests\target\it-repo\org\apache\maven\surefire\surefire-junit3\2.7.2-SNAPSHOT\surefire-junit3-2.7.2-20101227.175919-5.jar
[INFO] Installing X:\slave\workspace\surefire\jdk\java-5x\label\windows\trunk\surefire-providers\surefire-junit4\pom.xml
to X:\slave\workspace\surefire\jdk\java-5x\label\windows\trunk\surefire-integration-tests\target\it-repo\org\apache\maven\surefire\surefire-junit4\2.7.2-SNAPSHOT\surefire-junit4-2.7.2-SNAPSHOT.pom
[INFO] Installing X:\slave\workspace\surefire\jdk\java-5x\label\windows\trunk\surefire-providers\surefire-junit4\target\surefire-junit4-2.7.2-SNAPSHOT.jar
to X:\slave\workspace\surefire\jdk\java-5x\label\windows\trunk\surefire-integration-tests\target\it-repo\org\apache\maven\surefire\surefire-junit4\2.7.2-SNAPSHOT\surefire-junit4-2.7.2-20101227.175919-5.jar
[INFO] Installing X:\slave\workspace\surefire\jdk\java-5x\label\windows\trunk\surefire-providers\surefire-junit47\pom.xml
to X:\slave\workspace\surefire\jdk\java-5x\label\windows\trunk\surefire-integration-tests\target\it-repo\org\apache\maven\surefire\surefire-junit47\2.7.2-SNAPSHOT\surefire-junit47-2.7.2-SNAPSHOT.pom
[INFO] Installing X:\slave\workspace\surefire\jdk\java-5x\label\windows\trunk\surefire-providers\surefire-junit47\target\surefire-junit47-2.7.2-SNAPSHOT.jar
to X:\slave\workspace\surefire\jdk\java-5x\label\windows\trunk\surefire-integration-tests\target\it-repo\org\apache\maven\surefire\surefire-junit47\2.7.2-SNAPSHOT\surefire-junit47-2.7.2-20101227.175919-5.jar
[INFO] Installing X:\slave\workspace\surefire\jdk\java-5x\label\windows\trunk\surefire-integration-tests\pom.xml
to X:\slave\workspace\surefire\jdk\java-5x\label\windows\trunk\surefire-integration-tests\target\it-repo\org\apache\maven\surefire\surefire-integration-tests\2.7.2-SNAPSHOT\surefire-integration-tests-2.7.2-SNAPSHOT.pom
[INFO] Installing X:\slave\workspace\surefire\jdk\java-5x\label\windows\trunk\surefire-integration-tests\target\surefire-integration-tests-2.7.2-SNAPSHOT.jar
to X:\slave\workspace\surefire\jdk\java-5x\label\windows\trunk\surefire-integration-tests\target\it-repo\org\apache\maven\surefire\surefire-integration-tests\2.7.2-SNAPSHOT\surefire-integration-tests-2.7.2-SNAPSHOT.jar
[WARNING] DEPRECATED [systemProperties]: Use systemPropertyVariables instead.
[INFO] [failsafe:integration-test {execution: default}]
[INFO] Failsafe report directory: X:\slave\workspace\surefire\jdk\java-5x\label\windows\trunk\surefire-integration-tests\target\failsafe-reports

-------------------------------------------------------
 T E S T S
-------------------------------------------------------
Running org.apache.maven.surefire.its.AbstractTestCaseIT
Tests run: 1, Failures: 0, Errors: 0, Skipped: 0, Time elapsed: 4.972 sec
Running org.apache.maven.surefire.its.AdditionalClasspathIT
Tests run: 1, Failures: 0, Errors: 0, Skipped: 0, Time elapsed: 4.624 sec
Running org.apache.maven.surefire.its.AggregateReportIT
Tests run: 1, Failures: 0, Errors: 0, Skipped: 0, Time elapsed: 7.13 sec
Running org.apache.maven.surefire.its.ArgLineIT
Tests run: 1, Failures: 0, Errors: 0, Skipped: 0, Time elapsed: 4.518 sec
Running org.apache.maven.surefire.its.CheckSingleTestIT
Tests run: 4, Failures: 0, Errors: 0, Skipped: 0, Time elapsed: 19.064 sec
Running org.apache.maven.surefire.its.CheckTestFailIfNoTestsForkModeIT
Tests run: 6, Failures: 0, Errors: 0, Skipped: 0, Time elapsed: 27.075 sec
Running org.apache.maven.surefire.its.CheckTestFailIfNoTestsIT
Tests run: 2, Failures: 0, Errors: 0, Skipped: 0, Time elapsed: 7.183 sec
Running org.apache.maven.surefire.its.CheckTestNgBeforeMethodFailureIT
Tests run: 1, Failures: 0, Errors: 0, Skipped: 0, Time elapsed: 5.147 sec
Running org.apache.maven.surefire.its.CheckTestNgBeforeMethodIT
Tests run: 1, Failures: 0, Errors: 0, Skipped: 0, Time elapsed: 4.98 sec
Running org.apache.maven.surefire.its.CheckTestNgExecuteErrorIT
Tests run: 1, Failures: 0, Errors: 0, Skipped: 0, Time elapsed: 5.323 sec
Running org.apache.maven.surefire.its.CheckTestNgGroupThreadParallelIT
Tests run: 1, Failures: 0, Errors: 0, Skipped: 0, Time elapsed: 5.567 sec
Running org.apache.maven.surefire.its.CheckTestNgJdk14IT
Tests run: 1, Failures: 0, Errors: 0, Skipped: 0, Time elapsed: 7.242 sec
Running org.apache.maven.surefire.its.CheckTestNgListenerReporterIT
Tests run: 1, Failures: 0, Errors: 0, Skipped: 0, Time elapsed: 5.218 sec
Running org.apache.maven.surefire.its.CheckTestNgPathWithSpacesIT
Tests run: 1, Failures: 0, Errors: 0, Skipped: 0, Time elapsed: 5.291 sec
Running org.apache.maven.surefire.its.CheckTestNgReportTestIT
Tests run: 1, Failures: 0, Errors: 0, Skipped: 0, Time elapsed: 11.187 sec
Running org.apache.maven.surefire.its.CheckTestNgSuiteXmlIT
Tests run: 2, Failures: 0, Errors: 0, Skipped: 0, Time elapsed: 11.122 sec
Running org.apache.maven.surefire.its.CheckTestNgSuiteXmlSingleIT
Tests run: 1, Failures: 0, Errors: 0, Skipped: 0, Time elapsed: 5.188 sec
Running org.apache.maven.surefire.its.CheckTestNgVersionsIT
Tests run: 16, Failures: 0, Errors: 0, Skipped: 0, Time elapsed: 98.777 sec
Running org.apache.maven.surefire.its.ClasspathFilteringIT
Tests run: 1, Failures: 0, Errors: 0, Skipped: 0, Time elapsed: 5.069 sec
Running org.apache.maven.surefire.its.ClassPathOrderIT
Tests run: 1, Failures: 0, Errors: 0, Skipped: 0, Time elapsed: 6.318 sec
Running org.apache.maven.surefire.its.ClasspathScopeFilteringIT
Tests run: 1, Failures: 0, Errors: 0, Skipped: 0, Time elapsed: 5.557 sec
Running org.apache.maven.surefire.its.DefaultConfigurationIT
Tests run: 1, Failures: 0, Errors: 0, Skipped: 0, Time elapsed: 5.59 sec
Running org.apache.maven.surefire.its.EnvironmentVariableIT
Tests run: 1, Failures: 0, Errors: 0, Skipped: 0, Time elapsed: 5.688 sec
Running org.apache.maven.surefire.its.ForkConsoleOutputIT
Tests run: 3, Failures: 0, Errors: 3, Skipped: 0, Time elapsed: 3.878 sec <<< FAILURE!
Running org.apache.maven.surefire.its.ForkModeIT
Tests run: 5, Failures: 0, Errors: 0, Skipped: 0, Time elapsed: 28.44 sec
Running org.apache.maven.surefire.its.IncludesExcludesIT
Tests run: 1, Failures: 0, Errors: 0, Skipped: 0, Time elapsed: 4.946 sec
Running org.apache.maven.surefire.its.JUnit44HamcrestIT
Tests run: 1, Failures: 0, Errors: 0, Skipped: 0, Time elapsed: 4.74 sec
Running org.apache.maven.surefire.its.Junit47concurrencyIT
Tests run: 1, Failures: 0, Errors: 0, Skipped: 0, Time elapsed: 4.943 sec
Running org.apache.maven.surefire.its.JUnit4ForkAlwaysStaticInitPollutionIT
Tests run: 1, Failures: 0, Errors: 0, Skipped: 0, Time elapsed: 5.269 sec
Running org.apache.maven.surefire.its.Junit4IgnoreIT
Tests run: 1, Failures: 0, Errors: 0, Skipped: 0, Time elapsed: 4.798 sec
Running org.apache.maven.surefire.its.JUnit4RunListenerIT
Tests run: 2, Failures: 0, Errors: 0, Skipped: 0, Time elapsed: 9.785 sec
Running org.apache.maven.surefire.its.Junit4VersionsIT
Tests run: 9, Failures: 0, Errors: 0, Skipped: 0, Time elapsed: 45.625 sec
Running org.apache.maven.surefire.its.PlainOldJavaClasspathIT
Tests run: 1, Failures: 0, Errors: 0, Skipped: 0, Time elapsed: 4.308 sec
Running org.apache.maven.surefire.its.PlexusConflictIT
Tests run: 2, Failures: 0, Errors: 0, Skipped: 0, Time elapsed: 10.295 sec
Running org.apache.maven.surefire.its.PojoSimpleIT
Tests run: 1, Failures: 0, Errors: 0, Skipped: 0, Time elapsed: 4.65 sec
Running org.apache.maven.surefire.its.ResultCountingIT
Tests run: 3, Failures: 0, Errors: 0, Skipped: 0, Time elapsed: 15.01 sec
Running org.apache.maven.surefire.its.RunOrderIT
Tests run: 3, Failures: 0, Errors: 0, Skipped: 0, Time elapsed: 14.09 sec
Running org.apache.maven.surefire.its.SiblingAggregatorIT
Tests run: 1, Failures: 0, Errors: 0, Skipped: 0, Time elapsed: 4.678 sec
Running org.apache.maven.surefire.its.Surefire141PluggableProvidersIT
Tests run: 1, Failures: 0, Errors: 0, Skipped: 0, Time elapsed: 10.115 sec
Running org.apache.maven.surefire.its.Surefire146ForkPerTestNoSetupIT
Tests run: 1, Failures: 0, Errors: 0, Skipped: 0, Time elapsed: 4.94 sec
Running org.apache.maven.surefire.its.Surefire162CharsetProviderIT
Tests run: 1, Failures: 0, Errors: 0, Skipped: 0, Time elapsed: 4.9 sec
Running org.apache.maven.surefire.its.Surefire224WellFormedXmlFailuresIT
Tests run: 1, Failures: 0, Errors: 0, Skipped: 0, Time elapsed: 4.639 sec
Running org.apache.maven.surefire.its.Surefire377TestNgAndJUnitTogetherIT
Tests run: 1, Failures: 0, Errors: 0, Skipped: 0, Time elapsed: 4.938 sec
Running org.apache.maven.surefire.its.Surefire408ManualProviderSelectionIT
Tests run: 1, Failures: 0, Errors: 0, Skipped: 0, Time elapsed: 6.046 sec
Running org.apache.maven.surefire.its.Surefire42NotExtendingTestCaseIT
Tests run: 1, Failures: 0, Errors: 0, Skipped: 0, Time elapsed: 4.82 sec
Running org.apache.maven.surefire.its.Surefire44InnerClassTestIT
Tests run: 1, Failures: 0, Errors: 0, Skipped: 0, Time elapsed: 4.988 sec
Running org.apache.maven.surefire.its.Surefire613TestCountInParallelIT
Tests run: 1, Failures: 0, Errors: 0, Skipped: 0, Time elapsed: 6.185 sec
Running org.apache.maven.surefire.its.Surefire621TestCountingJunit3InParallelIT
Tests run: 1, Failures: 0, Errors: 0, Skipped: 0, Time elapsed: 5.884 sec
Running org.apache.maven.surefire.its.Surefire628ConsoleOutputBeforeAndAfterClassIT
Tests run: 1, Failures: 0, Errors: 0, Skipped: 0, Time elapsed: 4.983 sec
Running org.apache.maven.surefire.its.Surefire673MockitoIT
Tests run: 1, Failures: 0, Errors: 0, Skipped: 0, Time elapsed: 5.385 sec
Running org.apache.maven.surefire.its.Surefire674BuildFailingWhenErrorsIT
Tests run: 1, Failures: 0, Errors: 0, Skipped: 0, Time elapsed: 5.13 sec
Running org.apache.maven.surefire.its.SystemPropertiesTestIT
Tests run: 2, Failures: 0, Errors: 0, Skipped: 0, Time elapsed: 9.633 sec
Running org.apache.maven.surefire.its.TimeoutForkedTestIT
Tests run: 1, Failures: 0, Errors: 0, Skipped: 0, Time elapsed: 15.147 sec
Running org.apache.maven.surefire.its.TwoTestCasesIT
Tests run: 4, Failures: 0, Errors: 0, Skipped: 0, Time elapsed: 19.007 sec
Running org.apache.maven.surefire.its.UmlautDirIT
Tests run: 2, Failures: 0, Errors: 0, Skipped: 0, Time elapsed: 9.312 sec
Running org.apache.maven.surefire.its.UseIsolatedClassLoaderIT
Tests run: 1, Failures: 0, Errors: 0, Skipped: 0, Time elapsed: 4.614 sec
Running org.apache.maven.surefire.its.WorkingDirectoryIT
Tests run: 4, Failures: 0, Errors: 0, Skipped: 0, Time elapsed: 14.69 sec
Running org.apache.maven.surefire.its.WorkingDirectoryMissingIT
Tests run: 1, Failures: 0, Errors: 0, Skipped: 0, Time elapsed: 4.62 sec

Results :

Tests in error: 
  testPrintSummaryTrueWithRedirect(org.apache.maven.surefire.its.ForkConsoleOutputIT)
  testPrintSummaryTrueWithoutRedirect(org.apache.maven.surefire.its.ForkConsoleOutputIT)
  testPrintSummaryFalseWithRedirect(org.apache.maven.surefire.its.ForkConsoleOutputIT)

Tests run: 111, Failures: 0, Errors: 3, Skipped: 0

[INFO] [failsafe:verify {execution: default}]
[INFO] Failsafe report directory: X:\slave\workspace\surefire\jdk\java-5x\label\windows\trunk\surefire-integration-tests\target\failsafe-reports
[INFO] ------------------------------------------------------------------------
[ERROR] BUILD FAILURE
[INFO] ------------------------------------------------------------------------
[INFO] There are test failures.

Please refer to X:\slave\workspace\surefire\jdk\java-5x\label\windows\trunk\surefire-integration-tests\target\failsafe-reports
for the individual test results.
[INFO] ------------------------------------------------------------------------
[INFO] Trace
org.apache.maven.BuildFailureException: There are test failures.

Please refer to X:\slave\workspace\surefire\jdk\java-5x\label\windows\trunk\surefire-integration-tests\target\failsafe-reports
for the individual test results.
	at org.apache.maven.lifecycle.DefaultLifecycleExecutor.executeGoals(DefaultLifecycleExecutor.java:715)
	at org.apache.maven.lifecycle.DefaultLifecycleExecutor.executeGoalWithLifecycle(DefaultLifecycleExecutor.java:556)
	at org.apache.maven.lifecycle.DefaultLifecycleExecutor.executeGoal(DefaultLifecycleExecutor.java:535)
	at org.apache.maven.lifecycle.DefaultLifecycleExecutor.executeGoalAndHandleFailures(DefaultLifecycleExecutor.java:387)
	at org.apache.maven.lifecycle.DefaultLifecycleExecutor.executeTaskSegments(DefaultLifecycleExecutor.java:348)
	at org.apache.maven.lifecycle.DefaultLifecycleExecutor.execute(DefaultLifecycleExecutor.java:180)
	at org.apache.maven.DefaultMaven.doExecute(DefaultMaven.java:328)
	at org.apache.maven.DefaultMaven.execute(DefaultMaven.java:138)
	at org.apache.maven.cli.MavenCli.main(MavenCli.java:362)
	at org.apache.maven.cli.compat.CompatibleMain.main(CompatibleMain.java:60)
	at sun.reflect.NativeMethodAccessorImpl.invoke0(Native Method)
	at sun.reflect.NativeMethodAccessorImpl.invoke(NativeMethodAccessorImpl.java:39)
	at sun.reflect.DelegatingMethodAccessorImpl.invoke(DelegatingMethodAccessorImpl.java:25)
	at java.lang.reflect.Method.invoke(Method.java:592)
	at org.codehaus.classworlds.Launcher.launchEnhanced(Launcher.java:315)
	at org.codehaus.classworlds.Launcher.launch(Launcher.java:255)
	at org.codehaus.classworlds.Launcher.mainWithExitCode(Launcher.java:430)
	at org.codehaus.classworlds.Launcher.main(Launcher.java:375)
Caused by: org.apache.maven.plugin.MojoFailureException: There are test failures.

Please refer to X:\slave\workspace\surefire\jdk\java-5x\label\windows\trunk\surefire-integration-tests\target\failsafe-reports
for the individual test results.
	at org.apache.maven.plugin.surefire.SurefireHelper.reportExecution(SurefireHelper.java:74)
	at org.apache.maven.plugin.failsafe.VerifyMojo.execute(VerifyMojo.java:205)
	at org.apache.maven.plugin.DefaultPluginManager.executeMojo(DefaultPluginManager.java:490)
	at org.apache.maven.lifecycle.DefaultLifecycleExecutor.executeGoals(DefaultLifecycleExecutor.java:694)
	... 17 more
[INFO] ------------------------------------------------------------------------
[INFO] Total time: 10 minutes 43 seconds
[INFO] Finished at: Mon Dec 27 10:09:56 PST 2010
[INFO] Final Memory: 46M/63M
[INFO] ------------------------------------------------------------------------


Mime
View raw message