maven-notifications mailing list archives

Site index · List index
Message view « Date » · « Thread »
Top « Date » · « Thread »
From "GRiD .ORG" <bui...@lists.sonatype.com>
Subject Build failed in Hudson: surefire » java-5x,windows #127
Date Thu, 02 Dec 2010 18:33:06 GMT
See <https://grid.sonatype.org/ci/job/surefire/./jdk=java-5x,label=windows/127/>

------------------------------------------
[...truncated 602 lines...]
WARNING: no time attribute found on testsuite element
Tests run: 8, Failures: 0, Errors: 0, Skipped: 0, Time elapsed: 0.082 sec
Running org.apache.maven.plugins.surefire.report.ReportTestCaseTest
Tests run: 4, Failures: 0, Errors: 0, Skipped: 0, Time elapsed: 0.003 sec
Running org.apache.maven.plugins.surefire.report.SurefireReportMojoTest
[WARNING] Unable to locate Test Source XRef to link to - DISABLED
Tests run: 4, Failures: 0, Errors: 0, Skipped: 0, Time elapsed: 1.473 sec

Results :

Tests run: 24, Failures: 0, Errors: 0, Skipped: 0

[INFO] [jar:jar {execution: default-jar}]
[INFO] Building jar: X:\slave\workspace\surefire\jdk\java-5x\label\windows\trunk\maven-surefire-report-plugin\target\maven-surefire-report-plugin-2.7-SNAPSHOT.jar
[INFO] [plugin:addPluginArtifactMetadata {execution: default-addPluginArtifactMetadata}]
[INFO] [install:install {execution: default-install}]
[INFO] Installing X:\slave\workspace\surefire\jdk\java-5x\label\windows\trunk\maven-surefire-report-plugin\target\maven-surefire-report-plugin-2.7-SNAPSHOT.jar
to x:\slave\workspace\surefire\jdk\java-5x\label\windows\.repository\org\apache\maven\plugins\maven-surefire-report-plugin\2.7-SNAPSHOT\maven-surefire-report-plugin-2.7-SNAPSHOT.jar
[INFO] [deploy:deploy {execution: default-deploy}]
[INFO] Retrieving previous build number from apache.snapshots.https
Uploading: file:/opt/repos/deploy-junk/org/apache/maven/plugins/maven-surefire-report-plugin/2.7-SNAPSHOT/maven-surefire-report-plugin-2.7-20101202.182425-8.jar
38K uploaded  (maven-surefire-report-plugin-2.7-20101202.182425-8.jar)
[INFO] Retrieving previous metadata from apache.snapshots.https
[INFO] Uploading repository metadata for: 'snapshot org.apache.maven.plugins:maven-surefire-report-plugin:2.7-SNAPSHOT'
[INFO] Retrieving previous metadata from apache.snapshots.https
[INFO] Uploading repository metadata for: 'artifact org.apache.maven.plugins:maven-surefire-report-plugin'
[INFO] Retrieving previous metadata from apache.snapshots.https
[INFO] Uploading repository metadata for: 'org.apache.maven.plugins'
[INFO] Uploading project information for maven-surefire-report-plugin 2.7-20101202.182425-8
[INFO] ------------------------------------------------------------------------
[INFO] Building Maven Surefire Integration Tests
[INFO]    task-segment: [clean, deploy]
[INFO] ------------------------------------------------------------------------
[INFO] [clean:clean {execution: default-clean}]
[INFO] Deleting file set: X:\slave\workspace\surefire\jdk\java-5x\label\windows\trunk\surefire-integration-tests\target
(included: [**], excluded: [])
[INFO] [enforcer:enforce {execution: require-maven-2.1.0}]
[INFO] [remote-resources:process {execution: default}]
[INFO] [resources:resources {execution: default-resources}]
[INFO] Using 'UTF-8' encoding to copy filtered resources.
[INFO] skip non existing resourceDirectory X:\slave\workspace\surefire\jdk\java-5x\label\windows\trunk\surefire-integration-tests\src\main\resources
[INFO] Copying 3 resources
[INFO] [compiler:compile {execution: default-compile}]
[INFO] No sources to compile
[INFO] [help:effective-settings {execution: settings.xml}]
[INFO] Effective-settings written to: X:\slave\workspace\surefire\jdk\java-5x\label\windows\trunk\surefire-integration-tests\target\private\settings.xml
[INFO] [resources:testResources {execution: default-testResources}]
[INFO] Using 'UTF-8' encoding to copy filtered resources.
[INFO] Copying 164 resources
[INFO] Copying 3 resources
[INFO] [compiler:testCompile {execution: default-testCompile}]
[INFO] Compiling 58 source files to X:\slave\workspace\surefire\jdk\java-5x\label\windows\trunk\surefire-integration-tests\target\test-classes
[WARNING] DEPRECATED [systemProperties]: Use systemPropertyVariables instead.
[INFO] [surefire:test {execution: default-test}]
[INFO] Surefire report directory: X:\slave\workspace\surefire\jdk\java-5x\label\windows\trunk\surefire-integration-tests\target\surefire-reports

-------------------------------------------------------
 T E S T S
-------------------------------------------------------
Running org.apache.maven.surefire.its.SetUpForIntegrationTest
Tests run: 1, Failures: 0, Errors: 0, Skipped: 0, Time elapsed: 0.084 sec

Results :

Tests run: 1, Failures: 0, Errors: 0, Skipped: 0

[INFO] [jar:jar {execution: default-jar}]
[INFO] Building jar: X:\slave\workspace\surefire\jdk\java-5x\label\windows\trunk\surefire-integration-tests\target\surefire-integration-tests-2.7-SNAPSHOT.jar
[INFO] [invoker:install {execution: default}]
[INFO] Installing X:\slave\workspace\surefire\jdk\java-5x\label\windows\trunk\maven-surefire-report-plugin\pom.xml
to X:\slave\workspace\surefire\jdk\java-5x\label\windows\trunk\surefire-integration-tests\target\it-repo\org\apache\maven\plugins\maven-surefire-report-plugin\2.7-SNAPSHOT\maven-surefire-report-plugin-2.7-SNAPSHOT.pom
[INFO] Installing X:\slave\workspace\surefire\jdk\java-5x\label\windows\trunk\maven-surefire-report-plugin\target\maven-surefire-report-plugin-2.7-SNAPSHOT.jar
to X:\slave\workspace\surefire\jdk\java-5x\label\windows\trunk\surefire-integration-tests\target\it-repo\org\apache\maven\plugins\maven-surefire-report-plugin\2.7-SNAPSHOT\maven-surefire-report-plugin-2.7-20101202.182425-8.jar
[INFO] Installing x:\slave\workspace\surefire\jdk\java-5x\label\windows\trunk\pom.xml to X:\slave\workspace\surefire\jdk\java-5x\label\windows\trunk\surefire-integration-tests\target\it-repo\org\apache\maven\surefire\surefire\2.7-SNAPSHOT\surefire-2.7-20101202.182425-11.pom
[INFO] Installing X:\slave\workspace\surefire\jdk\java-5x\label\windows\trunk\maven-surefire-plugin\pom.xml
to X:\slave\workspace\surefire\jdk\java-5x\label\windows\trunk\surefire-integration-tests\target\it-repo\org\apache\maven\plugins\maven-surefire-plugin\2.7-SNAPSHOT\maven-surefire-plugin-2.7-SNAPSHOT.pom
[INFO] Installing X:\slave\workspace\surefire\jdk\java-5x\label\windows\trunk\maven-surefire-plugin\target\maven-surefire-plugin-2.7-SNAPSHOT.jar
to X:\slave\workspace\surefire\jdk\java-5x\label\windows\trunk\surefire-integration-tests\target\it-repo\org\apache\maven\plugins\maven-surefire-plugin\2.7-SNAPSHOT\maven-surefire-plugin-2.7-20101202.182425-11.jar
[INFO] Installing X:\slave\workspace\surefire\jdk\java-5x\label\windows\trunk\surefire-booter\pom.xml
to X:\slave\workspace\surefire\jdk\java-5x\label\windows\trunk\surefire-integration-tests\target\it-repo\org\apache\maven\surefire\surefire-booter\2.7-SNAPSHOT\surefire-booter-2.7-SNAPSHOT.pom
[INFO] Installing X:\slave\workspace\surefire\jdk\java-5x\label\windows\trunk\surefire-booter\target\surefire-booter-2.7-SNAPSHOT.jar
to X:\slave\workspace\surefire\jdk\java-5x\label\windows\trunk\surefire-integration-tests\target\it-repo\org\apache\maven\surefire\surefire-booter\2.7-SNAPSHOT\surefire-booter-2.7-20101202.182425-11.jar
[INFO] Installing X:\slave\workspace\surefire\jdk\java-5x\label\windows\trunk\surefire-api\target\dependency-reduced-pom.xml
to X:\slave\workspace\surefire\jdk\java-5x\label\windows\trunk\surefire-integration-tests\target\it-repo\org\apache\maven\surefire\surefire-api\2.7-SNAPSHOT\surefire-api-2.7-SNAPSHOT.pom
[INFO] Installing X:\slave\workspace\surefire\jdk\java-5x\label\windows\trunk\surefire-api\target\surefire-api-2.7-SNAPSHOT.jar
to X:\slave\workspace\surefire\jdk\java-5x\label\windows\trunk\surefire-integration-tests\target\it-repo\org\apache\maven\surefire\surefire-api\2.7-SNAPSHOT\surefire-api-2.7-20101202.182425-11.jar
[INFO] Installing X:\slave\workspace\surefire\jdk\java-5x\label\windows\trunk\maven-surefire-common\pom.xml
to X:\slave\workspace\surefire\jdk\java-5x\label\windows\trunk\surefire-integration-tests\target\it-repo\org\apache\maven\surefire\maven-surefire-common\2.7-SNAPSHOT\maven-surefire-common-2.7-SNAPSHOT.pom
[INFO] Installing X:\slave\workspace\surefire\jdk\java-5x\label\windows\trunk\maven-surefire-common\target\maven-surefire-common-2.7-SNAPSHOT.jar
to X:\slave\workspace\surefire\jdk\java-5x\label\windows\trunk\surefire-integration-tests\target\it-repo\org\apache\maven\surefire\maven-surefire-common\2.7-SNAPSHOT\maven-surefire-common-2.7-20101202.182425-11.jar
[INFO] Installing X:\slave\workspace\surefire\jdk\java-5x\label\windows\trunk\surefire-providers\surefire-testng\pom.xml
to X:\slave\workspace\surefire\jdk\java-5x\label\windows\trunk\surefire-integration-tests\target\it-repo\org\apache\maven\surefire\surefire-testng\2.7-SNAPSHOT\surefire-testng-2.7-SNAPSHOT.pom
[INFO] Installing X:\slave\workspace\surefire\jdk\java-5x\label\windows\trunk\surefire-providers\surefire-testng\target\surefire-testng-2.7-SNAPSHOT.jar
to X:\slave\workspace\surefire\jdk\java-5x\label\windows\trunk\surefire-integration-tests\target\it-repo\org\apache\maven\surefire\surefire-testng\2.7-SNAPSHOT\surefire-testng-2.7-20101202.182425-8.jar
[INFO] Installing X:\slave\workspace\surefire\jdk\java-5x\label\windows\trunk\surefire-providers\pom.xml
to X:\slave\workspace\surefire\jdk\java-5x\label\windows\trunk\surefire-integration-tests\target\it-repo\org\apache\maven\surefire\surefire-providers\2.7-SNAPSHOT\surefire-providers-2.7-20101202.182425-11.pom
[INFO] Installing X:\slave\workspace\surefire\jdk\java-5x\label\windows\trunk\surefire-providers\surefire-junit\pom.xml
to X:\slave\workspace\surefire\jdk\java-5x\label\windows\trunk\surefire-integration-tests\target\it-repo\org\apache\maven\surefire\surefire-junit\2.7-SNAPSHOT\surefire-junit-2.7-SNAPSHOT.pom
[INFO] Installing X:\slave\workspace\surefire\jdk\java-5x\label\windows\trunk\surefire-providers\surefire-junit\target\surefire-junit-2.7-SNAPSHOT.jar
to X:\slave\workspace\surefire\jdk\java-5x\label\windows\trunk\surefire-integration-tests\target\it-repo\org\apache\maven\surefire\surefire-junit\2.7-SNAPSHOT\surefire-junit-2.7-20101202.182425-11.jar
[INFO] Installing X:\slave\workspace\surefire\jdk\java-5x\label\windows\trunk\surefire-providers\surefire-junit4\pom.xml
to X:\slave\workspace\surefire\jdk\java-5x\label\windows\trunk\surefire-integration-tests\target\it-repo\org\apache\maven\surefire\surefire-junit4\2.7-SNAPSHOT\surefire-junit4-2.7-SNAPSHOT.pom
[INFO] Installing X:\slave\workspace\surefire\jdk\java-5x\label\windows\trunk\surefire-providers\surefire-junit4\target\surefire-junit4-2.7-SNAPSHOT.jar
to X:\slave\workspace\surefire\jdk\java-5x\label\windows\trunk\surefire-integration-tests\target\it-repo\org\apache\maven\surefire\surefire-junit4\2.7-SNAPSHOT\surefire-junit4-2.7-20101202.182425-11.jar
[INFO] Installing X:\slave\workspace\surefire\jdk\java-5x\label\windows\trunk\surefire-providers\surefire-junit47\pom.xml
to X:\slave\workspace\surefire\jdk\java-5x\label\windows\trunk\surefire-integration-tests\target\it-repo\org\apache\maven\surefire\surefire-junit47\2.7-SNAPSHOT\surefire-junit47-2.7-SNAPSHOT.pom
[INFO] Installing X:\slave\workspace\surefire\jdk\java-5x\label\windows\trunk\surefire-providers\surefire-junit47\target\surefire-junit47-2.7-SNAPSHOT.jar
to X:\slave\workspace\surefire\jdk\java-5x\label\windows\trunk\surefire-integration-tests\target\it-repo\org\apache\maven\surefire\surefire-junit47\2.7-SNAPSHOT\surefire-junit47-2.7-20101202.182425-8.jar
[INFO] Installing X:\slave\workspace\surefire\jdk\java-5x\label\windows\trunk\surefire-integration-tests\pom.xml
to X:\slave\workspace\surefire\jdk\java-5x\label\windows\trunk\surefire-integration-tests\target\it-repo\org\apache\maven\surefire\surefire-integration-tests\2.7-SNAPSHOT\surefire-integration-tests-2.7-SNAPSHOT.pom
[INFO] Installing X:\slave\workspace\surefire\jdk\java-5x\label\windows\trunk\surefire-integration-tests\target\surefire-integration-tests-2.7-SNAPSHOT.jar
to X:\slave\workspace\surefire\jdk\java-5x\label\windows\trunk\surefire-integration-tests\target\it-repo\org\apache\maven\surefire\surefire-integration-tests\2.7-SNAPSHOT\surefire-integration-tests-2.7-SNAPSHOT.jar
[WARNING] DEPRECATED [systemProperties]: Use systemPropertyVariables instead.
[INFO] [failsafe:integration-test {execution: default}]
[INFO] Failsafe report directory: X:\slave\workspace\surefire\jdk\java-5x\label\windows\trunk\surefire-integration-tests\target\failsafe-reports

-------------------------------------------------------
 T E S T S
-------------------------------------------------------
Running org.apache.maven.surefire.its.Surefire44InnerClassTestIT
Tests run: 1, Failures: 0, Errors: 0, Skipped: 0, Time elapsed: 7.633 sec
Running org.apache.maven.surefire.its.UseIsolatedClassLoaderIT
Tests run: 1, Failures: 0, Errors: 0, Skipped: 0, Time elapsed: 4.076 sec
Running org.apache.maven.surefire.its.ClassPathOrderIT
Tests run: 1, Failures: 0, Errors: 0, Skipped: 0, Time elapsed: 5.714 sec
Running org.apache.maven.surefire.its.ForkModeIT
Tests run: 5, Failures: 0, Errors: 0, Skipped: 0, Time elapsed: 21.79 sec
Running org.apache.maven.surefire.its.Surefire613TestCountInParallelIT
Tests run: 1, Failures: 0, Errors: 0, Skipped: 0, Time elapsed: 4.856 sec
Running org.apache.maven.surefire.its.PlexusConflictIT
Tests run: 2, Failures: 0, Errors: 0, Skipped: 0, Time elapsed: 8.895 sec
Running org.apache.maven.surefire.its.UmlautDirIT
Tests run: 2, Failures: 0, Errors: 0, Skipped: 0, Time elapsed: 7.952 sec
Running org.apache.maven.surefire.its.TwoTestCasesIT
Tests run: 4, Failures: 0, Errors: 0, Skipped: 0, Time elapsed: 17.343 sec
Running org.apache.maven.surefire.its.Surefire146ForkPerTestNoSetupIT
Tests run: 1, Failures: 0, Errors: 0, Skipped: 0, Time elapsed: 4.131 sec
Running org.apache.maven.surefire.its.Surefire162CharsetProviderIT
Tests run: 1, Failures: 0, Errors: 0, Skipped: 0, Time elapsed: 4.14 sec
Running org.apache.maven.surefire.its.EnvironmentVariableIT
Tests run: 1, Failures: 0, Errors: 0, Skipped: 0, Time elapsed: 4.129 sec
Running org.apache.maven.surefire.its.JUnit44HamcrestIT
Tests run: 1, Failures: 0, Errors: 0, Skipped: 0, Time elapsed: 4.032 sec
Running org.apache.maven.surefire.its.ResultCountingIT
Tests run: 3, Failures: 0, Errors: 0, Skipped: 0, Time elapsed: 14.002 sec
Running org.apache.maven.surefire.its.CheckTestFailIfNoTestsIT
Tests run: 2, Failures: 0, Errors: 0, Skipped: 0, Time elapsed: 6.536 sec
Running org.apache.maven.surefire.its.CheckTestNgJdk14IT
Tests run: 1, Failures: 0, Errors: 0, Skipped: 0, Time elapsed: 4.535 sec
Running org.apache.maven.surefire.its.Surefire621TestCountingJunit3InParallelIT
Tests run: 1, Failures: 0, Errors: 0, Skipped: 0, Time elapsed: 5.537 sec
Running org.apache.maven.surefire.its.Junit47concurrencyIT
Tests run: 1, Failures: 0, Errors: 0, Skipped: 0, Time elapsed: 4.16 sec
Running org.apache.maven.surefire.its.DefaultConfigurationIT
Tests run: 1, Failures: 0, Errors: 0, Skipped: 0, Time elapsed: 4.063 sec
Running org.apache.maven.surefire.its.CheckTestNgPathWithSpacesIT
Tests run: 1, Failures: 0, Errors: 0, Skipped: 0, Time elapsed: 4.398 sec
Running org.apache.maven.surefire.its.CheckTestNgSuiteXmlSingleIT
Tests run: 1, Failures: 0, Errors: 0, Skipped: 0, Time elapsed: 4.879 sec
Running org.apache.maven.surefire.its.CheckTestNgReportTestIT
Tests run: 1, Failures: 0, Errors: 0, Skipped: 0, Time elapsed: 16.637 sec
Running org.apache.maven.surefire.its.JUnit4ForkAlwaysStaticInitPollutionIT
Tests run: 1, Failures: 0, Errors: 0, Skipped: 0, Time elapsed: 4.756 sec
Running org.apache.maven.surefire.its.TimeoutForkedTestIT
Tests run: 1, Failures: 0, Errors: 0, Skipped: 0, Time elapsed: 14.033 sec
Running org.apache.maven.surefire.its.CheckTestFailIfNoTestsForkModeIT
Tests run: 6, Failures: 0, Errors: 0, Skipped: 0, Time elapsed: 24.36 sec
Running org.apache.maven.surefire.its.CheckTestNgGroupThreadParallelIT
Tests run: 1, Failures: 0, Errors: 0, Skipped: 0, Time elapsed: 5.345 sec
Running org.apache.maven.surefire.its.PojoSimpleIT
Tests run: 1, Failures: 0, Errors: 0, Skipped: 0, Time elapsed: 4.053 sec
Running org.apache.maven.surefire.its.ArgLineIT
Tests run: 1, Failures: 0, Errors: 0, Skipped: 0, Time elapsed: 4.227 sec
Running org.apache.maven.surefire.its.Surefire377TestNgAndJUnitTogetherIT
Tests run: 1, Failures: 0, Errors: 0, Skipped: 0, Time elapsed: 4.974 sec
Running org.apache.maven.surefire.its.CheckTestNgSuiteXmlIT
Tests run: 2, Failures: 0, Errors: 0, Skipped: 0, Time elapsed: 10.105 sec
Running org.apache.maven.surefire.its.IncludesExcludesIT
Tests run: 1, Failures: 0, Errors: 0, Skipped: 0, Time elapsed: 4.252 sec
Running org.apache.maven.surefire.its.CheckTestNgBeforeMethodIT
Tests run: 1, Failures: 0, Errors: 0, Skipped: 0, Time elapsed: 4.527 sec
Running org.apache.maven.surefire.its.AbstractTestCaseIT
Tests run: 1, Failures: 0, Errors: 0, Skipped: 0, Time elapsed: 4.149 sec
Running org.apache.maven.surefire.its.CheckTestNgBeforeMethodFailureIT
Tests run: 1, Failures: 0, Errors: 0, Skipped: 0, Time elapsed: 4.228 sec
Running org.apache.maven.surefire.its.PlainOldJavaClasspathIT
Tests run: 1, Failures: 0, Errors: 0, Skipped: 0, Time elapsed: 3.973 sec
Running org.apache.maven.surefire.its.WorkingDirectoryMissingIT
Tests run: 1, Failures: 0, Errors: 0, Skipped: 0, Time elapsed: 3.941 sec
Running org.apache.maven.surefire.its.Junit4IgnoreIT
Tests run: 1, Failures: 0, Errors: 0, Skipped: 0, Time elapsed: 4.031 sec
Running org.apache.maven.surefire.its.AdditionalClasspathIT
Tests run: 1, Failures: 0, Errors: 0, Skipped: 0, Time elapsed: 3.962 sec
Running org.apache.maven.surefire.its.CheckTestNgListenerReporterIT
Tests run: 1, Failures: 0, Errors: 0, Skipped: 0, Time elapsed: 4.064 sec
Running org.apache.maven.surefire.its.SiblingAggregatorIT
Tests run: 1, Failures: 0, Errors: 0, Skipped: 0, Time elapsed: 5.846 sec
Running org.apache.maven.surefire.its.CheckTestNgVersionsIT
Tests run: 16, Failures: 0, Errors: 0, Skipped: 0, Time elapsed: 82.662 sec
Running org.apache.maven.surefire.its.Surefire224WellFormedXmlFailuresIT
Tests run: 1, Failures: 0, Errors: 0, Skipped: 0, Time elapsed: 4.154 sec
Running org.apache.maven.surefire.its.Surefire42NotExtendingTestCaseIT
Tests run: 1, Failures: 0, Errors: 0, Skipped: 0, Time elapsed: 4.232 sec
Running org.apache.maven.surefire.its.WorkingDirectoryIT
Tests run: 4, Failures: 0, Errors: 0, Skipped: 0, Time elapsed: 13.785 sec
Running org.apache.maven.surefire.its.ClasspathFilteringIT
Tests run: 1, Failures: 0, Errors: 0, Skipped: 0, Time elapsed: 4.754 sec
Running org.apache.maven.surefire.its.AggregateReportIT
Tests run: 1, Failures: 0, Errors: 0, Skipped: 0, Time elapsed: 7.137 sec
Running org.apache.maven.surefire.its.Junit4VersionsIT
Tests run: 9, Failures: 0, Errors: 0, Skipped: 0, Time elapsed: 38.514 sec
Running org.apache.maven.surefire.its.CheckSingleTestIT
Tests run: 4, Failures: 0, Errors: 0, Skipped: 0, Time elapsed: 17.366 sec
Running org.apache.maven.surefire.its.CheckTestNgExecuteErrorIT
Tests run: 1, Failures: 1, Errors: 0, Skipped: 0, Time elapsed: 4.306 sec <<< FAILURE!
Running org.apache.maven.surefire.its.Surefire628ConsoleOutputBeforeAndAfterClassIT
Tests run: 1, Failures: 0, Errors: 0, Skipped: 0, Time elapsed: 4.403 sec
Running org.apache.maven.surefire.its.ClasspathScopeFilteringIT
Tests run: 1, Failures: 0, Errors: 0, Skipped: 0, Time elapsed: 4.462 sec
Running org.apache.maven.surefire.its.SystemPropertiesTestIT
Tests run: 2, Failures: 0, Errors: 0, Skipped: 0, Time elapsed: 9.5 sec

Results :

Failed tests: 
  testExecuteError(org.apache.maven.surefire.its.CheckTestNgExecuteErrorIT)

Tests run: 99, Failures: 1, Errors: 0, Skipped: 0

[INFO] [failsafe:verify {execution: default}]
[INFO] Failsafe report directory: X:\slave\workspace\surefire\jdk\java-5x\label\windows\trunk\surefire-integration-tests\target\failsafe-reports
[INFO] ------------------------------------------------------------------------
[ERROR] BUILD FAILURE
[INFO] ------------------------------------------------------------------------
[INFO] There are test failures.

Please refer to X:\slave\workspace\surefire\jdk\java-5x\label\windows\trunk\surefire-integration-tests\target\failsafe-reports
for the individual test results.
[INFO] ------------------------------------------------------------------------
[INFO] Trace
org.apache.maven.BuildFailureException: There are test failures.

Please refer to X:\slave\workspace\surefire\jdk\java-5x\label\windows\trunk\surefire-integration-tests\target\failsafe-reports
for the individual test results.
	at org.apache.maven.lifecycle.DefaultLifecycleExecutor.executeGoals(DefaultLifecycleExecutor.java:715)
	at org.apache.maven.lifecycle.DefaultLifecycleExecutor.executeGoalWithLifecycle(DefaultLifecycleExecutor.java:556)
	at org.apache.maven.lifecycle.DefaultLifecycleExecutor.executeGoal(DefaultLifecycleExecutor.java:535)
	at org.apache.maven.lifecycle.DefaultLifecycleExecutor.executeGoalAndHandleFailures(DefaultLifecycleExecutor.java:387)
	at org.apache.maven.lifecycle.DefaultLifecycleExecutor.executeTaskSegments(DefaultLifecycleExecutor.java:348)
	at org.apache.maven.lifecycle.DefaultLifecycleExecutor.execute(DefaultLifecycleExecutor.java:180)
	at org.apache.maven.DefaultMaven.doExecute(DefaultMaven.java:328)
	at org.apache.maven.DefaultMaven.execute(DefaultMaven.java:138)
	at org.apache.maven.cli.MavenCli.main(MavenCli.java:362)
	at org.apache.maven.cli.compat.CompatibleMain.main(CompatibleMain.java:60)
	at sun.reflect.NativeMethodAccessorImpl.invoke0(Native Method)
	at sun.reflect.NativeMethodAccessorImpl.invoke(NativeMethodAccessorImpl.java:39)
	at sun.reflect.DelegatingMethodAccessorImpl.invoke(DelegatingMethodAccessorImpl.java:25)
	at java.lang.reflect.Method.invoke(Method.java:592)
	at org.codehaus.classworlds.Launcher.launchEnhanced(Launcher.java:315)
	at org.codehaus.classworlds.Launcher.launch(Launcher.java:255)
	at org.codehaus.classworlds.Launcher.mainWithExitCode(Launcher.java:430)
	at org.codehaus.classworlds.Launcher.main(Launcher.java:375)
Caused by: org.apache.maven.plugin.MojoFailureException: There are test failures.

Please refer to X:\slave\workspace\surefire\jdk\java-5x\label\windows\trunk\surefire-integration-tests\target\failsafe-reports
for the individual test results.
	at org.apache.maven.plugin.failsafe.VerifyMojo.execute(VerifyMojo.java:217)
	at org.apache.maven.plugin.DefaultPluginManager.executeMojo(DefaultPluginManager.java:490)
	at org.apache.maven.lifecycle.DefaultLifecycleExecutor.executeGoals(DefaultLifecycleExecutor.java:694)
	... 17 more
[INFO] ------------------------------------------------------------------------
[INFO] Total time: 8 minutes 45 seconds
[INFO] Finished at: Thu Dec 02 10:33:05 PST 2010
[INFO] Final Memory: 37M/63M
[INFO] ------------------------------------------------------------------------


Mime
View raw message