maven-notifications mailing list archives

Site index · List index
Message view « Date » · « Thread »
Top « Date » · « Thread »
From "GRiD .ORG" <bui...@lists.sonatype.com>
Subject Build failed in Hudson: maven-plugins-ITs » java-5x,windows #542
Date Fri, 05 Nov 2010 07:15:42 GMT
See <https://grid.sonatype.org/ci/job/maven-plugins-ITs/./jdk=java-5x,label=windows/542/changes>

Changes:

[Brian Fox] MDEP-192 patch from Nikola Petrov

[Brian Fox] MDEP-281 applied patch from Selim Ok

[Benjamin Bentmann] [MDEP-215] copy-dependencies -- useSubDirectoryPerScope [patch]

o Fixed since tag

[Brian Fox] MDEP-292 applied patch from Greg Vanore

[Brian Fox] MDEP-215 - applied patch by Jo Odland. Adds useSubDirectoryPerArtifact

------------------------------------------
[...truncated 5533 lines...]
[INFO] Assembling webapp [maven-war-plugin-test] in [X:\slave\workspace\maven-plugins-ITs\jdk\java-5x\label\windows\trunk\maven-war-plugin\target\test-classes\unit\warexplodedmojo\test-dir\ExplodedWar_WithClasses]
[INFO] Processing war project
[INFO] Copying webapp resources [X:\slave\workspace\maven-plugins-ITs\jdk\java-5x\label\windows\trunk\maven-war-plugin\target\test-classes\unit\warexplodedmojo\test-dir\ExplodedWar_WithClasses-test-data\source]
[INFO] Webapp assembled in [6 msecs]
[INFO] Exploding webapp
[INFO] Assembling webapp [maven-war-plugin-test] in [X:\slave\workspace\maven-plugins-ITs\jdk\java-5x\label\windows\trunk\maven-war-plugin\target\test-classes\unit\warexplodedmojo\test-dir\ExplodedWar_WithSourceIncludeExclude]
[INFO] Processing war project
[INFO] Copying webapp resources [X:\slave\workspace\maven-plugins-ITs\jdk\java-5x\label\windows\trunk\maven-war-plugin\target\test-classes\unit\warexplodedmojo\test-dir\ExplodedWar_WithSourceIncludeExclude-test-data\source]
[INFO] Webapp assembled in [2 msecs]
[INFO] Exploding webapp
[INFO] Assembling webapp [maven-war-plugin-test] in [X:\slave\workspace\maven-plugins-ITs\jdk\java-5x\label\windows\trunk\maven-war-plugin\target\test-classes\unit\warexplodedmojo\test-dir\ExplodedWar_WithWarDependencyIncludeExclude]
[INFO] Processing war project
[INFO] Copying webapp resources [X:\slave\workspace\maven-plugins-ITs\jdk\java-5x\label\windows\trunk\maven-war-plugin\target\test-classes\unit\warexplodedmojo\test-dir\ExplodedWar_WithWarDependencyIncludeExclude-test-data\source]
[INFO] Processing overlay [ id wartests:war-include-exclude]
[INFO] Webapp assembled in [24 msecs]
[INFO] Exploding webapp
[INFO] Assembling webapp [maven-war-plugin-test] in [X:\slave\workspace\maven-plugins-ITs\jdk\java-5x\label\windows\trunk\maven-war-plugin\target\test-classes\unit\warexplodedmojo\test-dir\ExplodedWarWithSourceModificationCheck]
[INFO] Processing war project
[INFO] Copying webapp resources [X:\slave\workspace\maven-plugins-ITs\jdk\java-5x\label\windows\trunk\maven-war-plugin\target\test-classes\unit\warexplodedmojo\test-dir\ExplodedWarWithSourceModificationCheck-test-data\source]
[INFO] Webapp assembled in [8 msecs]
[INFO] Exploding webapp
[INFO] Assembling webapp [maven-war-plugin-test] in [X:\slave\workspace\maven-plugins-ITs\jdk\java-5x\label\windows\trunk\maven-war-plugin\target\test-classes\unit\warexplodedmojo\test-dir\ExplodedWarWithFileNameMapping]
[INFO] Processing war project
[INFO] Copying webapp resources [X:\slave\workspace\maven-plugins-ITs\jdk\java-5x\label\windows\trunk\maven-war-plugin\target\test-classes\unit\warexplodedmojo\test-dir\ExplodedWarWithFileNameMapping-test-data\source]
[INFO] Webapp assembled in [8 msecs]
[INFO] Exploding webapp
[INFO] Assembling webapp [maven-war-plugin-test] in [X:\slave\workspace\maven-plugins-ITs\jdk\java-5x\label\windows\trunk\maven-war-plugin\target\test-classes\unit\warexplodedmojo\test-dir\ExplodedWarWithFileNameMappingAndDuplicateDependencies]
[INFO] Processing war project
[INFO] Copying webapp resources [X:\slave\workspace\maven-plugins-ITs\jdk\java-5x\label\windows\trunk\maven-war-plugin\target\test-classes\unit\warexplodedmojo\test-dir\ExplodedWarWithFileNameMappingAndDuplicateDependencies-test-data\source]
[INFO] Webapp assembled in [9 msecs]
Tests run: 21, Failures: 0, Errors: 0, Skipped: 0, Time elapsed: 1.844 sec
Running org.apache.maven.plugin.war.WarInPlaceMojoTest
[INFO] Generating webapp in source directory [X:\slave\workspace\maven-plugins-ITs\jdk\java-5x\label\windows\trunk\maven-war-plugin\target\test-classes\unit\warexplodedinplacemojo\test-dir\SimpleExplodedInplaceWar-test-data\source]
[INFO] Assembling webapp [maven-war-plugin-test] in [X:\slave\workspace\maven-plugins-ITs\jdk\java-5x\label\windows\trunk\maven-war-plugin\target\test-classes\unit\warexplodedinplacemojo\test-dir\SimpleExplodedInplaceWar-test-data\source]
[INFO] Processing war project
[INFO] Copying webapp webResources [X:\slave\workspace\maven-plugins-ITs\jdk\java-5x\label\windows\trunk\maven-war-plugin\target\test-classes\unit\warexplodedinplacemojo\test-dir\resources]
to [X:\slave\workspace\maven-plugins-ITs\jdk\java-5x\label\windows\trunk\maven-war-plugin\target\test-classes\unit\warexplodedinplacemojo\test-dir\SimpleExplodedInplaceWar-test-data\source]
[INFO] Webapp assembled in [4 msecs]
Tests run: 2, Failures: 0, Errors: 0, Skipped: 0, Time elapsed: 0.118 sec
Running org.apache.maven.plugin.war.WarManifestMojoTest
Tests run: 6, Failures: 0, Errors: 0, Skipped: 0, Time elapsed: 0.334 sec
Running org.apache.maven.plugin.war.util.PathSetTest
Tests run: 5, Failures: 0, Errors: 0, Skipped: 0, Time elapsed: 0.011 sec
Running org.apache.maven.plugin.war.util.WarUtilsTest
Tests run: 1, Failures: 0, Errors: 0, Skipped: 0, Time elapsed: 0.011 sec
Running org.apache.maven.plugin.war.overlay.OverlayManagerTest
Tests run: 5, Failures: 0, Errors: 0, Skipped: 0, Time elapsed: 0.31 sec
Running org.apache.maven.plugin.war.WarDependenciesAnalysisTest
[INFO] Exploding webapp
[INFO] Assembling webapp [maven-war-plugin-test] in [X:\slave\workspace\maven-plugins-ITs\jdk\java-5x\label\windows\trunk\maven-war-plugin\target\test-classes\unit\dependenciesanalysis\test-dir\no-change]
[INFO] Processing war project
[INFO] Copying webapp resources [X:\slave\workspace\maven-plugins-ITs\jdk\java-5x\label\windows\trunk\maven-war-plugin\target\test-classes\unit\dependenciesanalysis\test-dir\no-change-test-data\source]
[INFO] Webapp assembled in [11 msecs]
[INFO] Exploding webapp
[INFO] Assembling webapp [maven-war-plugin-test] in [X:\slave\workspace\maven-plugins-ITs\jdk\java-5x\label\windows\trunk\maven-war-plugin\target\test-classes\unit\dependenciesanalysis\test-dir\no-change]
[INFO] Processing war project
[INFO] Copying webapp resources [X:\slave\workspace\maven-plugins-ITs\jdk\java-5x\label\windows\trunk\maven-war-plugin\target\test-classes\unit\dependenciesanalysis\test-dir\no-change-test-data\source]
[INFO] Webapp assembled in [5 msecs]
[INFO] Exploding webapp
[INFO] Assembling webapp [maven-war-plugin-test] in [X:\slave\workspace\maven-plugins-ITs\jdk\java-5x\label\windows\trunk\maven-war-plugin\target\test-classes\unit\dependenciesanalysis\test-dir\remove-dependency]
[INFO] Processing war project
[INFO] Copying webapp resources [X:\slave\workspace\maven-plugins-ITs\jdk\java-5x\label\windows\trunk\maven-war-plugin\target\test-classes\unit\dependenciesanalysis\test-dir\remove-dependency-test-data\source]
[INFO] Webapp assembled in [12 msecs]
[INFO] Exploding webapp
[INFO] Assembling webapp [maven-war-plugin-test] in [X:\slave\workspace\maven-plugins-ITs\jdk\java-5x\label\windows\trunk\maven-war-plugin\target\test-classes\unit\dependenciesanalysis\test-dir\remove-dependency]
[INFO] Dependency [Dependency {groupId=org.sample.jar, artifactId=lib-test, version=1.0, type=jar}]
has been removed from the project.
[INFO] Processing war project
[INFO] Copying webapp resources [X:\slave\workspace\maven-plugins-ITs\jdk\java-5x\label\windows\trunk\maven-war-plugin\target\test-classes\unit\dependenciesanalysis\test-dir\remove-dependency-test-data\source]
[INFO] Webapp assembled in [7 msecs]
[INFO] Exploding webapp
[INFO] Assembling webapp [maven-war-plugin-test] in [X:\slave\workspace\maven-plugins-ITs\jdk\java-5x\label\windows\trunk\maven-war-plugin\target\test-classes\unit\dependenciesanalysis\test-dir\dependency-update-version]
[INFO] Processing war project
[INFO] Copying webapp resources [X:\slave\workspace\maven-plugins-ITs\jdk\java-5x\label\windows\trunk\maven-war-plugin\target\test-classes\unit\dependenciesanalysis\test-dir\dependency-update-version-test-data\source]
[INFO] Webapp assembled in [9 msecs]
[INFO] Exploding webapp
[INFO] Assembling webapp [maven-war-plugin-test] in [X:\slave\workspace\maven-plugins-ITs\jdk\java-5x\label\windows\trunk\maven-war-plugin\target\test-classes\unit\dependenciesanalysis\test-dir\dependency-update-version]
[INFO] Version of dependency [Dependency {groupId=org.sample.jar, artifactId=lib-test, version=2.0,
type=jar}] has changed (1.0 -> 2.0).
[INFO] Processing war project
[INFO] Copying webapp resources [X:\slave\workspace\maven-plugins-ITs\jdk\java-5x\label\windows\trunk\maven-war-plugin\target\test-classes\unit\dependenciesanalysis\test-dir\dependency-update-version-test-data\source]
[INFO] Webapp assembled in [8 msecs]
[INFO] Exploding webapp
[INFO] Assembling webapp [maven-war-plugin-test] in [X:\slave\workspace\maven-plugins-ITs\jdk\java-5x\label\windows\trunk\maven-war-plugin\target\test-classes\unit\dependenciesanalysis\test-dir\dependency-now-provided]
[INFO] Processing war project
[INFO] Copying webapp resources [X:\slave\workspace\maven-plugins-ITs\jdk\java-5x\label\windows\trunk\maven-war-plugin\target\test-classes\unit\dependenciesanalysis\test-dir\dependency-now-provided-test-data\source]
[INFO] Webapp assembled in [13 msecs]
[INFO] Exploding webapp
[INFO] Assembling webapp [maven-war-plugin-test] in [X:\slave\workspace\maven-plugins-ITs\jdk\java-5x\label\windows\trunk\maven-war-plugin\target\test-classes\unit\dependenciesanalysis\test-dir\dependency-now-provided]
[INFO] Scope of dependency [Dependency {groupId=org.sample.jar, artifactId=lib-test, version=1.0,
type=jar}] has changed (runtime -> provided).
[INFO] Processing war project
[INFO] Copying webapp resources [X:\slave\workspace\maven-plugins-ITs\jdk\java-5x\label\windows\trunk\maven-war-plugin\target\test-classes\unit\dependenciesanalysis\test-dir\dependency-now-provided-test-data\source]
[INFO] Webapp assembled in [7 msecs]
Tests run: 4, Failures: 0, Errors: 0, Skipped: 0, Time elapsed: 0.363 sec

Results :

Tests run: 83, Failures: 0, Errors: 0, Skipped: 0

[INFO] [jar:jar {execution: default-jar}]
[INFO] Building jar: X:\slave\workspace\maven-plugins-ITs\jdk\java-5x\label\windows\trunk\maven-war-plugin\target\maven-war-plugin-2.2-SNAPSHOT.jar
[INFO] [plugin:addPluginArtifactMetadata {execution: default-addPluginArtifactMetadata}]
[INFO] [invoker:install {execution: integration-test}]
[INFO] Installing X:\slave\workspace\maven-plugins-ITs\jdk\java-5x\label\windows\trunk\maven-war-plugin\pom.xml
to X:\slave\workspace\maven-plugins-ITs\jdk\java-5x\label\windows\trunk\maven-war-plugin\target\local-repo\org\apache\maven\plugins\maven-war-plugin\2.2-SNAPSHOT\maven-war-plugin-2.2-SNAPSHOT.pom
[INFO] Installing X:\slave\workspace\maven-plugins-ITs\jdk\java-5x\label\windows\trunk\maven-war-plugin\target\maven-war-plugin-2.2-SNAPSHOT.jar
to X:\slave\workspace\maven-plugins-ITs\jdk\java-5x\label\windows\trunk\maven-war-plugin\target\local-repo\org\apache\maven\plugins\maven-war-plugin\2.2-SNAPSHOT\maven-war-plugin-2.2-SNAPSHOT.jar
[INFO] [invoker:run {execution: integration-test}]
[INFO] Building: default\pom.xml
[INFO] ..SUCCESS (11.3 s)
[INFO] Building: MWAR-129\pom.xml
[INFO] ..SUCCESS (2.7 s)
[INFO] Building: MWAR-131\pom.xml
[INFO] ..SUCCESS (28.8 s)
[INFO] Building: MWAR-133\pom.xml
[INFO] ..SUCCESS (3.5 s)
[INFO] Building: MWAR-139\pom.xml
[INFO] ..SUCCESS (3.3 s)
[INFO] Building: MWAR-143\pom.xml
[INFO] ..SUCCESS (8.5 s)
[INFO] Building: MWAR-62\pom.xml
[INFO] ..SUCCESS (3.1 s)
[INFO] Building: MWAR-96\pom.xml
[INFO] ..SUCCESS (3.3 s)
[INFO] Building: scoped-dependency-same-artifact\pom.xml
[INFO] ..SUCCESS (5.1 s)
[INFO] Building: simple-war-no-webxml\pom.xml
[INFO] ..SUCCESS (3.4 s)
[INFO] Building: simple-war-project\pom.xml
[INFO] ..SUCCESS (3.4 s)
[INFO] Building: web-resources-filtering\pom.xml
[INFO] ..SUCCESS (4.8 s)
[INFO] ---------------------------------------
[INFO] Execution Summary:
[INFO]   Builds Passing: 12
[INFO]   Builds Failing: 0
[INFO]   Builds Skipped: 0
[INFO] ---------------------------------------
[INFO] [install:install {execution: default-install}]
[INFO] Installing X:\slave\workspace\maven-plugins-ITs\jdk\java-5x\label\windows\trunk\maven-war-plugin\target\maven-war-plugin-2.2-SNAPSHOT.jar
to x:\slave\workspace\maven-plugins-ITs\jdk\java-5x\label\windows\.repository\org\apache\maven\plugins\maven-war-plugin\2.2-SNAPSHOT\maven-war-plugin-2.2-SNAPSHOT.jar
[INFO] [deploy:deploy {execution: default-deploy}]
[INFO] Retrieving previous build number from apache.snapshots.https
Uploading: file:/opt/repos/deploy-junk/org/apache/maven/plugins/maven-war-plugin/2.2-SNAPSHOT/maven-war-plugin-2.2-20101105.060522-15.jar
75K uploaded  (maven-war-plugin-2.2-20101105.060522-15.jar)
[INFO] Retrieving previous metadata from apache.snapshots.https
[INFO] Uploading repository metadata for: 'artifact org.apache.maven.plugins:maven-war-plugin'
[INFO] Retrieving previous metadata from apache.snapshots.https
[INFO] Uploading repository metadata for: 'org.apache.maven.plugins'
[INFO] Uploading project information for maven-war-plugin 2.2-20101105.060522-15
[INFO] Retrieving previous metadata from apache.snapshots.https
[INFO] Uploading repository metadata for: 'snapshot org.apache.maven.plugins:maven-war-plugin:2.2-SNAPSHOT'
[INFO] ------------------------------------------------------------------------
[INFO] Building Maven Plugins Aggregator
[INFO]    task-segment: [clean, deploy]
[INFO] ------------------------------------------------------------------------
[INFO] [clean:clean {execution: default-clean}]
[INFO] Deleting file set: x:\slave\workspace\maven-plugins-ITs\jdk\java-5x\label\windows\trunk\target
(included: [**], excluded: [])
[INFO] [remote-resources:process {execution: default}]
[INFO] [site:attach-descriptor {execution: default-attach-descriptor}]
[INFO] [install:install {execution: default-install}]
[INFO] Installing x:\slave\workspace\maven-plugins-ITs\jdk\java-5x\label\windows\trunk\pom.xml
to x:\slave\workspace\maven-plugins-ITs\jdk\java-5x\label\windows\.repository\org\apache\maven\plugins\maven-plugins-aggregator\1-SNAPSHOT\maven-plugins-aggregator-1-SNAPSHOT.pom
[INFO] [deploy:deploy {execution: default-deploy}]
[INFO] Retrieving previous build number from apache.snapshots.https
Uploading: file:/opt/repos/deploy-junk/org/apache/maven/plugins/maven-plugins-aggregator/1-SNAPSHOT/maven-plugins-aggregator-1-20101105.060522-15.pom
3K uploaded  (maven-plugins-aggregator-1-20101105.060522-15.pom)
[INFO] Retrieving previous metadata from apache.snapshots.https
[INFO] Uploading repository metadata for: 'artifact org.apache.maven.plugins:maven-plugins-aggregator'
[INFO] Retrieving previous metadata from apache.snapshots.https
[INFO] Uploading repository metadata for: 'snapshot org.apache.maven.plugins:maven-plugins-aggregator:1-SNAPSHOT'
[INFO] 
[INFO] 
[INFO] ------------------------------------------------------------------------
[INFO] Reactor Summary:
[INFO] ------------------------------------------------------------------------
[INFO] Maven Plugins ......................................... SUCCESS [8.044s]
[INFO] Maven Invoker Plugin .................................. SUCCESS [5:19.224s]
[INFO] Maven Ant Plugin ...................................... SUCCESS [2:20.107s]
[INFO] Maven AntRun Plugin ................................... SUCCESS [1:43.385s]
[INFO] Maven Eclipse Plugin .................................. SUCCESS [9:40.760s]
[INFO] Maven Changelog Plugin ................................ SUCCESS [35.083s]
[INFO] Maven Changes Report Plugin ........................... SUCCESS [1:11.579s]
[INFO] Maven Checkstyle Plugin ............................... SUCCESS [2:09.370s]
[INFO] Maven Clean Plugin .................................... SUCCESS [16.102s]
[INFO] Maven Compiler Plugin ................................. SUCCESS [30.793s]
[INFO] Maven Dependency Plugin ............................... FAILED [2:46.323s]
[INFO] Maven Deploy Plugin ................................... SUCCESS [1:59.460s]
[INFO] Maven DOAP Plugin ..................................... SUCCESS [16.465s]
[INFO] Maven Documentation Checker Plugin .................... SUCCESS [23.753s]
[INFO] Maven EAR Plugin ...................................... SUCCESS [4:17.233s]
[INFO] Maven EJB Plugin ...................................... SUCCESS [41.842s]
[INFO] Maven GPG Plugin ...................................... SUCCESS [42.668s]
[INFO] Maven Help Plugin ..................................... SUCCESS [42.943s]
[INFO] Maven IDEA Plugin ..................................... SUCCESS [10.954s]
[INFO] Maven Install Plugin .................................. SUCCESS [1:32.099s]
[INFO] Maven JAR Plugin ...................................... SUCCESS [1:54.983s]
[INFO] Maven Jarsigner Plugin ................................ SUCCESS [1:00.103s]
[INFO] Maven Shade Plugin .................................... SUCCESS [2:48.478s]
[INFO] Maven Javadoc Plugin .................................. SUCCESS [14:16.362s]
[INFO] Maven Linkcheck Plugin ................................ SUCCESS [4.437s]
[INFO] Maven One Plugin ...................................... SUCCESS [5.416s]
[INFO] Maven Patch Plugin .................................... SUCCESS [18.452s]
[INFO] Maven PDF Plugin ...................................... SUCCESS [1:15.678s]
[INFO] Maven PMD Plugin ...................................... SUCCESS [46.760s]
[INFO] Maven RAR Plugin ...................................... SUCCESS [11.788s]
[INFO] Maven Reactor Plugin .................................. SUCCESS [4.202s]
[INFO] Maven Repository Plugin ............................... SUCCESS [1:38.271s]
[INFO] Maven Resources Plugin ................................ SUCCESS [1:01.340s]
[INFO] Maven Site Plugin ..................................... SUCCESS [4:51.121s]
[INFO] Maven Source Plugin ................................... SUCCESS [39.882s]
[INFO] Maven Stage Plugin .................................... SUCCESS [2.623s]
[INFO] Maven Toolchains Plugin ............................... SUCCESS [1.473s]
[INFO] Maven Verifier Plugin ................................. SUCCESS [12.113s]
[INFO] Maven WAR Plugin ...................................... SUCCESS [1:42.359s]
[INFO] Maven Plugins Aggregator .............................. SUCCESS [0.130s]
[INFO] ------------------------------------------------------------------------
[INFO] Error for project: Maven Dependency Plugin (during deploy)
[INFO] ------------------------------------------------------------------------
[INFO] : org.apache.maven.plugin.invoker.InvokerSession@8deca3
1 build failed.
[INFO] ------------------------------------------------------------------------
[INFO] Trace
org.apache.maven.BuildFailureException: 1 build failed.
	at org.apache.maven.lifecycle.DefaultLifecycleExecutor.executeGoals(DefaultLifecycleExecutor.java:715)
	at org.apache.maven.lifecycle.DefaultLifecycleExecutor.executeGoalWithLifecycle(DefaultLifecycleExecutor.java:556)
	at org.apache.maven.lifecycle.DefaultLifecycleExecutor.executeGoal(DefaultLifecycleExecutor.java:535)
	at org.apache.maven.lifecycle.DefaultLifecycleExecutor.executeGoalAndHandleFailures(DefaultLifecycleExecutor.java:387)
	at org.apache.maven.lifecycle.DefaultLifecycleExecutor.executeTaskSegments(DefaultLifecycleExecutor.java:348)
	at org.apache.maven.lifecycle.DefaultLifecycleExecutor.execute(DefaultLifecycleExecutor.java:180)
	at org.apache.maven.DefaultMaven.doExecute(DefaultMaven.java:328)
	at org.apache.maven.DefaultMaven.execute(DefaultMaven.java:138)
	at org.apache.maven.cli.MavenCli.main(MavenCli.java:362)
	at org.apache.maven.cli.compat.CompatibleMain.main(CompatibleMain.java:60)
	at sun.reflect.NativeMethodAccessorImpl.invoke0(Native Method)
	at sun.reflect.NativeMethodAccessorImpl.invoke(NativeMethodAccessorImpl.java:39)
	at sun.reflect.DelegatingMethodAccessorImpl.invoke(DelegatingMethodAccessorImpl.java:25)
	at java.lang.reflect.Method.invoke(Method.java:592)
	at org.codehaus.classworlds.Launcher.launchEnhanced(Launcher.java:315)
	at org.codehaus.classworlds.Launcher.launch(Launcher.java:255)
	at org.codehaus.classworlds.Launcher.mainWithExitCode(Launcher.java:430)
	at org.codehaus.classworlds.Launcher.main(Launcher.java:375)
Caused by: org.apache.maven.plugin.MojoFailureException: 1 build failed.
	at org.apache.maven.plugin.invoker.InvokerSession.handleFailures(InvokerSession.java:244)
	at org.apache.maven.plugin.invoker.InvokerMojo.processResults(InvokerMojo.java:58)
	at org.apache.maven.plugin.invoker.AbstractInvokerMojo.execute(AbstractInvokerMojo.java:601)
	at org.apache.maven.plugin.DefaultPluginManager.executeMojo(DefaultPluginManager.java:490)
	at org.apache.maven.lifecycle.DefaultLifecycleExecutor.executeGoals(DefaultLifecycleExecutor.java:694)
	... 17 more
[INFO] ------------------------------------------------------------------------
[INFO] BUILD ERRORS
[INFO] ------------------------------------------------------------------------
[INFO] Total time: 70 minutes 31 seconds
[INFO] Finished at: Fri Nov 05 00:15:39 PDT 2010
[INFO] Final Memory: 61M/169M
[INFO] ------------------------------------------------------------------------


Mime
View raw message