maven-notifications mailing list archives

Site index · List index
Message view « Date » · « Thread »
Top « Date » · « Thread »
From "GRiD .ORG" <bui...@lists.sonatype.com>
Subject Build failed in Hudson: surefire » java-5x,ubuntu #120
Date Sun, 28 Nov 2010 01:11:06 GMT
See <https://grid.sonatype.org/ci/job/surefire/./jdk=java-5x,label=ubuntu/120/changes>

Changes:

[Hervé Boutemy] o removed unused imports
o fixed typos
o fixed code formatting convention

------------------------------------------
[...truncated 649 lines...]
Tests run: 8, Failures: 0, Errors: 0, Skipped: 0, Time elapsed: 0.047 sec
Running org.apache.maven.plugins.surefire.report.SurefireReportParserTest
WARNING: no time attribute found on testsuite element
Tests run: 8, Failures: 0, Errors: 0, Skipped: 0, Time elapsed: 0.083 sec
Running org.apache.maven.plugins.surefire.report.ReportTestCaseTest
Tests run: 4, Failures: 0, Errors: 0, Skipped: 0, Time elapsed: 0.005 sec
Running org.apache.maven.plugins.surefire.report.SurefireReportMojoTest
[WARNING] Unable to locate Test Source XRef to link to - DISABLED
Tests run: 4, Failures: 0, Errors: 0, Skipped: 0, Time elapsed: 3.139 sec

Results :

Tests run: 24, Failures: 0, Errors: 0, Skipped: 0

[INFO] [jar:jar {execution: default-jar}]
[INFO] Building jar: /opt/grid/slave/workspace/surefire/jdk/java-5x/label/ubuntu/trunk/maven-surefire-report-plugin/target/maven-surefire-report-plugin-2.7-SNAPSHOT.jar
[INFO] [plugin:addPluginArtifactMetadata {execution: default-addPluginArtifactMetadata}]
[INFO] [install:install {execution: default-install}]
[INFO] Installing /opt/grid/slave/workspace/surefire/jdk/java-5x/label/ubuntu/trunk/maven-surefire-report-plugin/target/maven-surefire-report-plugin-2.7-SNAPSHOT.jar
to <https://grid.sonatype.org/ci/job/surefire/./jdk=java-5x,label=ubuntu/ws/.repository/org/apache/maven/plugins/maven-surefire-report-plugin/2.7-SNAPSHOT/maven-surefire-report-plugin-2.7-SNAPSHOT.jar>
[INFO] [deploy:deploy {execution: default-deploy}]
[INFO] Retrieving previous build number from apache.snapshots.https
Uploading: http://repository.sonatype.org:8081/content/repositories/maven.snapshots/org/apache/maven/plugins/maven-surefire-report-plugin/2.7-SNAPSHOT/maven-surefire-report-plugin-2.7-20101128.010209-38.jar
38K uploaded  (maven-surefire-report-plugin-2.7-20101128.010209-38.jar)
[INFO] Retrieving previous metadata from apache.snapshots.https
[INFO] Uploading repository metadata for: 'snapshot org.apache.maven.plugins:maven-surefire-report-plugin:2.7-SNAPSHOT'
[INFO] Retrieving previous metadata from apache.snapshots.https
[INFO] Uploading repository metadata for: 'artifact org.apache.maven.plugins:maven-surefire-report-plugin'
[INFO] Retrieving previous metadata from apache.snapshots.https
[INFO] Uploading repository metadata for: 'org.apache.maven.plugins'
[INFO] Uploading project information for maven-surefire-report-plugin 2.7-20101128.010209-38
[INFO] ------------------------------------------------------------------------
[INFO] Building Maven Surefire Integration Tests
[INFO]    task-segment: [clean, deploy]
[INFO] ------------------------------------------------------------------------
[INFO] [clean:clean {execution: default-clean}]
[INFO] Deleting file set: /opt/grid/slave/workspace/surefire/jdk/java-5x/label/ubuntu/trunk/surefire-integration-tests/target
(included: [**], excluded: [])
[INFO] [enforcer:enforce {execution: require-maven-2.1.0}]
[INFO] [remote-resources:process {execution: default}]
[INFO] [resources:resources {execution: default-resources}]
[INFO] Using 'UTF-8' encoding to copy filtered resources.
[INFO] skip non existing resourceDirectory /opt/grid/slave/workspace/surefire/jdk/java-5x/label/ubuntu/trunk/surefire-integration-tests/src/main/resources
[INFO] Copying 3 resources
[INFO] [compiler:compile {execution: default-compile}]
[INFO] No sources to compile
[INFO] [help:effective-settings {execution: settings.xml}]
[INFO] Effective-settings written to: /opt/grid/slave/workspace/surefire/jdk/java-5x/label/ubuntu/trunk/surefire-integration-tests/target/private/settings.xml
[INFO] [resources:testResources {execution: default-testResources}]
[INFO] Using 'UTF-8' encoding to copy filtered resources.
[INFO] Copying 158 resources
[INFO] Copying 3 resources
[INFO] [compiler:testCompile {execution: default-testCompile}]
[INFO] Compiling 57 source files to /opt/grid/slave/workspace/surefire/jdk/java-5x/label/ubuntu/trunk/surefire-integration-tests/target/test-classes
[WARNING] DEPRECATED [systemProperties]: Use systemPropertyVariables instead.
[INFO] [surefire:test {execution: default-test}]
[INFO] Surefire report directory: /opt/grid/slave/workspace/surefire/jdk/java-5x/label/ubuntu/trunk/surefire-integration-tests/target/surefire-reports

-------------------------------------------------------
 T E S T S
-------------------------------------------------------
Running org.apache.maven.surefire.its.SetUpForIntegrationTest
Tests run: 1, Failures: 0, Errors: 0, Skipped: 0, Time elapsed: 0.087 sec

Results :

Tests run: 1, Failures: 0, Errors: 0, Skipped: 0

[INFO] [jar:jar {execution: default-jar}]
[INFO] Building jar: /opt/grid/slave/workspace/surefire/jdk/java-5x/label/ubuntu/trunk/surefire-integration-tests/target/surefire-integration-tests-2.7-SNAPSHOT.jar
[INFO] [invoker:install {execution: default}]
[INFO] Installing /opt/grid/slave/workspace/surefire/jdk/java-5x/label/ubuntu/trunk/maven-surefire-report-plugin/pom.xml
to /opt/grid/slave/workspace/surefire/jdk/java-5x/label/ubuntu/trunk/surefire-integration-tests/target/it-repo/org/apache/maven/plugins/maven-surefire-report-plugin/2.7-SNAPSHOT/maven-surefire-report-plugin-2.7-SNAPSHOT.pom
[INFO] Installing /opt/grid/slave/workspace/surefire/jdk/java-5x/label/ubuntu/trunk/maven-surefire-report-plugin/target/maven-surefire-report-plugin-2.7-SNAPSHOT.jar
to /opt/grid/slave/workspace/surefire/jdk/java-5x/label/ubuntu/trunk/surefire-integration-tests/target/it-repo/org/apache/maven/plugins/maven-surefire-report-plugin/2.7-SNAPSHOT/maven-surefire-report-plugin-2.7-20101128.010209-38.jar
[INFO] Installing /opt/grid/slave/workspace/surefire/jdk/java-5x/label/ubuntu/trunk/pom.xml
to /opt/grid/slave/workspace/surefire/jdk/java-5x/label/ubuntu/trunk/surefire-integration-tests/target/it-repo/org/apache/maven/surefire/surefire/2.7-SNAPSHOT/surefire-2.7-20101128.010209-38.pom
[INFO] Installing /opt/grid/slave/workspace/surefire/jdk/java-5x/label/ubuntu/trunk/maven-surefire-plugin/pom.xml
to /opt/grid/slave/workspace/surefire/jdk/java-5x/label/ubuntu/trunk/surefire-integration-tests/target/it-repo/org/apache/maven/plugins/maven-surefire-plugin/2.7-SNAPSHOT/maven-surefire-plugin-2.7-SNAPSHOT.pom
[INFO] Installing /opt/grid/slave/workspace/surefire/jdk/java-5x/label/ubuntu/trunk/maven-surefire-plugin/target/maven-surefire-plugin-2.7-SNAPSHOT.jar
to /opt/grid/slave/workspace/surefire/jdk/java-5x/label/ubuntu/trunk/surefire-integration-tests/target/it-repo/org/apache/maven/plugins/maven-surefire-plugin/2.7-SNAPSHOT/maven-surefire-plugin-2.7-20101128.010209-38.jar
[INFO] Installing /opt/grid/slave/workspace/surefire/jdk/java-5x/label/ubuntu/trunk/surefire-booter/pom.xml
to /opt/grid/slave/workspace/surefire/jdk/java-5x/label/ubuntu/trunk/surefire-integration-tests/target/it-repo/org/apache/maven/surefire/surefire-booter/2.7-SNAPSHOT/surefire-booter-2.7-SNAPSHOT.pom
[INFO] Installing /opt/grid/slave/workspace/surefire/jdk/java-5x/label/ubuntu/trunk/surefire-booter/target/surefire-booter-2.7-SNAPSHOT.jar
to /opt/grid/slave/workspace/surefire/jdk/java-5x/label/ubuntu/trunk/surefire-integration-tests/target/it-repo/org/apache/maven/surefire/surefire-booter/2.7-SNAPSHOT/surefire-booter-2.7-20101128.010209-38.jar
[INFO] Installing /opt/grid/slave/workspace/surefire/jdk/java-5x/label/ubuntu/trunk/surefire-api/target/dependency-reduced-pom.xml
to /opt/grid/slave/workspace/surefire/jdk/java-5x/label/ubuntu/trunk/surefire-integration-tests/target/it-repo/org/apache/maven/surefire/surefire-api/2.7-SNAPSHOT/surefire-api-2.7-SNAPSHOT.pom
[INFO] Installing /opt/grid/slave/workspace/surefire/jdk/java-5x/label/ubuntu/trunk/surefire-api/target/surefire-api-2.7-SNAPSHOT.jar
to /opt/grid/slave/workspace/surefire/jdk/java-5x/label/ubuntu/trunk/surefire-integration-tests/target/it-repo/org/apache/maven/surefire/surefire-api/2.7-SNAPSHOT/surefire-api-2.7-20101128.010209-38.jar
[INFO] Installing /opt/grid/slave/workspace/surefire/jdk/java-5x/label/ubuntu/trunk/maven-surefire-common/pom.xml
to /opt/grid/slave/workspace/surefire/jdk/java-5x/label/ubuntu/trunk/surefire-integration-tests/target/it-repo/org/apache/maven/surefire/maven-surefire-common/2.7-SNAPSHOT/maven-surefire-common-2.7-SNAPSHOT.pom
[INFO] Installing /opt/grid/slave/workspace/surefire/jdk/java-5x/label/ubuntu/trunk/maven-surefire-common/target/maven-surefire-common-2.7-SNAPSHOT.jar
to /opt/grid/slave/workspace/surefire/jdk/java-5x/label/ubuntu/trunk/surefire-integration-tests/target/it-repo/org/apache/maven/surefire/maven-surefire-common/2.7-SNAPSHOT/maven-surefire-common-2.7-20101128.010209-38.jar
[INFO] Installing /opt/grid/slave/workspace/surefire/jdk/java-5x/label/ubuntu/trunk/surefire-providers/surefire-testng/pom.xml
to /opt/grid/slave/workspace/surefire/jdk/java-5x/label/ubuntu/trunk/surefire-integration-tests/target/it-repo/org/apache/maven/surefire/surefire-testng/2.7-SNAPSHOT/surefire-testng-2.7-SNAPSHOT.pom
[INFO] Installing /opt/grid/slave/workspace/surefire/jdk/java-5x/label/ubuntu/trunk/surefire-providers/surefire-testng/target/surefire-testng-2.7-SNAPSHOT.jar
to /opt/grid/slave/workspace/surefire/jdk/java-5x/label/ubuntu/trunk/surefire-integration-tests/target/it-repo/org/apache/maven/surefire/surefire-testng/2.7-SNAPSHOT/surefire-testng-2.7-20101128.010209-38.jar
[INFO] Installing /opt/grid/slave/workspace/surefire/jdk/java-5x/label/ubuntu/trunk/surefire-providers/pom.xml
to /opt/grid/slave/workspace/surefire/jdk/java-5x/label/ubuntu/trunk/surefire-integration-tests/target/it-repo/org/apache/maven/surefire/surefire-providers/2.7-SNAPSHOT/surefire-providers-2.7-20101128.010209-38.pom
[INFO] Installing /opt/grid/slave/workspace/surefire/jdk/java-5x/label/ubuntu/trunk/surefire-providers/surefire-junit/pom.xml
to /opt/grid/slave/workspace/surefire/jdk/java-5x/label/ubuntu/trunk/surefire-integration-tests/target/it-repo/org/apache/maven/surefire/surefire-junit/2.7-SNAPSHOT/surefire-junit-2.7-SNAPSHOT.pom
[INFO] Installing /opt/grid/slave/workspace/surefire/jdk/java-5x/label/ubuntu/trunk/surefire-providers/surefire-junit/target/surefire-junit-2.7-SNAPSHOT.jar
to /opt/grid/slave/workspace/surefire/jdk/java-5x/label/ubuntu/trunk/surefire-integration-tests/target/it-repo/org/apache/maven/surefire/surefire-junit/2.7-SNAPSHOT/surefire-junit-2.7-20101128.010209-38.jar
[INFO] Installing /opt/grid/slave/workspace/surefire/jdk/java-5x/label/ubuntu/trunk/surefire-providers/surefire-junit4/pom.xml
to /opt/grid/slave/workspace/surefire/jdk/java-5x/label/ubuntu/trunk/surefire-integration-tests/target/it-repo/org/apache/maven/surefire/surefire-junit4/2.7-SNAPSHOT/surefire-junit4-2.7-SNAPSHOT.pom
[INFO] Installing /opt/grid/slave/workspace/surefire/jdk/java-5x/label/ubuntu/trunk/surefire-providers/surefire-junit4/target/surefire-junit4-2.7-SNAPSHOT.jar
to /opt/grid/slave/workspace/surefire/jdk/java-5x/label/ubuntu/trunk/surefire-integration-tests/target/it-repo/org/apache/maven/surefire/surefire-junit4/2.7-SNAPSHOT/surefire-junit4-2.7-20101128.010209-38.jar
[INFO] Installing /opt/grid/slave/workspace/surefire/jdk/java-5x/label/ubuntu/trunk/surefire-providers/surefire-junit47/pom.xml
to /opt/grid/slave/workspace/surefire/jdk/java-5x/label/ubuntu/trunk/surefire-integration-tests/target/it-repo/org/apache/maven/surefire/surefire-junit47/2.7-SNAPSHOT/surefire-junit47-2.7-SNAPSHOT.pom
[INFO] Installing /opt/grid/slave/workspace/surefire/jdk/java-5x/label/ubuntu/trunk/surefire-providers/surefire-junit47/target/surefire-junit47-2.7-SNAPSHOT.jar
to /opt/grid/slave/workspace/surefire/jdk/java-5x/label/ubuntu/trunk/surefire-integration-tests/target/it-repo/org/apache/maven/surefire/surefire-junit47/2.7-SNAPSHOT/surefire-junit47-2.7-20101128.010209-38.jar
[INFO] Installing /opt/grid/slave/workspace/surefire/jdk/java-5x/label/ubuntu/trunk/surefire-integration-tests/pom.xml
to /opt/grid/slave/workspace/surefire/jdk/java-5x/label/ubuntu/trunk/surefire-integration-tests/target/it-repo/org/apache/maven/surefire/surefire-integration-tests/2.7-SNAPSHOT/surefire-integration-tests-2.7-SNAPSHOT.pom
[INFO] Installing /opt/grid/slave/workspace/surefire/jdk/java-5x/label/ubuntu/trunk/surefire-integration-tests/target/surefire-integration-tests-2.7-SNAPSHOT.jar
to /opt/grid/slave/workspace/surefire/jdk/java-5x/label/ubuntu/trunk/surefire-integration-tests/target/it-repo/org/apache/maven/surefire/surefire-integration-tests/2.7-SNAPSHOT/surefire-integration-tests-2.7-SNAPSHOT.jar
[WARNING] DEPRECATED [systemProperties]: Use systemPropertyVariables instead.
[INFO] [failsafe:integration-test {execution: default}]
[INFO] Failsafe report directory: /opt/grid/slave/workspace/surefire/jdk/java-5x/label/ubuntu/trunk/surefire-integration-tests/target/failsafe-reports

-------------------------------------------------------
 T E S T S
-------------------------------------------------------
Running org.apache.maven.surefire.its.UseIsolatedClassLoaderIT
Tests run: 1, Failures: 0, Errors: 0, Skipped: 0, Time elapsed: 6.511 sec
Running org.apache.maven.surefire.its.Surefire44InnerClassTestIT
Tests run: 1, Failures: 0, Errors: 0, Skipped: 0, Time elapsed: 5.75 sec
Running org.apache.maven.surefire.its.ClassPathOrderIT
Tests run: 1, Failures: 0, Errors: 0, Skipped: 0, Time elapsed: 6.059 sec
Running org.apache.maven.surefire.its.Surefire613TestCountInParallelIT
Tests run: 1, Failures: 0, Errors: 0, Skipped: 0, Time elapsed: 4.646 sec
Running org.apache.maven.surefire.its.ForkModeIT
Tests run: 5, Failures: 0, Errors: 0, Skipped: 0, Time elapsed: 23.47 sec
Running org.apache.maven.surefire.its.PlexusConflictIT
Tests run: 2, Failures: 0, Errors: 0, Skipped: 0, Time elapsed: 8.042 sec
Running org.apache.maven.surefire.its.UmlautDirIT
Tests run: 2, Failures: 0, Errors: 0, Skipped: 0, Time elapsed: 7.932 sec
Running org.apache.maven.surefire.its.TwoTestCasesIT
Tests run: 4, Failures: 0, Errors: 0, Skipped: 0, Time elapsed: 15.743 sec
Running org.apache.maven.surefire.its.Surefire146ForkPerTestNoSetupIT
Tests run: 1, Failures: 0, Errors: 0, Skipped: 0, Time elapsed: 3.673 sec
Running org.apache.maven.surefire.its.Surefire162CharsetProviderIT
Tests run: 1, Failures: 0, Errors: 0, Skipped: 0, Time elapsed: 3.884 sec
Running org.apache.maven.surefire.its.JUnit44HamcrestIT
Tests run: 1, Failures: 0, Errors: 0, Skipped: 0, Time elapsed: 3.7 sec
Running org.apache.maven.surefire.its.EnvironmentVariableIT
Tests run: 1, Failures: 0, Errors: 0, Skipped: 0, Time elapsed: 3.732 sec
Running org.apache.maven.surefire.its.CheckTestFailIfNoTestsIT
Tests run: 2, Failures: 0, Errors: 0, Skipped: 0, Time elapsed: 6.31 sec
Running org.apache.maven.surefire.its.CheckTestNgJdk14IT
Tests run: 1, Failures: 0, Errors: 0, Skipped: 0, Time elapsed: 4.23 sec
Running org.apache.maven.surefire.its.Surefire621TestCountingJunit3InParallelIT
Tests run: 1, Failures: 0, Errors: 0, Skipped: 0, Time elapsed: 6.493 sec
Running org.apache.maven.surefire.its.Junit47concurrencyIT
Tests run: 1, Failures: 0, Errors: 0, Skipped: 0, Time elapsed: 4.181 sec
Running org.apache.maven.surefire.its.DefaultConfigurationIT
Tests run: 1, Failures: 0, Errors: 0, Skipped: 0, Time elapsed: 4.073 sec
Running org.apache.maven.surefire.its.CheckTestNgPathWithSpacesIT
Tests run: 1, Failures: 0, Errors: 0, Skipped: 0, Time elapsed: 4.001 sec
Running org.apache.maven.surefire.its.CheckTestNgSuiteXmlSingleIT
Tests run: 1, Failures: 0, Errors: 0, Skipped: 0, Time elapsed: 3.868 sec
Running org.apache.maven.surefire.its.CheckTestNgReportTestIT
Tests run: 1, Failures: 0, Errors: 0, Skipped: 0, Time elapsed: 7.098 sec
Running org.apache.maven.surefire.its.JUnit4ForkAlwaysStaticInitPollutionIT
Tests run: 1, Failures: 0, Errors: 0, Skipped: 0, Time elapsed: 4.209 sec
Running org.apache.maven.surefire.its.TimeoutForkedTestIT
Tests run: 1, Failures: 0, Errors: 0, Skipped: 0, Time elapsed: 7.048 sec
Running org.apache.maven.surefire.its.CheckTestFailIfNoTestsForkModeIT
Tests run: 6, Failures: 0, Errors: 0, Skipped: 0, Time elapsed: 20.78 sec
Running org.apache.maven.surefire.its.CheckTestNgGroupThreadParallelIT
Tests run: 1, Failures: 0, Errors: 0, Skipped: 0, Time elapsed: 3.632 sec
Running org.apache.maven.surefire.its.PojoSimpleIT
Tests run: 1, Failures: 0, Errors: 0, Skipped: 0, Time elapsed: 3.26 sec
Running org.apache.maven.surefire.its.ArgLineIT
Tests run: 1, Failures: 0, Errors: 0, Skipped: 0, Time elapsed: 3.847 sec
Running org.apache.maven.surefire.its.Surefire377TestNgAndJUnitTogetherIT
Tests run: 1, Failures: 0, Errors: 0, Skipped: 0, Time elapsed: 3.892 sec
Running org.apache.maven.surefire.its.CheckTestNgSuiteXmlIT
Tests run: 2, Failures: 0, Errors: 0, Skipped: 0, Time elapsed: 7.351 sec
Running org.apache.maven.surefire.its.IncludesExcludesIT
Tests run: 1, Failures: 0, Errors: 0, Skipped: 0, Time elapsed: 3.588 sec
Running org.apache.maven.surefire.its.CheckTestNgBeforeMethodIT
Tests run: 1, Failures: 0, Errors: 0, Skipped: 0, Time elapsed: 3.781 sec
Running org.apache.maven.surefire.its.AbstractTestCaseIT
Tests run: 1, Failures: 0, Errors: 0, Skipped: 0, Time elapsed: 3.383 sec
Running org.apache.maven.surefire.its.CheckTestNgBeforeMethodFailureIT
Tests run: 1, Failures: 0, Errors: 0, Skipped: 0, Time elapsed: 3.926 sec
Running org.apache.maven.surefire.its.PlainOldJavaClasspathIT
Tests run: 1, Failures: 0, Errors: 0, Skipped: 0, Time elapsed: 3.53 sec
Running org.apache.maven.surefire.its.WorkingDirectoryMissingIT
Tests run: 1, Failures: 0, Errors: 0, Skipped: 0, Time elapsed: 3.858 sec
Running org.apache.maven.surefire.its.Junit4IgnoreIT
Tests run: 1, Failures: 0, Errors: 0, Skipped: 0, Time elapsed: 3.309 sec
Running org.apache.maven.surefire.its.AdditionalClasspathIT
Tests run: 1, Failures: 0, Errors: 0, Skipped: 0, Time elapsed: 3.57 sec
Running org.apache.maven.surefire.its.CheckTestNgListenerReporterIT
Tests run: 1, Failures: 0, Errors: 0, Skipped: 0, Time elapsed: 3.442 sec
Running org.apache.maven.surefire.its.SiblingAggregatorIT
Tests run: 1, Failures: 0, Errors: 0, Skipped: 0, Time elapsed: 3.855 sec
Running org.apache.maven.surefire.its.CheckTestNgVersionsIT
Tests run: 16, Failures: 0, Errors: 0, Skipped: 0, Time elapsed: 71.296 sec
Running org.apache.maven.surefire.its.Surefire224WellFormedXmlFailuresIT
Tests run: 1, Failures: 0, Errors: 0, Skipped: 0, Time elapsed: 4.545 sec
Running org.apache.maven.surefire.its.Surefire42NotExtendingTestCaseIT
Tests run: 1, Failures: 0, Errors: 0, Skipped: 0, Time elapsed: 4.27 sec
Running org.apache.maven.surefire.its.WorkingDirectoryIT
Tests run: 4, Failures: 0, Errors: 0, Skipped: 0, Time elapsed: 14.251 sec
Running org.apache.maven.surefire.its.AggregateReportIT
Tests run: 1, Failures: 0, Errors: 0, Skipped: 0, Time elapsed: 8.254 sec
Running org.apache.maven.surefire.its.ClasspathFilteringIT
Tests run: 1, Failures: 0, Errors: 0, Skipped: 0, Time elapsed: 4.845 sec
Running org.apache.maven.surefire.its.Junit4VersionsIT
Tests run: 9, Failures: 0, Errors: 0, Skipped: 0, Time elapsed: 44.961 sec
Running org.apache.maven.surefire.its.CheckSingleTestIT
Tests run: 4, Failures: 0, Errors: 0, Skipped: 0, Time elapsed: 16.037 sec
Running org.apache.maven.surefire.its.Surefire628ConsoleOutputBeforeAndAfterClassIT
Tests run: 1, Failures: 0, Errors: 0, Skipped: 0, Time elapsed: 4.043 sec
Running org.apache.maven.surefire.its.CheckTestNgExecuteErrorIT
Tests run: 1, Failures: 1, Errors: 0, Skipped: 0, Time elapsed: 4.079 sec <<< FAILURE!
Running org.apache.maven.surefire.its.SystemPropertiesTestIT
Tests run: 2, Failures: 0, Errors: 0, Skipped: 0, Time elapsed: 8.116 sec
Running org.apache.maven.surefire.its.ClasspathScopeFilteringIT
Tests run: 1, Failures: 0, Errors: 0, Skipped: 0, Time elapsed: 4.608 sec

Results :

Failed tests: 
  testExecuteError(org.apache.maven.surefire.its.CheckTestNgExecuteErrorIT)

Tests run: 96, Failures: 1, Errors: 0, Skipped: 0

[INFO] [failsafe:verify {execution: default}]
[INFO] Failsafe report directory: /opt/grid/slave/workspace/surefire/jdk/java-5x/label/ubuntu/trunk/surefire-integration-tests/target/failsafe-reports
[INFO] ------------------------------------------------------------------------
[ERROR] BUILD FAILURE
[INFO] ------------------------------------------------------------------------
[INFO] There are test failures.

Please refer to /opt/grid/slave/workspace/surefire/jdk/java-5x/label/ubuntu/trunk/surefire-integration-tests/target/failsafe-reports
for the individual test results.
[INFO] ------------------------------------------------------------------------
[INFO] Trace
org.apache.maven.BuildFailureException: There are test failures.

Please refer to /opt/grid/slave/workspace/surefire/jdk/java-5x/label/ubuntu/trunk/surefire-integration-tests/target/failsafe-reports
for the individual test results.
	at org.apache.maven.lifecycle.DefaultLifecycleExecutor.executeGoals(DefaultLifecycleExecutor.java:715)
	at org.apache.maven.lifecycle.DefaultLifecycleExecutor.executeGoalWithLifecycle(DefaultLifecycleExecutor.java:556)
	at org.apache.maven.lifecycle.DefaultLifecycleExecutor.executeGoal(DefaultLifecycleExecutor.java:535)
	at org.apache.maven.lifecycle.DefaultLifecycleExecutor.executeGoalAndHandleFailures(DefaultLifecycleExecutor.java:387)
	at org.apache.maven.lifecycle.DefaultLifecycleExecutor.executeTaskSegments(DefaultLifecycleExecutor.java:348)
	at org.apache.maven.lifecycle.DefaultLifecycleExecutor.execute(DefaultLifecycleExecutor.java:180)
	at org.apache.maven.DefaultMaven.doExecute(DefaultMaven.java:328)
	at org.apache.maven.DefaultMaven.execute(DefaultMaven.java:138)
	at org.apache.maven.cli.MavenCli.main(MavenCli.java:362)
	at org.apache.maven.cli.compat.CompatibleMain.main(CompatibleMain.java:60)
	at sun.reflect.NativeMethodAccessorImpl.invoke0(Native Method)
	at sun.reflect.NativeMethodAccessorImpl.invoke(NativeMethodAccessorImpl.java:39)
	at sun.reflect.DelegatingMethodAccessorImpl.invoke(DelegatingMethodAccessorImpl.java:25)
	at java.lang.reflect.Method.invoke(Method.java:592)
	at org.codehaus.classworlds.Launcher.launchEnhanced(Launcher.java:315)
	at org.codehaus.classworlds.Launcher.launch(Launcher.java:255)
	at org.codehaus.classworlds.Launcher.mainWithExitCode(Launcher.java:430)
	at org.codehaus.classworlds.Launcher.main(Launcher.java:375)
Caused by: org.apache.maven.plugin.MojoFailureException: There are test failures.

Please refer to /opt/grid/slave/workspace/surefire/jdk/java-5x/label/ubuntu/trunk/surefire-integration-tests/target/failsafe-reports
for the individual test results.
	at org.apache.maven.plugin.failsafe.VerifyMojo.execute(VerifyMojo.java:217)
	at org.apache.maven.plugin.DefaultPluginManager.executeMojo(DefaultPluginManager.java:490)
	at org.apache.maven.lifecycle.DefaultLifecycleExecutor.executeGoals(DefaultLifecycleExecutor.java:694)
	... 17 more
[INFO] ------------------------------------------------------------------------
[INFO] Total time: 9 minutes 6 seconds
[INFO] Finished at: Sat Nov 27 19:11:06 CST 2010
[INFO] Final Memory: 81M/384M
[INFO] ------------------------------------------------------------------------


Mime
View raw message