maven-notifications mailing list archives

Site index · List index
Message view « Date » · « Thread »
Top « Date » · « Thread »
From "GRiD .ORG" <bui...@lists.sonatype.com>
Subject Build failed in Hudson: Maven-2.2.x-bootstrap » java-5x,ubuntu #118
Date Thu, 18 Nov 2010 19:24:39 GMT
See <https://grid.sonatype.org/ci/job/Maven-2.2.x-bootstrap/./jdk=java-5x,label=ubuntu/118/changes>

Changes:

[Dennis Lundberg] [MNG-4903] Update to Wagon 1.0-beta-7

------------------------------------------
[...truncated 4932 lines...]
     [exec] Try downloading the file manually from the project website.
     [exec] Then, install it using the command: 
     [exec]     mvn install:install-file -DgroupId=plexus -DartifactId=plexus-container-default
-Dversion=0.1-stub -Dpackaging=jar -Dfile=/path/to/file
     [exec] Alternatively, if you host your own repository you can deploy the file there:

     [exec]     mvn deploy:deploy-file -DgroupId=plexus -DartifactId=plexus-container-default
-Dversion=0.1-stub -Dpackaging=jar -Dfile=/path/to/file -Durl=[url] -DrepositoryId=[id]
     [exec] Path to dependency: 
     [exec] 	1) org.apache.maven.its.plugins:maven-it-plugin-class-loader:maven-plugin:2.1-SNAPSHOT
     [exec]   plexus:plexus-container-default:jar:0.1-stub
     [exec] from the specified remote repositories:
     [exec]   central (http://repo1.maven.org/maven2),
     [exec]   apache.snapshots (http://repository.apache.org/snapshots)
     [exec] 	at org.apache.maven.lifecycle.DefaultLifecycleExecutor.executeGoals(DefaultLifecycleExecutor.java:703)
     [exec] 	at org.apache.maven.lifecycle.DefaultLifecycleExecutor.executeGoalWithLifecycle(DefaultLifecycleExecutor.java:556)
     [exec] 	at org.apache.maven.lifecycle.DefaultLifecycleExecutor.executeGoal(DefaultLifecycleExecutor.java:535)
     [exec] 	at org.apache.maven.lifecycle.DefaultLifecycleExecutor.executeGoalAndHandleFailures(DefaultLifecycleExecutor.java:387)
     [exec] 	at org.apache.maven.lifecycle.DefaultLifecycleExecutor.executeTaskSegments(DefaultLifecycleExecutor.java:348)
     [exec] 	at org.apache.maven.lifecycle.DefaultLifecycleExecutor.execute(DefaultLifecycleExecutor.java:180)
     [exec] 	at org.apache.maven.DefaultMaven.doExecute(DefaultMaven.java:334)
     [exec] 	at org.apache.maven.DefaultMaven.execute(DefaultMaven.java:141)
     [exec] 	at org.apache.maven.cli.MavenCli.main(MavenCli.java:362)
     [exec] 	at org.apache.maven.cli.compat.CompatibleMain.main(CompatibleMain.java:60)
     [exec] 	at sun.reflect.NativeMethodAccessorImpl.invoke0(Native Method)
     [exec] 	at sun.reflect.NativeMethodAccessorImpl.invoke(NativeMethodAccessorImpl.java:39)
     [exec] 	at sun.reflect.DelegatingMethodAccessorImpl.invoke(DelegatingMethodAccessorImpl.java:25)
     [exec] 	at java.lang.reflect.Method.invoke(Method.java:592)
     [exec] 	at org.codehaus.classworlds.Launcher.launchEnhanced(Launcher.java:315)
     [exec] 	at org.codehaus.classworlds.Launcher.launch(Launcher.java:255)
     [exec] 	at org.codehaus.classworlds.Launcher.mainWithExitCode(Launcher.java:430)
     [exec] 	at org.codehaus.classworlds.Launcher.main(Launcher.java:375)
     [exec] Caused by: org.apache.maven.artifact.resolver.ArtifactNotFoundException: Unable
to download the artifact from any repository
     [exec] Try downloading the file manually from the project website.
     [exec] Then, install it using the command: 
     [exec]     mvn install:install-file -DgroupId=plexus -DartifactId=plexus-container-default
-Dversion=0.1-stub -Dpackaging=jar -Dfile=/path/to/file
     [exec] Alternatively, if you host your own repository you can deploy the file there:

     [exec]     mvn deploy:deploy-file -DgroupId=plexus -DartifactId=plexus-container-default
-Dversion=0.1-stub -Dpackaging=jar -Dfile=/path/to/file -Durl=[url] -DrepositoryId=[id]
     [exec] Path to dependency: 
     [exec] 	1) org.apache.maven.its.plugins:maven-it-plugin-class-loader:maven-plugin:2.1-SNAPSHOT
     [exec]   plexus:plexus-container-default:jar:0.1-stub
     [exec] from the specified remote repositories:
     [exec]   central (http://repo1.maven.org/maven2),
     [exec]   apache.snapshots (http://repository.apache.org/snapshots)
     [exec] 	at org.apache.maven.artifact.resolver.DefaultArtifactResolver.resolve(DefaultArtifactResolver.java:227)
     [exec] 	at org.apache.maven.artifact.resolver.DefaultArtifactResolver.resolve(DefaultArtifactResolver.java:89)
     [exec] 	at org.apache.maven.plugin.DefaultPluginManager.resolveCoreArtifacts(DefaultPluginManager.java:994)
     [exec] 	at org.apache.maven.plugin.DefaultPluginManager.ensurePluginContainerIsComplete(DefaultPluginManager.java:898)
     [exec] 	at org.apache.maven.plugin.DefaultPluginManager.getConfiguredMojo(DefaultPluginManager.java:656)
     [exec] 	at org.apache.maven.plugin.DefaultPluginManager.executeMojo(DefaultPluginManager.java:477)
     [exec] 	at org.apache.maven.lifecycle.DefaultLifecycleExecutor.executeGoals(DefaultLifecycleExecutor.java:694)
     [exec] 	... 17 more
     [exec] Caused by: org.apache.maven.wagon.ResourceDoesNotExistException: Unable to download
the artifact from any repository
     [exec] 	at org.apache.maven.artifact.manager.DefaultWagonManager.getArtifact(DefaultWagonManager.java:403)
     [exec] 	at org.apache.maven.artifact.resolver.DefaultArtifactResolver.resolve(DefaultArtifactResolver.java:215)
     [exec] 	... 23 more
     [exec] [INFO] ------------------------------------------------------------------------
     [exec] [INFO] Total time: 12 seconds
     [exec] [INFO] Finished at: Thu Nov 18 13:00:43 CST 2010
     [exec] [INFO] Final Memory: 4M/29M
     [exec] [INFO] ------------------------------------------------------------------------
     [exec] 	at org.apache.maven.it.Verifier.executeGoals(Verifier.java:1349)
     [exec] 	at org.apache.maven.it.Verifier.executeGoal(Verifier.java:1192)
     [exec] 	at org.apache.maven.it.Verifier.executeGoal(Verifier.java:1186)
     [exec] 	at org.apache.maven.it.MavenITmng4666CoreRealmImportTest.testit(MavenITmng4666CoreRealmImportTest.java:79)
     [exec] 	at sun.reflect.NativeMethodAccessorImpl.invoke0(Native Method)
     [exec] 	at sun.reflect.NativeMethodAccessorImpl.invoke(NativeMethodAccessorImpl.java:39)
     [exec] 	at sun.reflect.DelegatingMethodAccessorImpl.invoke(DelegatingMethodAccessorImpl.java:25)
     [exec] 	at java.lang.reflect.Method.invoke(Method.java:592)
     [exec] 	at junit.framework.TestCase.runTest(TestCase.java:164)
     [exec] 	at org.apache.maven.it.AbstractMavenIntegrationTestCase.runTest(AbstractMavenIntegrationTestCase.java:220)
     [exec] 	at junit.framework.TestCase.runBare(TestCase.java:130)
     [exec] 	at junit.framework.TestResult$1.protect(TestResult.java:106)
     [exec] 	at junit.framework.TestResult.runProtected(TestResult.java:124)
     [exec] 	at junit.framework.TestResult.run(TestResult.java:109)
     [exec] 	at junit.framework.TestCase.run(TestCase.java:120)
     [exec] 	at junit.framework.TestSuite.runTest(TestSuite.java:230)
     [exec] 	at junit.framework.TestSuite.run(TestSuite.java:225)
     [exec] 	at junit.framework.TestSuite.runTest(TestSuite.java:230)
     [exec] 	at junit.framework.TestSuite.run(TestSuite.java:225)
     [exec] 	at sun.reflect.NativeMethodAccessorImpl.invoke0(Native Method)
     [exec] 	at sun.reflect.NativeMethodAccessorImpl.invoke(NativeMethodAccessorImpl.java:39)
     [exec] 	at sun.reflect.DelegatingMethodAccessorImpl.invoke(DelegatingMethodAccessorImpl.java:25)
     [exec] 	at java.lang.reflect.Method.invoke(Method.java:592)
     [exec] 	at org.apache.maven.surefire.junit.JUnitTestSet.execute(JUnitTestSet.java:213)
     [exec] 	at org.apache.maven.surefire.suite.AbstractDirectoryTestSuite.executeTestSet(AbstractDirectoryTestSuite.java:140)
     [exec] 	at org.apache.maven.surefire.suite.AbstractDirectoryTestSuite.execute(AbstractDirectoryTestSuite.java:127)
     [exec] 	at org.apache.maven.surefire.Surefire.run(Surefire.java:177)
     [exec] 	at sun.reflect.NativeMethodAccessorImpl.invoke0(Native Method)
     [exec] 	at sun.reflect.NativeMethodAccessorImpl.invoke(NativeMethodAccessorImpl.java:39)
     [exec] 	at sun.reflect.DelegatingMethodAccessorImpl.invoke(DelegatingMethodAccessorImpl.java:25)
     [exec] 	at java.lang.reflect.Method.invoke(Method.java:592)
     [exec] 	at org.apache.maven.surefire.booter.SurefireBooter.runSuitesInProcess(SurefireBooter.java:345)
     [exec] 	at org.apache.maven.surefire.booter.SurefireBooter.run(SurefireBooter.java:241)
     [exec] 	at org.apache.maven.plugin.surefire.SurefirePlugin.execute(SurefirePlugin.java:537)
     [exec] 	at org.apache.maven.plugin.DefaultPluginManager.executeMojo(DefaultPluginManager.java:499)
     [exec] 	at org.apache.maven.lifecycle.DefaultLifecycleExecutor.executeGoals(DefaultLifecycleExecutor.java:694)
     [exec] 	at org.apache.maven.lifecycle.DefaultLifecycleExecutor.executeGoalWithLifecycle(DefaultLifecycleExecutor.java:556)
     [exec] 	at org.apache.maven.lifecycle.DefaultLifecycleExecutor.executeGoal(DefaultLifecycleExecutor.java:535)
     [exec] 	at org.apache.maven.lifecycle.DefaultLifecycleExecutor.executeGoalAndHandleFailures(DefaultLifecycleExecutor.java:387)
     [exec] 	at org.apache.maven.lifecycle.DefaultLifecycleExecutor.executeTaskSegments(DefaultLifecycleExecutor.java:348)
     [exec] 	at org.apache.maven.lifecycle.DefaultLifecycleExecutor.execute(DefaultLifecycleExecutor.java:180)
     [exec] 	at org.apache.maven.DefaultMaven.doExecute(DefaultMaven.java:334)
     [exec] 	at org.apache.maven.DefaultMaven.execute(DefaultMaven.java:141)
     [exec] 	at org.apache.maven.cli.MavenCli.main(MavenCli.java:362)
     [exec] 	at org.apache.maven.cli.compat.CompatibleMain.main(CompatibleMain.java:60)
     [exec] 	at sun.reflect.NativeMethodAccessorImpl.invoke0(Native Method)
     [exec] 	at sun.reflect.NativeMethodAccessorImpl.invoke(NativeMethodAccessorImpl.java:39)
     [exec] 	at sun.reflect.DelegatingMethodAccessorImpl.invoke(DelegatingMethodAccessorImpl.java:25)
     [exec] 	at java.lang.reflect.Method.invoke(Method.java:592)
     [exec] 	at org.codehaus.classworlds.Launcher.launchEnhanced(Launcher.java:315)
     [exec] 	at org.codehaus.classworlds.Launcher.launch(Launcher.java:255)
     [exec] 	at org.codehaus.classworlds.Launcher.mainWithExitCode(Launcher.java:430)
     [exec] 	at org.codehaus.classworlds.Launcher.main(Launcher.java:375)
     [exec] Caused by: org.apache.maven.artifact.resolver.ArtifactNotFoundException: Unable
to download the artifact from any repository
     [exec] Try downloading the file manually from the project website.
     [exec] Then, install it using the command: 
     [exec]     mvn install:install-file -DgroupId=plexus -DartifactId=plexus-container-default
-Dversion=0.1-stub -Dpackaging=jar -Dfile=/path/to/file
     [exec] Alternatively, if you host your own repository you can deploy the file there:

     [exec]     mvn deploy:deploy-file -DgroupId=plexus -DartifactId=plexus-container-default
-Dversion=0.1-stub -Dpackaging=jar -Dfile=/path/to/file -Durl=[url] -DrepositoryId=[id]
     [exec] Path to dependency: 
     [exec] 	1) org.apache.maven.its.plugins:maven-it-plugin-class-loader:maven-plugin:2.1-SNAPSHOT
     [exec]   plexus:plexus-container-default:jar:0.1-stub
     [exec] from the specified remote repositories:
     [exec]   central (http://repo1.maven.org/maven2),
     [exec]   apache.snapshots (http://repository.apache.org/snapshots)
     [exec] 	at org.apache.maven.artifact.resolver.DefaultArtifactResolver.resolve(DefaultArtifactResolver.java:227)
     [exec] 	at org.apache.maven.artifact.resolver.DefaultArtifactResolver.resolve(DefaultArtifactResolver.java:89)
     [exec] 	at org.apache.maven.plugin.DefaultPluginManager.resolveCoreArtifacts(DefaultPluginManager.java:994)
     [exec] 	at org.apache.maven.plugin.DefaultPluginManager.ensurePluginContainerIsComplete(DefaultPluginManager.java:898)
     [exec] 	at org.apache.maven.plugin.DefaultPluginManager.getConfiguredMojo(DefaultPluginManager.java:656)
     [exec] 	at org.apache.maven.plugin.DefaultPluginManager.executeMojo(DefaultPluginManager.java:477)
     [exec] 	at org.apache.maven.lifecycle.DefaultLifecycleExecutor.executeGoals(DefaultLifecycleExecutor.java:694)
     [exec] 	... 17 more
     [exec] Caused by: org.apache.maven.wagon.ResourceDoesNotExistException: Unable to download
the artifact from any repository
     [exec] 	at org.apache.maven.artifact.manager.DefaultWagonManager.getArtifact(DefaultWagonManager.java:403)
     [exec] 	at org.apache.maven.artifact.resolver.DefaultArtifactResolver.resolve(DefaultArtifactResolver.java:215)
     [exec] 	... 23 more
     [exec] [INFO] ------------------------------------------------------------------------
     [exec] [INFO] Total time: 12 seconds
     [exec] [INFO] Finished at: Thu Nov 18 13:00:43 CST 2010
     [exec] [INFO] Final Memory: 4M/29M
     [exec] [INFO] ------------------------------------------------------------------------
     [exec] 	at org.apache.maven.it.Verifier.executeGoals(Verifier.java:1349)
     [exec] 	at org.apache.maven.it.Verifier.executeGoal(Verifier.java:1192)
     [exec] 	at org.apache.maven.it.Verifier.executeGoal(Verifier.java:1186)
     [exec] 	at org.apache.maven.it.MavenITmng4666CoreRealmImportTest.testit(MavenITmng4666CoreRealmImportTest.java:79)
     [exec] 	at sun.reflect.NativeMethodAccessorImpl.invoke0(Native Method)
     [exec] 	at sun.reflect.NativeMethodAccessorImpl.invoke(NativeMethodAccessorImpl.java:39)
     [exec] 	at sun.reflect.DelegatingMethodAccessorImpl.invoke(DelegatingMethodAccessorImpl.java:25)
     [exec] 	at java.lang.reflect.Method.invoke(Method.java:592)
     [exec] 	at junit.framework.TestCase.runTest(TestCase.java:164)
     [exec] 	at org.apache.maven.it.AbstractMavenIntegrationTestCase.runTest(AbstractMavenIntegrationTestCase.java:220)
     [exec] 	at junit.framework.TestCase.runBare(TestCase.java:130)
     [exec] 	at junit.framework.TestResult$1.protect(TestResult.java:106)
     [exec] 	at junit.framework.TestResult.runProtected(TestResult.java:124)
     [exec] 	at junit.framework.TestResult.run(TestResult.java:109)
     [exec] 	at junit.framework.TestCase.run(TestCase.java:120)
     [exec] 	at junit.framework.TestSuite.runTest(TestSuite.java:230)
     [exec] 	at junit.framework.TestSuite.run(TestSuite.java:225)
     [exec] 	at junit.framework.TestSuite.runTest(TestSuite.java:230)
     [exec] 	at junit.framework.TestSuite.run(TestSuite.java:225)
     [exec] 	at sun.reflect.NativeMethodAccessorImpl.invoke0(Native Method)
     [exec] 	at sun.reflect.NativeMethodAccessorImpl.invoke(NativeMethodAccessorImpl.java:39)
     [exec] 	at sun.reflect.DelegatingMethodAccessorImpl.invoke(DelegatingMethodAccessorImpl.java:25)
     [exec] 	at java.lang.reflect.Method.invoke(Method.java:592)
     [exec] 	at org.apache.maven.surefire.junit.JUnitTestSet.execute(JUnitTestSet.java:213)
     [exec] 	at org.apache.maven.surefire.suite.AbstractDirectoryTestSuite.executeTestSet(AbstractDirectoryTestSuite.java:140)
     [exec] 	at org.apache.maven.surefire.suite.AbstractDirectoryTestSuite.execute(AbstractDirectoryTestSuite.java:127)
     [exec] 	at org.apache.maven.surefire.Surefire.run(Surefire.java:177)
     [exec] 	at sun.reflect.NativeMethodAccessorImpl.invoke0(Native Method)
     [exec] 	at sun.reflect.NativeMethodAccessorImpl.invoke(NativeMethodAccessorImpl.java:39)
     [exec] 	at sun.reflect.DelegatingMethodAccessorImpl.invoke(DelegatingMethodAccessorImpl.java:25)
     [exec] 	at java.lang.reflect.Method.invoke(Method.java:592)
     [exec] 	at org.apache.maven.surefire.booter.SurefireBooter.runSuitesInProcess(SurefireBooter.java:345)
     [exec] 	at org.apache.maven.surefire.booter.SurefireBooter.run(SurefireBooter.java:241)
     [exec] 	at org.apache.maven.plugin.surefire.SurefirePlugin.execute(SurefirePlugin.java:537)
     [exec] 	at org.apache.maven.plugin.DefaultPluginManager.executeMojo(DefaultPluginManager.java:499)
     [exec] 	at org.apache.maven.lifecycle.DefaultLifecycleExecutor.executeGoals(DefaultLifecycleExecutor.java:694)
     [exec] 	at org.apache.maven.lifecycle.DefaultLifecycleExecutor.executeGoalWithLifecycle(DefaultLifecycleExecutor.java:556)
     [exec] 	at org.apache.maven.lifecycle.DefaultLifecycleExecutor.executeGoal(DefaultLifecycleExecutor.java:535)
     [exec] 	at org.apache.maven.lifecycle.DefaultLifecycleExecutor.executeGoalAndHandleFailures(DefaultLifecycleExecutor.java:387)
     [exec] 	at org.apache.maven.lifecycle.DefaultLifecycleExecutor.executeTaskSegments(DefaultLifecycleExecutor.java:348)
     [exec] 	at org.apache.maven.lifecycle.DefaultLifecycleExecutor.execute(DefaultLifecycleExecutor.java:180)
     [exec] 	at org.apache.maven.DefaultMaven.doExecute(DefaultMaven.java:334)
     [exec] 	at org.apache.maven.DefaultMaven.execute(DefaultMaven.java:141)
     [exec] 	at org.apache.maven.cli.MavenCli.main(MavenCli.java:362)
     [exec] 	at org.apache.maven.cli.compat.CompatibleMain.main(CompatibleMain.java:60)
     [exec] 	at sun.reflect.NativeMethodAccessorImpl.invoke0(Native Method)
     [exec] 	at sun.reflect.NativeMethodAccessorImpl.invoke(NativeMethodAccessorImpl.java:39)
     [exec] 	at sun.reflect.DelegatingMethodAccessorImpl.invoke(DelegatingMethodAccessorImpl.java:25)
     [exec] 	at java.lang.reflect.Method.invoke(Method.java:592)
     [exec] 	at org.codehaus.classworlds.Launcher.launchEnhanced(Launcher.java:315)
     [exec] 	at org.codehaus.classworlds.Launcher.launch(Launcher.java:255)
     [exec] 	at org.codehaus.classworlds.Launcher.mainWithExitCode(Launcher.java:430)
     [exec] 	at org.codehaus.classworlds.Launcher.main(Launcher.java:375)
     [exec] 
     [exec] 
     [exec] Results :
     [exec] 
     [exec] Tests in error: 
     [exec]   testit(org.apache.maven.it.MavenITmng4666CoreRealmImportTest)
     [exec] 
     [exec] Tests run: 667, Failures: 0, Errors: 1, Skipped: 0
     [exec] 
     [exec] [INFO] ------------------------------------------------------------------------
     [exec] [ERROR] BUILD FAILURE
     [exec] [INFO] ------------------------------------------------------------------------
     [exec] [INFO] There are test failures.
     [exec] 
     [exec] Please refer to /tmp/maven-integration-tests-2.2.x/core-it-suite/target/surefire-reports
for the individual test results.
     [exec] [INFO] ------------------------------------------------------------------------
     [exec] [INFO] Trace
     [exec] org.apache.maven.BuildFailureException: There are test failures.
     [exec] 
     [exec] Please refer to /tmp/maven-integration-tests-2.2.x/core-it-suite/target/surefire-reports
for the individual test results.
     [exec] 	at org.apache.maven.lifecycle.DefaultLifecycleExecutor.executeGoals(DefaultLifecycleExecutor.java:715)
     [exec] 	at org.apache.maven.lifecycle.DefaultLifecycleExecutor.executeGoalWithLifecycle(DefaultLifecycleExecutor.java:556)
     [exec] 	at org.apache.maven.lifecycle.DefaultLifecycleExecutor.executeGoal(DefaultLifecycleExecutor.java:535)
     [exec] 	at org.apache.maven.lifecycle.DefaultLifecycleExecutor.executeGoalAndHandleFailures(DefaultLifecycleExecutor.java:387)
     [exec] 	at org.apache.maven.lifecycle.DefaultLifecycleExecutor.executeTaskSegments(DefaultLifecycleExecutor.java:348)
     [exec] 	at org.apache.maven.lifecycle.DefaultLifecycleExecutor.execute(DefaultLifecycleExecutor.java:180)
     [exec] 	at org.apache.maven.DefaultMaven.doExecute(DefaultMaven.java:334)
     [exec] 	at org.apache.maven.DefaultMaven.execute(DefaultMaven.java:141)
     [exec] 	at org.apache.maven.cli.MavenCli.main(MavenCli.java:362)
     [exec] 	at org.apache.maven.cli.compat.CompatibleMain.main(CompatibleMain.java:60)
     [exec] 	at sun.reflect.NativeMethodAccessorImpl.invoke0(Native Method)
     [exec] 	at sun.reflect.NativeMethodAccessorImpl.invoke(NativeMethodAccessorImpl.java:39)
     [exec] 	at sun.reflect.DelegatingMethodAccessorImpl.invoke(DelegatingMethodAccessorImpl.java:25)
     [exec] 	at java.lang.reflect.Method.invoke(Method.java:592)
     [exec] 	at org.codehaus.classworlds.Launcher.launchEnhanced(Launcher.java:315)
     [exec] 	at org.codehaus.classworlds.Launcher.launch(Launcher.java:255)
     [exec] 	at org.codehaus.classworlds.Launcher.mainWithExitCode(Launcher.java:430)
     [exec] 	at org.codehaus.classworlds.Launcher.main(Launcher.java:375)
     [exec] Caused by: org.apache.maven.plugin.MojoFailureException: There are test failures.
     [exec] 
     [exec] Please refer to /tmp/maven-integration-tests-2.2.x/core-it-suite/target/surefire-reports
for the individual test results.
     [exec] 	at org.apache.maven.plugin.surefire.SurefirePlugin.execute(SurefirePlugin.java:575)
     [exec] 	at org.apache.maven.plugin.DefaultPluginManager.executeMojo(DefaultPluginManager.java:499)
     [exec] 	at org.apache.maven.lifecycle.DefaultLifecycleExecutor.executeGoals(DefaultLifecycleExecutor.java:694)
     [exec] 	... 17 more
     [exec] [INFO] ------------------------------------------------------------------------
     [exec] [INFO] Total time: 27 minutes 12 seconds
     [exec] [INFO] Finished at: Thu Nov 18 13:24:12 CST 2010
     [exec] [INFO] Final Memory: 64M/108M
     [exec] [INFO] ------------------------------------------------------------------------

BUILD FAILED
/opt/grid/slave/workspace/Maven-2.2.x-bootstrap/jdk/java-5x/label/ubuntu/maven-2.2.x/build.xml:304:
exec returned: 1

Total time: 34 minutes 57 seconds
Archiving artifacts


Mime
View raw message