maven-notifications mailing list archives

Site index · List index
Message view « Date » · « Thread »
Top « Date » · « Thread »
From "GRiD .ORG" <bui...@lists.sonatype.com>
Subject Build failed in Hudson: maven-parent-pom » java-5x,ubuntu #89
Date Thu, 25 Nov 2010 03:00:38 GMT
See <https://grid.sonatype.org/ci/job/maven-parent-pom/./jdk=java-5x,label=ubuntu/89/changes>

Changes:

[Brett Porter] back to SNAPSHOT, to pick up releases when they are needed

------------------------------------------
Started by upstream project "maven-parent-pom" build number 89
Node context:
  os.version=2.6.32-25-server
  os.arch=amd64
  os.family=unix
  os.name=linux
Building remotely on slave-ubuntu-2
Updating http://svn.apache.org/repos/asf/maven/pom/trunk/maven
U         pom.xml
At revision 1038896
[maven] $ /home/hudson/slave/tools/maven-2.2x/bin/mvn -Dlabel=ubuntu -Djdk=java-5x -Dmaven.repo.local=<https://grid.sonatype.org/ci/job/maven-parent-pom/./jdk=java-5x,label=ubuntu/ws/.repository>
clean deploy -B -U -e -V
+ Error stacktraces are turned on.
Apache Maven 2.2.1 (r801777; 2009-08-06 14:16:01-0500)
Java version: 1.5.0_22
Java home: /opt/grid/slave/tools/java-5x/jre
Default locale: en_US, platform encoding: UTF-8
OS name: "linux" version: "2.6.32-25-server" arch: "amd64" Family: "unix"
[INFO] Scanning for projects...
[INFO] snapshot org.apache:apache:9-SNAPSHOT: checking for updates from central
Downloading: http://repository.sonatype.org:8081/content/groups/sonatype-public-grid/org/apache/apache/9-SNAPSHOT/apache-9-SNAPSHOT.pom
[INFO] Unable to find resource 'org.apache:apache:pom:9-SNAPSHOT' in repository central (http://Nexus)
[INFO] ------------------------------------------------------------------------
[ERROR] FATAL ERROR
[INFO] ------------------------------------------------------------------------
[INFO] Failed to resolve artifact.

GroupId: org.apache
ArtifactId: apache
Version: 9-SNAPSHOT

Reason: Unable to download the artifact from any repository

  org.apache:apache:pom:9-SNAPSHOT

from the specified remote repositories:
  Nexus (http://repository.sonatype.org:8081/content/groups/sonatype-public-grid)



[INFO] ------------------------------------------------------------------------
[INFO] Trace
org.apache.maven.reactor.MavenExecutionException: Cannot find parent: org.apache:apache for
project: org.apache.maven:maven-parent:pom:19-SNAPSHOT for project org.apache.maven:maven-parent:pom:19-SNAPSHOT
	at org.apache.maven.DefaultMaven.getProjects(DefaultMaven.java:404)
	at org.apache.maven.DefaultMaven.doExecute(DefaultMaven.java:272)
	at org.apache.maven.DefaultMaven.execute(DefaultMaven.java:138)
	at org.apache.maven.cli.MavenCli.main(MavenCli.java:362)
	at org.apache.maven.cli.compat.CompatibleMain.main(CompatibleMain.java:60)
	at sun.reflect.NativeMethodAccessorImpl.invoke0(Native Method)
	at sun.reflect.NativeMethodAccessorImpl.invoke(NativeMethodAccessorImpl.java:39)
	at sun.reflect.DelegatingMethodAccessorImpl.invoke(DelegatingMethodAccessorImpl.java:25)
	at java.lang.reflect.Method.invoke(Method.java:592)
	at org.codehaus.classworlds.Launcher.launchEnhanced(Launcher.java:315)
	at org.codehaus.classworlds.Launcher.launch(Launcher.java:255)
	at org.codehaus.classworlds.Launcher.mainWithExitCode(Launcher.java:430)
	at org.codehaus.classworlds.Launcher.main(Launcher.java:375)
Caused by: org.apache.maven.project.ProjectBuildingException: Cannot find parent: org.apache:apache
for project: org.apache.maven:maven-parent:pom:19-SNAPSHOT for project org.apache.maven:maven-parent:pom:19-SNAPSHOT
	at org.apache.maven.project.DefaultMavenProjectBuilder.assembleLineage(DefaultMavenProjectBuilder.java:1396)
	at org.apache.maven.project.DefaultMavenProjectBuilder.buildInternal(DefaultMavenProjectBuilder.java:823)
	at org.apache.maven.project.DefaultMavenProjectBuilder.buildFromSourceFileInternal(DefaultMavenProjectBuilder.java:508)
	at org.apache.maven.project.DefaultMavenProjectBuilder.build(DefaultMavenProjectBuilder.java:200)
	at org.apache.maven.DefaultMaven.getProject(DefaultMaven.java:604)
	at org.apache.maven.DefaultMaven.collectProjects(DefaultMaven.java:487)
	at org.apache.maven.DefaultMaven.getProjects(DefaultMaven.java:391)
	... 12 more
Caused by: org.apache.maven.project.ProjectBuildingException: POM 'org.apache:apache' not
found in repository: Unable to download the artifact from any repository

  org.apache:apache:pom:9-SNAPSHOT

from the specified remote repositories:
  Nexus (http://repository.sonatype.org:8081/content/groups/sonatype-public-grid)

 for project org.apache:apache
	at org.apache.maven.project.DefaultMavenProjectBuilder.findModelFromRepository(DefaultMavenProjectBuilder.java:605)
	at org.apache.maven.project.DefaultMavenProjectBuilder.assembleLineage(DefaultMavenProjectBuilder.java:1392)
	... 18 more
Caused by: org.apache.maven.artifact.resolver.ArtifactNotFoundException: Unable to download
the artifact from any repository

  org.apache:apache:pom:9-SNAPSHOT

from the specified remote repositories:
  Nexus (http://repository.sonatype.org:8081/content/groups/sonatype-public-grid)


	at org.apache.maven.artifact.resolver.DefaultArtifactResolver.resolve(DefaultArtifactResolver.java:228)
	at org.apache.maven.artifact.resolver.DefaultArtifactResolver.resolve(DefaultArtifactResolver.java:90)
	at org.apache.maven.project.DefaultMavenProjectBuilder.findModelFromRepository(DefaultMavenProjectBuilder.java:558)
	... 19 more
Caused by: org.apache.maven.wagon.ResourceDoesNotExistException: Unable to download the artifact
from any repository
	at org.apache.maven.artifact.manager.DefaultWagonManager.getArtifact(DefaultWagonManager.java:404)
	at org.apache.maven.artifact.resolver.DefaultArtifactResolver.resolve(DefaultArtifactResolver.java:216)
	... 21 more
[INFO] ------------------------------------------------------------------------
[INFO] Total time: 3 seconds
[INFO] Finished at: Wed Nov 24 21:00:38 CST 2010
[INFO] Final Memory: 2M/71M
[INFO] ------------------------------------------------------------------------


Mime
View raw message