maven-notifications mailing list archives

Site index · List index
Message view « Date » · « Thread »
Top « Date » · « Thread »
From "GRiD .ORG" <bui...@lists.sonatype.com>
Subject Build failed in Hudson: maven-plugins-ITs » java-5x,windows #524
Date Fri, 08 Oct 2010 07:00:11 GMT
See <https://grid.sonatype.org/ci/job/maven-plugins-ITs/./jdk=java-5x,label=windows/524/changes>

Changes:

[John Casey] [maven-release-plugin] prepare for next development iteration

[John Casey] [maven-release-plugin] prepare release maven-assembly-plugin-2.2

[John Casey] rollback version to 2.2-SNAPSHOT to retry the release

[John Casey] Fix unit tests.

[John Casey] [MASSEMBLY-509] Correct system properties handling to try to use execution/user
properties from maven session before defaulting over to System.getProperties(). Then, be more
careful when iterating to ensure the keys used are not blank.

[Paul] [maven-release-plugin] prepare for next development iteration

[Paul] [maven-release-plugin] prepare release maven-antrun-plugin-1.6

------------------------------------------
[...truncated 5428 lines...]
[INFO] Webapp assembled in [4 msecs]
Tests run: 2, Failures: 0, Errors: 0, Skipped: 0, Time elapsed: 0.129 sec
Running org.apache.maven.plugin.war.WarManifestMojoTest
Tests run: 6, Failures: 0, Errors: 0, Skipped: 0, Time elapsed: 0.367 sec
Running org.apache.maven.plugin.war.util.PathSetTest
Tests run: 5, Failures: 0, Errors: 0, Skipped: 0, Time elapsed: 0.01 sec
Running org.apache.maven.plugin.war.util.WarUtilsTest
Tests run: 1, Failures: 0, Errors: 0, Skipped: 0, Time elapsed: 0.002 sec
Running org.apache.maven.plugin.war.overlay.OverlayManagerTest
Tests run: 5, Failures: 0, Errors: 0, Skipped: 0, Time elapsed: 0.344 sec
Running org.apache.maven.plugin.war.WarDependenciesAnalysisTest
[INFO] Exploding webapp
[INFO] Assembling webapp [maven-war-plugin-test] in [X:\slave\workspace\maven-plugins-ITs\jdk\java-5x\label\windows\trunk\maven-war-plugin\target\test-classes\unit\dependenciesanalysis\test-dir\no-change]
[INFO] Processing war project
[INFO] Copying webapp resources [X:\slave\workspace\maven-plugins-ITs\jdk\java-5x\label\windows\trunk\maven-war-plugin\target\test-classes\unit\dependenciesanalysis\test-dir\no-change-test-data\source]
[INFO] Webapp assembled in [11 msecs]
[INFO] Exploding webapp
[INFO] Assembling webapp [maven-war-plugin-test] in [X:\slave\workspace\maven-plugins-ITs\jdk\java-5x\label\windows\trunk\maven-war-plugin\target\test-classes\unit\dependenciesanalysis\test-dir\no-change]
[INFO] Processing war project
[INFO] Copying webapp resources [X:\slave\workspace\maven-plugins-ITs\jdk\java-5x\label\windows\trunk\maven-war-plugin\target\test-classes\unit\dependenciesanalysis\test-dir\no-change-test-data\source]
[INFO] Webapp assembled in [7 msecs]
[INFO] Exploding webapp
[INFO] Assembling webapp [maven-war-plugin-test] in [X:\slave\workspace\maven-plugins-ITs\jdk\java-5x\label\windows\trunk\maven-war-plugin\target\test-classes\unit\dependenciesanalysis\test-dir\remove-dependency]
[INFO] Processing war project
[INFO] Copying webapp resources [X:\slave\workspace\maven-plugins-ITs\jdk\java-5x\label\windows\trunk\maven-war-plugin\target\test-classes\unit\dependenciesanalysis\test-dir\remove-dependency-test-data\source]
[INFO] Webapp assembled in [10 msecs]
[INFO] Exploding webapp
[INFO] Assembling webapp [maven-war-plugin-test] in [X:\slave\workspace\maven-plugins-ITs\jdk\java-5x\label\windows\trunk\maven-war-plugin\target\test-classes\unit\dependenciesanalysis\test-dir\remove-dependency]
[INFO] Dependency [Dependency {groupId=org.sample.jar, artifactId=lib-test, version=1.0, type=jar}]
has been removed from the project.
[INFO] Processing war project
[INFO] Copying webapp resources [X:\slave\workspace\maven-plugins-ITs\jdk\java-5x\label\windows\trunk\maven-war-plugin\target\test-classes\unit\dependenciesanalysis\test-dir\remove-dependency-test-data\source]
[INFO] Webapp assembled in [7 msecs]
[INFO] Exploding webapp
[INFO] Assembling webapp [maven-war-plugin-test] in [X:\slave\workspace\maven-plugins-ITs\jdk\java-5x\label\windows\trunk\maven-war-plugin\target\test-classes\unit\dependenciesanalysis\test-dir\dependency-update-version]
[INFO] Processing war project
[INFO] Copying webapp resources [X:\slave\workspace\maven-plugins-ITs\jdk\java-5x\label\windows\trunk\maven-war-plugin\target\test-classes\unit\dependenciesanalysis\test-dir\dependency-update-version-test-data\source]
[INFO] Webapp assembled in [14 msecs]
[INFO] Exploding webapp
[INFO] Assembling webapp [maven-war-plugin-test] in [X:\slave\workspace\maven-plugins-ITs\jdk\java-5x\label\windows\trunk\maven-war-plugin\target\test-classes\unit\dependenciesanalysis\test-dir\dependency-update-version]
[INFO] Version of dependency [Dependency {groupId=org.sample.jar, artifactId=lib-test, version=2.0,
type=jar}] has changed (1.0 -> 2.0).
[INFO] Processing war project
[INFO] Copying webapp resources [X:\slave\workspace\maven-plugins-ITs\jdk\java-5x\label\windows\trunk\maven-war-plugin\target\test-classes\unit\dependenciesanalysis\test-dir\dependency-update-version-test-data\source]
[INFO] Webapp assembled in [7 msecs]
[INFO] Exploding webapp
[INFO] Assembling webapp [maven-war-plugin-test] in [X:\slave\workspace\maven-plugins-ITs\jdk\java-5x\label\windows\trunk\maven-war-plugin\target\test-classes\unit\dependenciesanalysis\test-dir\dependency-now-provided]
[INFO] Processing war project
[INFO] Copying webapp resources [X:\slave\workspace\maven-plugins-ITs\jdk\java-5x\label\windows\trunk\maven-war-plugin\target\test-classes\unit\dependenciesanalysis\test-dir\dependency-now-provided-test-data\source]
[INFO] Webapp assembled in [14 msecs]
[INFO] Exploding webapp
[INFO] Assembling webapp [maven-war-plugin-test] in [X:\slave\workspace\maven-plugins-ITs\jdk\java-5x\label\windows\trunk\maven-war-plugin\target\test-classes\unit\dependenciesanalysis\test-dir\dependency-now-provided]
[INFO] Scope of dependency [Dependency {groupId=org.sample.jar, artifactId=lib-test, version=1.0,
type=jar}] has changed (runtime -> provided).
[INFO] Processing war project
[INFO] Copying webapp resources [X:\slave\workspace\maven-plugins-ITs\jdk\java-5x\label\windows\trunk\maven-war-plugin\target\test-classes\unit\dependenciesanalysis\test-dir\dependency-now-provided-test-data\source]
[INFO] Webapp assembled in [8 msecs]
Tests run: 4, Failures: 0, Errors: 0, Skipped: 0, Time elapsed: 0.364 sec

Results :

Tests run: 82, Failures: 0, Errors: 0, Skipped: 0

[INFO] [jar:jar {execution: default-jar}]
[INFO] Building jar: X:\slave\workspace\maven-plugins-ITs\jdk\java-5x\label\windows\trunk\maven-war-plugin\target\maven-war-plugin-2.2-SNAPSHOT.jar
[INFO] [plugin:addPluginArtifactMetadata {execution: default-addPluginArtifactMetadata}]
[INFO] [invoker:install {execution: integration-test}]
[INFO] Installing X:\slave\workspace\maven-plugins-ITs\jdk\java-5x\label\windows\trunk\maven-war-plugin\pom.xml
to X:\slave\workspace\maven-plugins-ITs\jdk\java-5x\label\windows\trunk\maven-war-plugin\target\local-repo\org\apache\maven\plugins\maven-war-plugin\2.2-SNAPSHOT\maven-war-plugin-2.2-SNAPSHOT.pom
[INFO] Installing X:\slave\workspace\maven-plugins-ITs\jdk\java-5x\label\windows\trunk\maven-war-plugin\target\maven-war-plugin-2.2-SNAPSHOT.jar
to X:\slave\workspace\maven-plugins-ITs\jdk\java-5x\label\windows\trunk\maven-war-plugin\target\local-repo\org\apache\maven\plugins\maven-war-plugin\2.2-SNAPSHOT\maven-war-plugin-2.2-SNAPSHOT.jar
[INFO] [invoker:run {execution: integration-test}]
[INFO] Building: default\pom.xml
[INFO] ..SUCCESS (10.5 s)
[INFO] Building: MWAR-129\pom.xml
[INFO] ..SUCCESS (2.8 s)
[INFO] Building: MWAR-131\pom.xml
[INFO] ..SUCCESS (29.0 s)
[INFO] Building: MWAR-133\pom.xml
[INFO] ..SUCCESS (3.8 s)
[INFO] Building: MWAR-139\pom.xml
[INFO] ..SUCCESS (3.7 s)
[INFO] Building: MWAR-143\pom.xml
[INFO] ..SUCCESS (10.1 s)
[INFO] Building: MWAR-62\pom.xml
[INFO] ..SUCCESS (2.9 s)
[INFO] Building: MWAR-96\pom.xml
[INFO] ..SUCCESS (3.4 s)
[INFO] Building: scoped-dependency-same-artifact\pom.xml
[INFO] ..SUCCESS (5.4 s)
[INFO] Building: simple-war-no-webxml\pom.xml
[INFO] ..SUCCESS (5.3 s)
[INFO] Building: simple-war-project\pom.xml
[INFO] ..SUCCESS (3.6 s)
[INFO] Building: web-resources-filtering\pom.xml
[INFO] ..SUCCESS (5.0 s)
[INFO] ---------------------------------------
[INFO] Execution Summary:
[INFO]   Builds Passing: 12
[INFO]   Builds Failing: 0
[INFO]   Builds Skipped: 0
[INFO] ---------------------------------------
[INFO] [install:install {execution: default-install}]
[INFO] Installing X:\slave\workspace\maven-plugins-ITs\jdk\java-5x\label\windows\trunk\maven-war-plugin\target\maven-war-plugin-2.2-SNAPSHOT.jar
to x:\slave\workspace\maven-plugins-ITs\jdk\java-5x\label\windows\.repository\org\apache\maven\plugins\maven-war-plugin\2.2-SNAPSHOT\maven-war-plugin-2.2-SNAPSHOT.jar
[INFO] [deploy:deploy {execution: default-deploy}]
[INFO] Retrieving previous build number from apache.snapshots.https
Uploading: file:/opt/repos/deploy-junk/org/apache/maven/plugins/maven-war-plugin/2.2-SNAPSHOT/maven-war-plugin-2.2-20101008.060430-3.jar
75K uploaded  (maven-war-plugin-2.2-20101008.060430-3.jar)
[INFO] Retrieving previous metadata from apache.snapshots.https
[INFO] Uploading repository metadata for: 'artifact org.apache.maven.plugins:maven-war-plugin'
[INFO] Retrieving previous metadata from apache.snapshots.https
[INFO] Uploading repository metadata for: 'org.apache.maven.plugins'
[INFO] Uploading project information for maven-war-plugin 2.2-20101008.060430-3
[INFO] Retrieving previous metadata from apache.snapshots.https
[INFO] Uploading repository metadata for: 'snapshot org.apache.maven.plugins:maven-war-plugin:2.2-SNAPSHOT'
[INFO] ------------------------------------------------------------------------
[INFO] Building Maven Plugins Aggregator
[INFO]    task-segment: [clean, deploy]
[INFO] ------------------------------------------------------------------------
[INFO] [clean:clean {execution: default-clean}]
[INFO] Deleting file set: x:\slave\workspace\maven-plugins-ITs\jdk\java-5x\label\windows\trunk\target
(included: [**], excluded: [])
[INFO] [remote-resources:process {execution: default}]
[INFO] [site:attach-descriptor {execution: default-attach-descriptor}]
[INFO] [install:install {execution: default-install}]
[INFO] Installing x:\slave\workspace\maven-plugins-ITs\jdk\java-5x\label\windows\trunk\pom.xml
to x:\slave\workspace\maven-plugins-ITs\jdk\java-5x\label\windows\.repository\org\apache\maven\plugins\maven-plugins-aggregator\1-SNAPSHOT\maven-plugins-aggregator-1-SNAPSHOT.pom
[INFO] [deploy:deploy {execution: default-deploy}]
[INFO] Retrieving previous build number from apache.snapshots.https
Uploading: file:/opt/repos/deploy-junk/org/apache/maven/plugins/maven-plugins-aggregator/1-SNAPSHOT/maven-plugins-aggregator-1-20101008.060430-3.pom
3K uploaded  (maven-plugins-aggregator-1-20101008.060430-3.pom)
[INFO] Retrieving previous metadata from apache.snapshots.https
[INFO] Uploading repository metadata for: 'artifact org.apache.maven.plugins:maven-plugins-aggregator'
[INFO] Retrieving previous metadata from apache.snapshots.https
[INFO] Uploading repository metadata for: 'snapshot org.apache.maven.plugins:maven-plugins-aggregator:1-SNAPSHOT'
[INFO] 
[INFO] 
[INFO] ------------------------------------------------------------------------
[INFO] Reactor Summary:
[INFO] ------------------------------------------------------------------------
[INFO] Maven Plugins ......................................... SUCCESS [13.792s]
[INFO] Maven Invoker Plugin .................................. SUCCESS [5:17.665s]
[INFO] Maven Ant Plugin ...................................... SUCCESS [2:18.677s]
[INFO] Maven AntRun Plugin ................................... SUCCESS [1:20.712s]
[INFO] Maven Eclipse Plugin .................................. FAILED [18.576s]
[INFO] Maven Changelog Plugin ................................ SUCCESS [36.401s]
[INFO] Maven Changes Report Plugin ........................... SUCCESS [1:10.335s]
[INFO] Maven Checkstyle Plugin ............................... SUCCESS [2:12.352s]
[INFO] Maven Clean Plugin .................................... SUCCESS [15.175s]
[INFO] Maven Compiler Plugin ................................. SUCCESS [27.255s]
[INFO] Maven Dependency Plugin ............................... SUCCESS [2:51.466s]
[INFO] Maven Deploy Plugin ................................... SUCCESS [1:39.676s]
[INFO] Maven DOAP Plugin ..................................... SUCCESS [12.851s]
[INFO] Maven Documentation Checker Plugin .................... SUCCESS [20.385s]
[INFO] Maven EAR Plugin ...................................... SUCCESS [3:39.480s]
[INFO] Maven EJB Plugin ...................................... SUCCESS [42.085s]
[INFO] Maven GPG Plugin ...................................... FAILED [35.757s]
[INFO] Maven Help Plugin ..................................... SUCCESS [37.819s]
[INFO] Maven IDEA Plugin ..................................... SUCCESS [11.329s]
[INFO] Maven Install Plugin .................................. SUCCESS [1:34.258s]
[INFO] Maven JAR Plugin ...................................... SUCCESS [1:51.861s]
[INFO] Maven Jarsigner Plugin ................................ SUCCESS [57.485s]
[INFO] Maven Shade Plugin .................................... SUCCESS [2:45.641s]
[INFO] Maven Javadoc Plugin .................................. SUCCESS [11:54.835s]
[INFO] Maven Linkcheck Plugin ................................ SUCCESS [2.856s]
[INFO] Maven One Plugin ...................................... SUCCESS [2.260s]
[INFO] Maven Patch Plugin .................................... SUCCESS [16.755s]
[INFO] Maven PDF Plugin ...................................... SUCCESS [1:28.405s]
[INFO] Maven PMD Plugin ...................................... SUCCESS [51.316s]
[INFO] Maven RAR Plugin ...................................... SUCCESS [11.856s]
[INFO] Maven Reactor Plugin .................................. SUCCESS [3.019s]
[INFO] Maven Repository Plugin ............................... SUCCESS [57.872s]
[INFO] Maven Resources Plugin ................................ SUCCESS [1:00.609s]
[INFO] Maven Site Plugin ..................................... SUCCESS [4:10.683s]
[INFO] Maven Source Plugin ................................... SUCCESS [37.833s]
[INFO] Maven Stage Plugin .................................... SUCCESS [2.520s]
[INFO] Maven Toolchains Plugin ............................... SUCCESS [1.389s]
[INFO] Maven Verifier Plugin ................................. SUCCESS [10.468s]
[INFO] Maven WAR Plugin ...................................... SUCCESS [1:46.038s]
[INFO] Maven Plugins Aggregator .............................. SUCCESS [0.101s]
[INFO] ------------------------------------------------------------------------
[INFO] Error for project: Maven Eclipse Plugin (during deploy)
[INFO] ------------------------------------------------------------------------
[INFO] There are test failures.

Please refer to X:\slave\workspace\maven-plugins-ITs\jdk\java-5x\label\windows\trunk\maven-eclipse-plugin\target\surefire-reports
for the individual test results.
[INFO] ------------------------------------------------------------------------
[INFO] Trace
org.apache.maven.BuildFailureException: There are test failures.

Please refer to X:\slave\workspace\maven-plugins-ITs\jdk\java-5x\label\windows\trunk\maven-eclipse-plugin\target\surefire-reports
for the individual test results.
	at org.apache.maven.lifecycle.DefaultLifecycleExecutor.executeGoals(DefaultLifecycleExecutor.java:715)
	at org.apache.maven.lifecycle.DefaultLifecycleExecutor.executeGoalWithLifecycle(DefaultLifecycleExecutor.java:556)
	at org.apache.maven.lifecycle.DefaultLifecycleExecutor.executeGoal(DefaultLifecycleExecutor.java:535)
	at org.apache.maven.lifecycle.DefaultLifecycleExecutor.executeGoalAndHandleFailures(DefaultLifecycleExecutor.java:387)
	at org.apache.maven.lifecycle.DefaultLifecycleExecutor.executeTaskSegments(DefaultLifecycleExecutor.java:348)
	at org.apache.maven.lifecycle.DefaultLifecycleExecutor.execute(DefaultLifecycleExecutor.java:180)
	at org.apache.maven.DefaultMaven.doExecute(DefaultMaven.java:328)
	at org.apache.maven.DefaultMaven.execute(DefaultMaven.java:138)
	at org.apache.maven.cli.MavenCli.main(MavenCli.java:362)
	at org.apache.maven.cli.compat.CompatibleMain.main(CompatibleMain.java:60)
	at sun.reflect.NativeMethodAccessorImpl.invoke0(Native Method)
	at sun.reflect.NativeMethodAccessorImpl.invoke(NativeMethodAccessorImpl.java:39)
	at sun.reflect.DelegatingMethodAccessorImpl.invoke(DelegatingMethodAccessorImpl.java:25)
	at java.lang.reflect.Method.invoke(Method.java:592)
	at org.codehaus.classworlds.Launcher.launchEnhanced(Launcher.java:315)
	at org.codehaus.classworlds.Launcher.launch(Launcher.java:255)
	at org.codehaus.classworlds.Launcher.mainWithExitCode(Launcher.java:430)
	at org.codehaus.classworlds.Launcher.main(Launcher.java:375)
Caused by: org.apache.maven.plugin.MojoFailureException: There are test failures.

Please refer to X:\slave\workspace\maven-plugins-ITs\jdk\java-5x\label\windows\trunk\maven-eclipse-plugin\target\surefire-reports
for the individual test results.
	at org.apache.maven.plugin.surefire.SurefirePlugin.execute(SurefirePlugin.java:575)
	at org.apache.maven.plugin.DefaultPluginManager.executeMojo(DefaultPluginManager.java:490)
	at org.apache.maven.lifecycle.DefaultLifecycleExecutor.executeGoals(DefaultLifecycleExecutor.java:694)
	... 17 more
[INFO] ------------------------------------------------------------------------
[INFO] Error for project: Maven GPG Plugin (during deploy)
[INFO] ------------------------------------------------------------------------
[INFO] : org.apache.maven.plugin.invoker.InvokerSession@e9b710
6 builds failed.
[INFO] ------------------------------------------------------------------------
[INFO] Trace
org.apache.maven.BuildFailureException: 6 builds failed.
	at org.apache.maven.lifecycle.DefaultLifecycleExecutor.executeGoals(DefaultLifecycleExecutor.java:715)
	at org.apache.maven.lifecycle.DefaultLifecycleExecutor.executeGoalWithLifecycle(DefaultLifecycleExecutor.java:556)
	at org.apache.maven.lifecycle.DefaultLifecycleExecutor.executeGoal(DefaultLifecycleExecutor.java:535)
	at org.apache.maven.lifecycle.DefaultLifecycleExecutor.executeGoalAndHandleFailures(DefaultLifecycleExecutor.java:387)
	at org.apache.maven.lifecycle.DefaultLifecycleExecutor.executeTaskSegments(DefaultLifecycleExecutor.java:348)
	at org.apache.maven.lifecycle.DefaultLifecycleExecutor.execute(DefaultLifecycleExecutor.java:180)
	at org.apache.maven.DefaultMaven.doExecute(DefaultMaven.java:328)
	at org.apache.maven.DefaultMaven.execute(DefaultMaven.java:138)
	at org.apache.maven.cli.MavenCli.main(MavenCli.java:362)
	at org.apache.maven.cli.compat.CompatibleMain.main(CompatibleMain.java:60)
	at sun.reflect.NativeMethodAccessorImpl.invoke0(Native Method)
	at sun.reflect.NativeMethodAccessorImpl.invoke(NativeMethodAccessorImpl.java:39)
	at sun.reflect.DelegatingMethodAccessorImpl.invoke(DelegatingMethodAccessorImpl.java:25)
	at java.lang.reflect.Method.invoke(Method.java:592)
	at org.codehaus.classworlds.Launcher.launchEnhanced(Launcher.java:315)
	at org.codehaus.classworlds.Launcher.launch(Launcher.java:255)
	at org.codehaus.classworlds.Launcher.mainWithExitCode(Launcher.java:430)
	at org.codehaus.classworlds.Launcher.main(Launcher.java:375)
Caused by: org.apache.maven.plugin.MojoFailureException: 6 builds failed.
	at org.apache.maven.plugin.invoker.InvokerSession.handleFailures(InvokerSession.java:263)
	at org.apache.maven.plugin.invoker.InvokerMojo.processResults(InvokerMojo.java:58)
	at org.apache.maven.plugin.invoker.AbstractInvokerMojo.execute(AbstractInvokerMojo.java:620)
	at org.apache.maven.plugin.DefaultPluginManager.executeMojo(DefaultPluginManager.java:490)
	at org.apache.maven.lifecycle.DefaultLifecycleExecutor.executeGoals(DefaultLifecycleExecutor.java:694)
	... 17 more
[INFO] ------------------------------------------------------------------------
[INFO] BUILD ERRORS
[INFO] ------------------------------------------------------------------------
[INFO] Total time: 55 minutes 53 seconds
[INFO] Finished at: Fri Oct 08 00:00:09 PDT 2010
[INFO] Final Memory: 68M/177M
[INFO] ------------------------------------------------------------------------


Mime
View raw message