maven-notifications mailing list archives

Site index · List index
Message view « Date » · « Thread »
Top « Date » · « Thread »
From "GRiD .ORG" <bui...@lists.sonatype.com>
Subject Build failed in Hudson: maven-3.0.x-ITs » java-5x,ubuntu #385
Date Sat, 30 Oct 2010 17:44:57 GMT
See <https://grid.sonatype.org/ci/job/maven-3.0.x-ITs/./jdk=java-5x,label=ubuntu/385/>

------------------------------------------
[...truncated 638 lines...]
mng1751ForcedMetadataUpdateDuringDeployment(it).............OK (1.5 s)
mng1703PluginMgmtDepInheritance(itMNG1703)..................OK (0.8 s)
mng1701DuplicatePlugin(it)..................................OK (0.7 s)
mng1493NonStandardModulePomNames(itMNG1493).................OK (0.7 s)
mng1491ReactorArtifactIdCollision(itMNG1491)................OK (0.0 s)
mng1415QuotedSystemProperties(itMNG1415)....................OK (0.7 s)
mng1412DependenciesOrder(itMNG1412).........................OK (1.5 s)
mng1349ChecksumFormats(itMNG1349)...........................OK (1.5 s)
mng1323AntrunDependencies(itMNG1323)........................OK (1.5 s)
mng1233WarDepWithProvidedScope(itMNG1233)...................OK (1.5 s)
mng1144MultipleDefaultGoals(it).............................OK (0.8 s)
mng1088ReactorPluginResolution(itMNG1088)...................OK (0.8 s)
mng1073AggregatorForksReactor(itForkLifecycle)..............OK (0.8 s)
mng1073AggregatorForksReactor(itForkGoal)...................OK (0.7 s)
mng1052PluginMngtConfig(itMNG1052)..........................OK (0.7 s)
mng1021EqualAttachmentBuildNumber(itMNG1021)................OK (1.6 s)
mng0985NonExecutedPluginMngtGoals(itMNG0985)................OK (0.7 s)
mng0956ComponentInjectionViaProjectLevelPluginDep(itMNG0956)..OK (0.8 s)
mng0947OptionalDependency(it)...............................OK (1.5 s)
mng0870ReactorAwarePluginDiscovery(itMNG0870)...............OK (0.8 s)
mng0866EvaluateDefaultValue(itMNG866).......................OK (0.7 s)
mng0848SystemPropOverridesDefaultValue(itMNG848)............OK (0.7 s)
mng0836PluginParentResolution(itMNG836).....................OK (0.7 s)
mng0823MojoContextPassing(itMNG0823)........................OK (0.7 s)
mng0820ConflictResolution(itMNG0820)........................OK (2.1 s)
mng0818WarDepsNotTransitive(itMNG0818)......................OK (1.4 s)
mng0814ExplicitProfileActivation(itMNG814)..................OK (0.8 s)
mng0786ProfileAwareReactor(itMNG0786).......................OK (0.7 s)
mng0781PluginConfigVsExecConfig(itMNG0781)..................OK (0.7 s)
mng0773SettingsProfileReactorPollution(itMNG773)............OK (0.7 s)
mng0768OfflineMode(itMNG768)................................OK (3.0 s)
mng0761MissingSnapshotDistRepo(itMNG761)....................OK (1.4 s)
mng0731LegacyRepoLayout(itMNG731)...........................SKIPPED - version 3.0.1-SNAPSHOT
not in range [2.0,3.0-alpha-3)
mng0680ParentBasedir(itMNG680)..............................OK (0.7 s)
mng0674PluginParameterAlias(itLifecycle)....................OK (0.7 s)
mng0674PluginParameterAlias(itCli)..........................OK (0.7 s)
mng0666IgnoreLegacyPom(itMNG666)............................OK (0.8 s)
mng0557UserSettingsCliOption(itMNG557)......................OK (0.7 s)
mng0553SettingsAuthzEncryption(itBasic).....................OK (2.9 s)
mng0553SettingsAuthzEncryption(itRelocation)................OK (2.7 s)
mng0553SettingsAuthzEncryption(itEncryption)................OK (5.2 s)
mng0522InheritedPluginMgmtConfig(itMNG522)..................OK (2.0 s)
mng0507ArtifactRelocation(itMNG507).........................OK (2.5 s)
mng0505VersionRange(itMNG505)...............................OK (2.3 s)
mng0496IgnoreUnknownPluginParameters(itMNG496)..............OK (0.7 s)
mng0479OverrideCentralRepo(itModel).........................OK (1.4 s)
mng0479OverrideCentralRepo(itResolution)....................OK (2.8 s)
mng0471CustomLifecycle(itMNG471)............................OK (0.7 s)
mng0469ReportConfig(itReportConfigOverridesBuildDefaults)...SKIPPED - version 3.0.1-SNAPSHOT
not in range [2.0.0,3.0-alpha-1)
mng0469ReportConfig(itBuildConfigDominantDuringBuild).......OK (0.7 s)
mng0469ReportConfig(itBuildConfigIrrelevantForReports)......OK (0.7 s)
mng0461TolerateMissingDependencyPom(it).....................OK (1.4 s)
mng0449PluginVersionResolution(itLifecycleInvocation).......OK (1.6 s)
mng0449PluginVersionResolution(itCliInvocation).............OK (0.7 s)
mng0377PluginLookupFromPrefix(itMNG377).....................OK (2.8 s)
mng0294MergeGlobalAndUserSettings(itMNG294).................OK (0.8 s)
mng0282NonReactorExecWhenProjectIndependent(itMNG282).......OK (0.7 s)
mng0249ResolveDepsFromReactor(itMNG0249)....................OK (1.6 s)
mng0187CollectedProjects(it)................................OK (0.7 s)
mng0095ReactorFailureBehavior(itFailFast)...................OK (0.7 s)
mng0095ReactorFailureBehavior(itFailNever)..................OK (1.1 s)
mng0095ReactorFailureBehavior(itFailAtEnd)..................OK (0.7 s)
0145ReactorWithIncludesExcludes(itDefaultIncludesExcludes)..SKIPPED - version 3.0.1-SNAPSHOT
not in range [2.0,3.0-alpha-1)
0145ReactorWithIncludesExcludes(itCustomIncludes)...........SKIPPED - version 3.0.1-SNAPSHOT
not in range [2.0,3.0-alpha-1)
0145ReactorWithIncludesExcludes(itCustomExcludes)...........SKIPPED - version 3.0.1-SNAPSHOT
not in range [2.0,3.0-alpha-1)
0144LifecycleExecutionOrder(it0144).........................OK (3.4 s)
0143TransitiveDependencyScopes(itCompileScope)..............OK (2.2 s)
0143TransitiveDependencyScopes(itProvidedScope).............OK (1.4 s)
0143TransitiveDependencyScopes(itRuntimeScope)..............OK (1.4 s)
0143TransitiveDependencyScopes(itTestScope).................OK (0.7 s)
0142DirectDependencyScopes(it0142)..........................OK (2.9 s)
0140InterpolationWithPomPrefix(it0140)......................OK (0.7 s)
0139InterpolationWithProjectPrefix(it0139)..................OK (0.7 s)
0138PluginLifecycle(it0138).................................OK (2.3 s)
0137EarLifecycle(it0137)....................................OK (1.6 s)
0136RarLifecycle(it0136)....................................OK (2.3 s)
0135EjbLifecycle(it0135)....................................OK (2.4 s)
0134WarLifecycle(it0134)....................................OK (2.4 s)
0133JarLifecycle(it0133)....................................OK (2.3 s)
0132PomLifecycle(it0132)....................................OK (1.5 s)
0131SiteLifecycle(it0131)...................................OK (1.5 s)
0130CleanLifecycle(it0130)..................................OK (0.8 s)
0113ServerAuthzAvailableToWagonMgrInPlugin(it0113)..........OK (2.3 s)
0090EnvVarInterpolation(it0090).............................OK (2.2 s)
0087PluginRealmWithProjectLevelDeps(it0087).................OK (1.9 s)
0086PluginRealm(it0086).....................................OK (1.5 s)
0085TransitiveSystemScope(it0085)...........................OK (1.5 s)
0072InterpolationWithDottedProperty(it0072).................OK (0.7 s)
0071PluginConfigWithDottedProperty(it0071)..................OK (1.5 s)
0064MojoConfigViaSetters(it0064)............................OK (0.7 s)
0063SystemScopeDependency(it0063)...........................OK (1.5 s)
0056MultipleGoalExecutions(it0056)..........................OK (0.9 s)
0052ReleaseProfile(it0052)..................................OK (2.3 s)
0051ReleaseProfile(it0051)..................................OK (3.0 s)
0041ArtifactTypeFromPluginExtension(it0041).................OK (2.5 s)
0040PackagingFromPluginExtension(it0040)....................OK (0.7 s)
0039ReleasePomInReactor(it0039).............................SKIPPED - version 3.0.1-SNAPSHOT
not in range [2.0,3.0-alpha-1)
0038AlternatePomFileDifferentDir(it0038)....................OK (0.9 s)
0037AlternatePomFileSameDir(it0037).........................OK (0.7 s)
0036ReleasePom(it0036)......................................SKIPPED - version 3.0.1-SNAPSHOT
not in range (2.0,3.0-alpha-1)
0032MavenPrerequisite(it0032)...............................OK (0.7 s)
0030DepPomDepMngtInheritance(it0030)........................OK (24.9 s)
0025MultipleExecutionLevelConfigs(it0025)...................OK (2.3 s)
0024MultipleGoalExecutions(it0024)..........................OK (1.6 s)
0023SettingsProfile(it0023).................................OK (2.6 s)
0021PomProfile(it0021)......................................OK (4.1 s)
0019PluginVersionMngtBySuperPom(it0019).....................OK (6.0 s)
0018DependencyManagement(it0018)............................OK (4.4 s)
0012PomInterpolation(it0012)................................OK (2.2 s)
0011DefaultVersionByDependencyManagement(it0011)............OK (4.4 s)
0010DependencyClosureResolution(it0010).....................OK (4.4 s)
0009GoalConfiguration(it0009)...............................OK (2.9 s)
0008SimplePlugin(it0008)....................................OK (2.9 s)
Tests run: 662, Failures: 0, Errors: 1, Skipped: 0, Time elapsed: 738.881 sec <<<
FAILURE!
testit(org.apache.maven.it.MavenITmng4874UpdateLatestPluginVersionTest)  Time elapsed: 0.107
sec  <<< ERROR!
org.apache.maven.it.VerificationException: Exit code was non-zero: 1; command line and log
= 
/opt/grid/slave/workspace/maven-3.0.x-ITs/jdk/java-5x/label/ubuntu/core-integration-tests/target/distro/bin/mvn
--global-settings /opt/grid/slave/workspace/maven-3.0.x-ITs/jdk/java-5x/label/ubuntu/core-integration-tests/target/test-classes/settings.xml
-e --batch-mode -Dmaven.repo.local=<https://grid.sonatype.org/ci/job/maven-3.0.x-ITs/./jdk=java-5x,label=ubuntu/ws/.repository>
validate
[INFO] Error stacktraces are turned on.
[INFO] Scanning for projects...
[INFO]                                                                         
[INFO] ------------------------------------------------------------------------
[INFO] Building Maven Integration Test :: MNG-4874 0.1-SNAPSHOT
[INFO] ------------------------------------------------------------------------
[INFO] ------------------------------------------------------------------------
[INFO] BUILD FAILURE
[INFO] ------------------------------------------------------------------------
[INFO] Total time: 0.014s
[INFO] Finished at: Sat Oct 30 12:32:44 CDT 2010
[INFO] Final Memory: 6M/88M
[INFO] ------------------------------------------------------------------------
[ERROR] Could not find goal 'latest' in plugin org.apache.maven.its.plugins:maven-it-plugin-artifact:2.1-SNAPSHOT
among available goals resolve-transitive, install-custom, set, deploy, collect, install, attach,
deploy-file, resolve, attach-pom, release -> [Help 1]
org.apache.maven.plugin.MojoNotFoundException: Could not find goal 'latest' in plugin org.apache.maven.its.plugins:maven-it-plugin-artifact:2.1-SNAPSHOT
among available goals resolve-transitive, install-custom, set, deploy, collect, install, attach,
deploy-file, resolve, attach-pom, release
	at org.apache.maven.plugin.internal.DefaultMavenPluginManager.getMojoDescriptor(DefaultMavenPluginManager.java:257)
	at org.apache.maven.plugin.DefaultBuildPluginManager.getMojoDescriptor(DefaultBuildPluginManager.java:197)
	at org.apache.maven.lifecycle.internal.DefaultLifecycleExecutionPlanCalculator.setupMojoExections(DefaultLifecycleExecutionPlanCalculator.java:134)
	at org.apache.maven.lifecycle.internal.DefaultLifecycleExecutionPlanCalculator.calculateExecutionPlan(DefaultLifecycleExecutionPlanCalculator.java:116)
	at org.apache.maven.lifecycle.internal.BuilderCommon.resolveBuildPlan(BuilderCommon.java:92)
	at org.apache.maven.lifecycle.internal.LifecycleModuleBuilder.buildProject(LifecycleModuleBuilder.java:81)
	at org.apache.maven.lifecycle.internal.LifecycleModuleBuilder.buildProject(LifecycleModuleBuilder.java:59)
	at org.apache.maven.lifecycle.internal.LifecycleStarter.singleThreadedBuild(LifecycleStarter.java:183)
	at org.apache.maven.lifecycle.internal.LifecycleStarter.execute(LifecycleStarter.java:161)
	at org.apache.maven.DefaultMaven.doExecute(DefaultMaven.java:314)
	at org.apache.maven.DefaultMaven.execute(DefaultMaven.java:151)
	at org.apache.maven.cli.MavenCli.execute(MavenCli.java:444)
	at org.apache.maven.cli.MavenCli.doMain(MavenCli.java:167)
	at org.apache.maven.cli.MavenCli.doMain(MavenCli.java:149)
	at sun.reflect.NativeMethodAccessorImpl.invoke0(Native Method)
	at sun.reflect.NativeMethodAccessorImpl.invoke(NativeMethodAccessorImpl.java:39)
	at sun.reflect.DelegatingMethodAccessorImpl.invoke(DelegatingMethodAccessorImpl.java:25)
	at java.lang.reflect.Method.invoke(Method.java:592)
	at org.apache.maven.it.Embedded3xLauncher.run(Embedded3xLauncher.java:176)
	at org.apache.maven.it.Verifier.executeGoals(Verifier.java:1326)
	at org.apache.maven.it.Verifier.executeGoal(Verifier.java:1191)
	at org.apache.maven.it.Verifier.executeGoal(Verifier.java:1185)
	at org.apache.maven.it.MavenITmng4874UpdateLatestPluginVersionTest.testit(MavenITmng4874UpdateLatestPluginVersionTest.java:54)
	at sun.reflect.NativeMethodAccessorImpl.invoke0(Native Method)
	at sun.reflect.NativeMethodAccessorImpl.invoke(NativeMethodAccessorImpl.java:39)
	at sun.reflect.DelegatingMethodAccessorImpl.invoke(DelegatingMethodAccessorImpl.java:25)
	at java.lang.reflect.Method.invoke(Method.java:592)
	at junit.framework.TestCase.runTest(TestCase.java:164)
	at org.apache.maven.it.AbstractMavenIntegrationTestCase.runTest(AbstractMavenIntegrationTestCase.java:220)
	at junit.framework.TestCase.runBare(TestCase.java:130)
	at junit.framework.TestResult$1.protect(TestResult.java:106)
	at junit.framework.TestResult.runProtected(TestResult.java:124)
	at junit.framework.TestResult.run(TestResult.java:109)
	at junit.framework.TestCase.run(TestCase.java:120)
	at junit.framework.TestSuite.runTest(TestSuite.java:230)
	at junit.framework.TestSuite.run(TestSuite.java:225)
	at junit.framework.TestSuite.runTest(TestSuite.java:230)
	at junit.framework.TestSuite.run(TestSuite.java:225)
	at sun.reflect.NativeMethodAccessorImpl.invoke0(Native Method)
	at sun.reflect.NativeMethodAccessorImpl.invoke(NativeMethodAccessorImpl.java:39)
	at sun.reflect.DelegatingMethodAccessorImpl.invoke(DelegatingMethodAccessorImpl.java:25)
	at java.lang.reflect.Method.invoke(Method.java:592)
	at org.apache.maven.surefire.junit.JUnitTestSet.execute(JUnitTestSet.java:213)
	at org.apache.maven.surefire.suite.AbstractDirectoryTestSuite.executeTestSet(AbstractDirectoryTestSuite.java:140)
	at org.apache.maven.surefire.suite.AbstractDirectoryTestSuite.execute(AbstractDirectoryTestSuite.java:127)
	at org.apache.maven.surefire.Surefire.run(Surefire.java:177)
	at sun.reflect.NativeMethodAccessorImpl.invoke0(Native Method)
	at sun.reflect.NativeMethodAccessorImpl.invoke(NativeMethodAccessorImpl.java:39)
	at sun.reflect.DelegatingMethodAccessorImpl.invoke(DelegatingMethodAccessorImpl.java:25)
	at java.lang.reflect.Method.invoke(Method.java:592)
	at org.apache.maven.surefire.booter.SurefireBooter.runSuitesInProcess(SurefireBooter.java:345)
	at org.apache.maven.surefire.booter.SurefireBooter.main(SurefireBooter.java:1009)
[ERROR] 
[ERROR] Re-run Maven using the -X switch to enable full debug logging.
[ERROR] 
[ERROR] For more information about the errors and possible solutions, please read the following
articles:
[ERROR] [Help 1] http://cwiki.apache.org/confluence/display/MAVEN/MojoNotFoundException
	at org.apache.maven.it.Verifier.executeGoals(Verifier.java:1348)
	at org.apache.maven.it.Verifier.executeGoal(Verifier.java:1191)
	at org.apache.maven.it.Verifier.executeGoal(Verifier.java:1185)
	at org.apache.maven.it.MavenITmng4874UpdateLatestPluginVersionTest.testit(MavenITmng4874UpdateLatestPluginVersionTest.java:54)


Results :

Tests in error: 
  testit(org.apache.maven.it.MavenITmng4874UpdateLatestPluginVersionTest)

Tests run: 662, Failures: 0, Errors: 1, Skipped: 0

[INFO] ------------------------------------------------------------------------
[INFO] BUILD FAILURE
[INFO] ------------------------------------------------------------------------
[INFO] Total time: 14:13.481s
[INFO] Finished at: Sat Oct 30 12:44:57 CDT 2010
[INFO] Final Memory: 19M/349M
[INFO] ------------------------------------------------------------------------
[ERROR] Failed to execute goal org.apache.maven.plugins:maven-surefire-plugin:2.4.3:test (default-test)
on project core-it-suite: There are test failures.
[ERROR] 
[ERROR] Please refer to /opt/grid/slave/workspace/maven-3.0.x-ITs/jdk/java-5x/label/ubuntu/core-integration-tests/target/surefire-reports
for the individual test results.
[ERROR] -> [Help 1]
org.apache.maven.lifecycle.LifecycleExecutionException: Failed to execute goal org.apache.maven.plugins:maven-surefire-plugin:2.4.3:test
(default-test) on project core-it-suite: There are test failures.

Please refer to /opt/grid/slave/workspace/maven-3.0.x-ITs/jdk/java-5x/label/ubuntu/core-integration-tests/target/surefire-reports
for the individual test results.
	at org.apache.maven.lifecycle.internal.MojoExecutor.execute(MojoExecutor.java:199)
	at org.apache.maven.lifecycle.internal.MojoExecutor.execute(MojoExecutor.java:148)
	at org.apache.maven.lifecycle.internal.MojoExecutor.execute(MojoExecutor.java:140)
	at org.apache.maven.lifecycle.internal.LifecycleModuleBuilder.buildProject(LifecycleModuleBuilder.java:84)
	at org.apache.maven.lifecycle.internal.LifecycleModuleBuilder.buildProject(LifecycleModuleBuilder.java:59)
	at org.apache.maven.lifecycle.internal.LifecycleStarter.singleThreadedBuild(LifecycleStarter.java:183)
	at org.apache.maven.lifecycle.internal.LifecycleStarter.execute(LifecycleStarter.java:161)
	at org.apache.maven.DefaultMaven.doExecute(DefaultMaven.java:314)
	at org.apache.maven.DefaultMaven.execute(DefaultMaven.java:151)
	at org.apache.maven.cli.MavenCli.execute(MavenCli.java:444)
	at org.apache.maven.cli.MavenCli.doMain(MavenCli.java:167)
	at org.apache.maven.cli.MavenCli.main(MavenCli.java:131)
	at sun.reflect.NativeMethodAccessorImpl.invoke0(Native Method)
	at sun.reflect.NativeMethodAccessorImpl.invoke(NativeMethodAccessorImpl.java:39)
	at sun.reflect.DelegatingMethodAccessorImpl.invoke(DelegatingMethodAccessorImpl.java:25)
	at java.lang.reflect.Method.invoke(Method.java:592)
	at org.codehaus.plexus.classworlds.launcher.Launcher.launchEnhanced(Launcher.java:290)
	at org.codehaus.plexus.classworlds.launcher.Launcher.launch(Launcher.java:230)
	at org.codehaus.plexus.classworlds.launcher.Launcher.mainWithExitCode(Launcher.java:409)
	at org.codehaus.plexus.classworlds.launcher.Launcher.main(Launcher.java:352)
Caused by: org.apache.maven.plugin.MojoFailureException: There are test failures.

Please refer to /opt/grid/slave/workspace/maven-3.0.x-ITs/jdk/java-5x/label/ubuntu/core-integration-tests/target/surefire-reports
for the individual test results.
	at org.apache.maven.plugin.surefire.SurefirePlugin.execute(SurefirePlugin.java:575)
	at org.apache.maven.plugin.DefaultBuildPluginManager.executeMojo(DefaultBuildPluginManager.java:107)
	at org.apache.maven.lifecycle.internal.MojoExecutor.execute(MojoExecutor.java:195)
	... 19 more
[ERROR] 
[ERROR] Re-run Maven using the -X switch to enable full debug logging.
[ERROR] 
[ERROR] For more information about the errors and possible solutions, please read the following
articles:
[ERROR] [Help 1] http://cwiki.apache.org/confluence/display/MAVEN/MojoFailureException
Emma: looking for coverage reports in the provided path: core-integration-tests/target/site/emma/coverage.xml


Mime
View raw message