maven-notifications mailing list archives

Site index · List index
Message view « Date » · « Thread »
Top « Date » · « Thread »
From Hudson <Hud...@sonatype.org>
Subject Build failed in Hudson: maven-plugins-ITs » 1.5,ubuntu #478
Date Sun, 01 Aug 2010 07:31:29 GMT
See <http://grid.sonatype.org/ci/job/maven-plugins-ITs/./jdk=1.5,label=ubuntu/478/changes>

Changes:

[Hervé Boutemy] [MPIR-80] added minimum JDK Rev to project summary

------------------------------------------
[...truncated 7820 lines...]
[INFO] Copying webapp resources[<http://grid.sonatype.org/ci/job/maven-plugins-ITs/./jdk=1.5,label=ubuntu/ws/trunk/maven-war-plugin/target/test-classes/unit/dependenciesanalysis/test-dir/dependency-update-version-test-data/source]>
[INFO] Webapp assembled in [4 msecs]
[INFO] Exploding webapp
[INFO] Assembling webapp[maven-war-plugin-test] in [<http://grid.sonatype.org/ci/job/maven-plugins-ITs/./jdk=1.5,label=ubuntu/ws/trunk/maven-war-plugin/target/test-classes/unit/dependenciesanalysis/test-dir/dependency-now-provided]>
[INFO] Processing war project
[INFO] Copying webapp resources[<http://grid.sonatype.org/ci/job/maven-plugins-ITs/./jdk=1.5,label=ubuntu/ws/trunk/maven-war-plugin/target/test-classes/unit/dependenciesanalysis/test-dir/dependency-now-provided-test-data/source]>
[INFO] Webapp assembled in [6 msecs]
[INFO] Exploding webapp
[INFO] Assembling webapp[maven-war-plugin-test] in [<http://grid.sonatype.org/ci/job/maven-plugins-ITs/./jdk=1.5,label=ubuntu/ws/trunk/maven-war-plugin/target/test-classes/unit/dependenciesanalysis/test-dir/dependency-now-provided]>
[INFO] Scope of dependency[Dependency {groupId=org.sample.jar, artifactId=lib-test, version=1.0,
type=jar}] has changed (runtime -> provided).
[INFO] Processing war project
[INFO] Copying webapp resources[<http://grid.sonatype.org/ci/job/maven-plugins-ITs/./jdk=1.5,label=ubuntu/ws/trunk/maven-war-plugin/target/test-classes/unit/dependenciesanalysis/test-dir/dependency-now-provided-test-data/source]>
[INFO] Webapp assembled in [4 msecs]
Tests run: 4, Failures: 0, Errors: 0, Skipped: 0, Time elapsed: 0.231 sec

Results :

Tests run: 81, Failures: 0, Errors: 0, Skipped: 0

[INFO] [jar:jar {execution: default-jar}]
[INFO] Building jar: <http://grid.sonatype.org/ci/job/maven-plugins-ITs/./jdk=1.5,label=ubuntu/ws/trunk/maven-war-plugin/target/maven-war-plugin-2.1-beta-2-SNAPSHOT.jar>
[INFO] [plugin:addPluginArtifactMetadata {execution: default-addPluginArtifactMetadata}]
[INFO] [invoker:install {execution: integration-test}]
[INFO] Installing <http://grid.sonatype.org/ci/job/maven-plugins-ITs/./jdk=1.5,label=ubuntu/ws/trunk/maven-war-plugin/pom.xml>
to <http://grid.sonatype.org/ci/job/maven-plugins-ITs/./jdk=1.5,label=ubuntu/ws/trunk/maven-war-plugin/target/local-repo/org/apache/maven/plugins/maven-war-plugin/2.1-beta-2-SNAPSHOT/maven-war-plugin-2.1-beta-2-SNAPSHOT.pom>
[INFO] Installing <http://grid.sonatype.org/ci/job/maven-plugins-ITs/./jdk=1.5,label=ubuntu/ws/trunk/maven-war-plugin/target/maven-war-plugin-2.1-beta-2-SNAPSHOT.jar>
to <http://grid.sonatype.org/ci/job/maven-plugins-ITs/./jdk=1.5,label=ubuntu/ws/trunk/maven-war-plugin/target/local-repo/org/apache/maven/plugins/maven-war-plugin/2.1-beta-2-SNAPSHOT/maven-war-plugin-2.1-beta-2-SNAPSHOT.jar>
[INFO] [invoker:run {execution: integration-test}]
[INFO] Building: web-resources-filtering/pom.xml
[INFO] ..SUCCESS (16.2 s)
[INFO] Building: MWAR-96/pom.xml
[INFO] ..SUCCESS (4.9 s)
[INFO] Building: MWAR-62/pom.xml
[INFO] ..SUCCESS (3.7 s)
[INFO] Building: default/pom.xml
[INFO] ..SUCCESS (6.5 s)
[INFO] Building: simple-war-no-webxml/pom.xml
[INFO] ..SUCCESS (5.3 s)
[INFO] Building: scoped-dependency-same-artifact/pom.xml
[INFO] ..SUCCESS (6.1 s)
[INFO] Building: MWAR-143/pom.xml
[INFO] ..SUCCESS (8.8 s)
[INFO] Building: MWAR-139/pom.xml
[INFO] ..SUCCESS (4.3 s)
[INFO] Building: simple-war-project/pom.xml
[INFO] ..SUCCESS (4.5 s)
[INFO] Building: MWAR-129/pom.xml
[INFO] ..SUCCESS (3.6 s)
[INFO] Building: MWAR-133/pom.xml
[INFO] ..SUCCESS (3.1 s)
[INFO] Building: MWAR-131/pom.xml
[INFO] ..SUCCESS (23.4 s)
[INFO] ---------------------------------------
[INFO] Execution Summary:
[INFO]   Builds Passing: 12
[INFO]   Builds Failing: 0
[INFO]   Builds Skipped: 0
[INFO] ---------------------------------------
[INFO] [install:install {execution: default-install}]
[INFO] Installing <http://grid.sonatype.org/ci/job/maven-plugins-ITs/./jdk=1.5,label=ubuntu/ws/trunk/maven-war-plugin/target/maven-war-plugin-2.1-beta-2-SNAPSHOT.jar>
to /opt/repos/local-repository/org/apache/maven/plugins/maven-war-plugin/2.1-beta-2-SNAPSHOT/maven-war-plugin-2.1-beta-2-SNAPSHOT.jar
[INFO] [deploy:deploy {execution: default-deploy}]
[INFO] Retrieving previous build number from apache.snapshots.https
Uploading: http://repository.sonatype.org:8081/content/repositories/maven.snapshots/org/apache/maven/plugins/maven-war-plugin/2.1-beta-2-SNAPSHOT/maven-war-plugin-2.1-beta-2-20100801.060821-476.jar
75K uploaded  (maven-war-plugin-2.1-beta-2-20100801.060821-476.jar)
[INFO] Retrieving previous metadata from apache.snapshots.https
[INFO] Uploading repository metadata for: 'artifact org.apache.maven.plugins:maven-war-plugin'
[INFO] Retrieving previous metadata from apache.snapshots.https
[INFO] Uploading repository metadata for: 'snapshot org.apache.maven.plugins:maven-war-plugin:2.1-beta-2-SNAPSHOT'
[INFO] Retrieving previous metadata from apache.snapshots.https
[INFO] Uploading repository metadata for: 'org.apache.maven.plugins'
[INFO] Uploading project information for maven-war-plugin 2.1-beta-2-20100801.060821-476
[INFO] ------------------------------------------------------------------------
[INFO] Building Maven Plugins Aggregator
[INFO]    task-segment: [clean, deploy]
[INFO] ------------------------------------------------------------------------
[INFO] [clean:clean {execution: default-clean}]
[INFO] Deleting file set: <http://grid.sonatype.org/ci/job/maven-plugins-ITs/./jdk=1.5,label=ubuntu/ws/trunk/target>
(included: [**], excluded: [])
[INFO] [remote-resources:process {execution: default}]
[INFO] [site:attach-descriptor {execution: default-attach-descriptor}]
[INFO] [install:install {execution: default-install}]
[INFO] Installing <http://grid.sonatype.org/ci/job/maven-plugins-ITs/./jdk=1.5,label=ubuntu/ws/trunk/pom.xml>
to /opt/repos/local-repository/org/apache/maven/plugins/maven-plugins-aggregator/1-SNAPSHOT/maven-plugins-aggregator-1-SNAPSHOT.pom
[INFO] [deploy:deploy {execution: default-deploy}]
[INFO] Retrieving previous build number from apache.snapshots.https
Uploading: http://repository.sonatype.org:8081/content/repositories/maven.snapshots/org/apache/maven/plugins/maven-plugins-aggregator/1-SNAPSHOT/maven-plugins-aggregator-1-20100801.060821-35.pom
3K uploaded  (maven-plugins-aggregator-1-20100801.060821-35.pom)
[INFO] Retrieving previous metadata from apache.snapshots.https
[INFO] Uploading repository metadata for: 'artifact org.apache.maven.plugins:maven-plugins-aggregator'
[INFO] Retrieving previous metadata from apache.snapshots.https
[INFO] Uploading repository metadata for: 'snapshot org.apache.maven.plugins:maven-plugins-aggregator:1-SNAPSHOT'
[INFO] 
[INFO] 
[INFO] ------------------------------------------------------------------------
[INFO] Reactor Summary:
[INFO] ------------------------------------------------------------------------
[INFO] Maven Plugins ......................................... SUCCESS [4:13.128s]
[INFO] Maven Invoker Plugin .................................. SUCCESS [8:54.802s]
[INFO] Maven Ant Plugin ...................................... SUCCESS [3:09.332s]
[INFO] Maven AntRun Plugin ................................... SUCCESS [1:51.400s]
[INFO] Maven Eclipse Plugin .................................. SUCCESS [11:53.002s]
[INFO] Maven Changelog Plugin ................................ SUCCESS [42.345s]
[INFO] Maven Changes Report Plugin ........................... SUCCESS [1:21.159s]
[INFO] Maven Checkstyle Plugin ............................... SUCCESS [2:45.768s]
[INFO] Maven Clean Plugin .................................... SUCCESS [23.533s]
[INFO] Maven Compiler Plugin ................................. SUCCESS [32.610s]
[INFO] Maven Dependency Plugin ............................... SUCCESS [4:08.862s]
[INFO] Maven Deploy Plugin ................................... SUCCESS [1:58.466s]
[INFO] Maven DOAP Plugin ..................................... SUCCESS [22.826s]
[INFO] Maven Documentation Checker Plugin .................... SUCCESS [28.560s]
[INFO] Maven EAR Plugin ...................................... SUCCESS [4:51.157s]
[INFO] Maven EJB Plugin ...................................... SUCCESS [59.923s]
[INFO] Maven GPG Plugin ...................................... SUCCESS [45.431s]
[INFO] Maven Help Plugin ..................................... SUCCESS [55.574s]
[INFO] Maven IDEA Plugin ..................................... SUCCESS [18.652s]
[INFO] Maven Install Plugin .................................. SUCCESS [1:40.738s]
[INFO] Maven JAR Plugin ...................................... SUCCESS [2:09.388s]
[INFO] Maven Jarsigner Plugin ................................ SUCCESS [1:04.241s]
[INFO] Maven Shade Plugin .................................... SUCCESS [2:55.954s]
[INFO] Maven Javadoc Plugin .................................. SUCCESS [14:20.240s]
[INFO] Maven Linkcheck Plugin ................................ FAILED [0.559s]
[INFO] Maven One Plugin ...................................... SUCCESS [8.450s]
[INFO] Maven Patch Plugin .................................... SUCCESS [26.793s]
[INFO] Maven PDF Plugin ...................................... SUCCESS [52.915s]
[INFO] Maven PMD Plugin ...................................... SUCCESS [1:11.432s]
[INFO] Maven RAR Plugin ...................................... SUCCESS [28.086s]
[INFO] Maven Reactor Plugin .................................. SUCCESS [10.318s]
[INFO] Maven Repository Plugin ............................... SUCCESS [1:20.117s]
[INFO] Maven Resources Plugin ................................ SUCCESS [1:09.582s]
[INFO] Maven Site Plugin ..................................... SUCCESS [4:53.570s]
[INFO] Maven Source Plugin ................................... SUCCESS [53.215s]
[INFO] Maven Stage Plugin .................................... SUCCESS [6.221s]
[INFO] Maven Toolchains Plugin ............................... SUCCESS [5.693s]
[INFO] Maven Verifier Plugin ................................. SUCCESS [14.928s]
[INFO] Maven WAR Plugin ...................................... SUCCESS [2:01.031s]
[INFO] Maven Plugins Aggregator .............................. SUCCESS [2.226s]
[INFO] ------------------------------------------------------------------------
[INFO] Error for project: Maven Linkcheck Plugin (during deploy)
[INFO] ------------------------------------------------------------------------
[INFO] Failed to resolve artifact.

Missing:
----------
1) org.apache.maven.doxia:doxia-linkcheck:jar:1.1-SNAPSHOT

  Try downloading the file manually from the project website.

  Then, install it using the command: 
      mvn install:install-file -DgroupId=org.apache.maven.doxia -DartifactId=doxia-linkcheck
-Dversion=1.1-20100728.152249-15 -Dpackaging=jar -Dfile=/path/to/file

  Alternatively, if you host your own repository you can deploy the file there: 
      mvn deploy:deploy-file -DgroupId=org.apache.maven.doxia -DartifactId=doxia-linkcheck
-Dversion=1.1-20100728.152249-15 -Dpackaging=jar -Dfile=/path/to/file -Durl=[url] -DrepositoryId=[id]

  Path to dependency: 
  	1) org.apache.maven.plugins:maven-linkcheck-plugin:maven-plugin:1.0-SNAPSHOT
  	2) org.apache.maven.doxia:doxia-linkcheck:jar:1.1-SNAPSHOT

----------
1 required artifact is missing.

for artifact: 
  org.apache.maven.plugins:maven-linkcheck-plugin:maven-plugin:1.0-SNAPSHOT

from the specified remote repositories:
  Nexus (http://repository.sonatype.org:8081/content/groups/sonatype-public-grid)



[INFO] ------------------------------------------------------------------------
[INFO] Trace
org.apache.maven.lifecycle.LifecycleExecutionException: Missing:
----------
1) org.apache.maven.doxia:doxia-linkcheck:jar:1.1-SNAPSHOT

  Try downloading the file manually from the project website.

  Then, install it using the command: 
      mvn install:install-file -DgroupId=org.apache.maven.doxia -DartifactId=doxia-linkcheck
-Dversion=1.1-20100728.152249-15 -Dpackaging=jar -Dfile=/path/to/file

  Alternatively, if you host your own repository you can deploy the file there: 
      mvn deploy:deploy-file -DgroupId=org.apache.maven.doxia -DartifactId=doxia-linkcheck
-Dversion=1.1-20100728.152249-15 -Dpackaging=jar -Dfile=/path/to/file -Durl=[url] -DrepositoryId=[id]

  Path to dependency: 
  	1) org.apache.maven.plugins:maven-linkcheck-plugin:maven-plugin:1.0-SNAPSHOT
  	2) org.apache.maven.doxia:doxia-linkcheck:jar:1.1-SNAPSHOT

----------
1 required artifact is missing.

for artifact: 
  org.apache.maven.plugins:maven-linkcheck-plugin:maven-plugin:1.0-SNAPSHOT

from the specified remote repositories:
  Nexus (http://repository.sonatype.org:8081/content/groups/sonatype-public-grid)


	at org.apache.maven.lifecycle.DefaultLifecycleExecutor.executeGoals(DefaultLifecycleExecutor.java:711)
	at org.apache.maven.lifecycle.DefaultLifecycleExecutor.executeGoalWithLifecycle(DefaultLifecycleExecutor.java:556)
	at org.apache.maven.lifecycle.DefaultLifecycleExecutor.executeGoal(DefaultLifecycleExecutor.java:535)
	at org.apache.maven.lifecycle.DefaultLifecycleExecutor.executeGoalAndHandleFailures(DefaultLifecycleExecutor.java:387)
	at org.apache.maven.lifecycle.DefaultLifecycleExecutor.executeTaskSegments(DefaultLifecycleExecutor.java:348)
	at org.apache.maven.lifecycle.DefaultLifecycleExecutor.execute(DefaultLifecycleExecutor.java:180)
	at org.apache.maven.DefaultMaven.doExecute(DefaultMaven.java:328)
	at org.apache.maven.DefaultMaven.execute(DefaultMaven.java:138)
	at org.apache.maven.cli.MavenCli.main(MavenCli.java:362)
	at org.apache.maven.cli.compat.CompatibleMain.main(CompatibleMain.java:60)
	at sun.reflect.NativeMethodAccessorImpl.invoke0(Native Method)
	at sun.reflect.NativeMethodAccessorImpl.invoke(NativeMethodAccessorImpl.java:39)
	at sun.reflect.DelegatingMethodAccessorImpl.invoke(DelegatingMethodAccessorImpl.java:25)
	at java.lang.reflect.Method.invoke(Method.java:585)
	at org.codehaus.classworlds.Launcher.launchEnhanced(Launcher.java:315)
	at org.codehaus.classworlds.Launcher.launch(Launcher.java:255)
	at org.codehaus.classworlds.Launcher.mainWithExitCode(Launcher.java:430)
	at org.codehaus.classworlds.Launcher.main(Launcher.java:375)
Caused by: org.apache.maven.artifact.resolver.MultipleArtifactsNotFoundException: Missing:
----------
1) org.apache.maven.doxia:doxia-linkcheck:jar:1.1-SNAPSHOT

  Try downloading the file manually from the project website.

  Then, install it using the command: 
      mvn install:install-file -DgroupId=org.apache.maven.doxia -DartifactId=doxia-linkcheck
-Dversion=1.1-20100728.152249-15 -Dpackaging=jar -Dfile=/path/to/file

  Alternatively, if you host your own repository you can deploy the file there: 
      mvn deploy:deploy-file -DgroupId=org.apache.maven.doxia -DartifactId=doxia-linkcheck
-Dversion=1.1-20100728.152249-15 -Dpackaging=jar -Dfile=/path/to/file -Durl=[url] -DrepositoryId=[id]

  Path to dependency: 
  	1) org.apache.maven.plugins:maven-linkcheck-plugin:maven-plugin:1.0-SNAPSHOT
  	2) org.apache.maven.doxia:doxia-linkcheck:jar:1.1-SNAPSHOT

----------
1 required artifact is missing.

for artifact: 
  org.apache.maven.plugins:maven-linkcheck-plugin:maven-plugin:1.0-SNAPSHOT

from the specified remote repositories:
  Nexus (http://repository.sonatype.org:8081/content/groups/sonatype-public-grid)


	at org.apache.maven.artifact.resolver.DefaultArtifactResolver.resolveTransitively(DefaultArtifactResolver.java:360)
	at org.apache.maven.artifact.resolver.DefaultArtifactResolver.resolveTransitively(DefaultArtifactResolver.java:304)
	at org.apache.maven.plugin.DefaultPluginManager.resolveTransitiveDependencies(DefaultPluginManager.java:1499)
	at org.apache.maven.plugin.DefaultPluginManager.executeMojo(DefaultPluginManager.java:442)
	at org.apache.maven.lifecycle.DefaultLifecycleExecutor.executeGoals(DefaultLifecycleExecutor.java:694)
	... 17 more
[INFO] ------------------------------------------------------------------------
[INFO] BUILD ERRORS
[INFO] ------------------------------------------------------------------------
[INFO] Total time: 87 minutes 7 seconds
[INFO] Finished at: Sun Aug 01 01:31:30 GMT-06:00 2010
[INFO] Final Memory: 66M/135M
[INFO] ------------------------------------------------------------------------


Mime
View raw message