maven-notifications mailing list archives

Site index · List index
Message view « Date » · « Thread »
Top « Date » · « Thread »
From Hudson <Hud...@sonatype.org>
Subject Build failed in Hudson: maven-plugins-UTs » 1.5,ubuntu #708
Date Sat, 17 Jul 2010 17:30:15 GMT
See <http://grid.sonatype.org/ci/job/maven-plugins-UTs/./jdk=1.5,label=ubuntu/708/changes>

Changes:

[Benjamin Bentmann] [MASSEMBLY-490] Assembly fails with 'Too many files' error when converting
line endings.

[Benjamin Bentmann] [maven-release-plugin] prepare for next development iteration

[Benjamin Bentmann] [maven-release-plugin] prepare release maven-repository-plugin-2.3.1

[Benjamin Bentmann] o Polished documentation

[Benjamin Bentmann] o Inherited from maven-plugins:18 and updated to maven-invoker-plugin:1.5

[Benjamin Bentmann] o Polished code

[Benjamin Bentmann] o Polished code

[Benjamin Bentmann] [MREPOSITORY-24] bundle-create mojos emits bogus warning about missing
sources/javadocs if main artifact is not a jar

------------------------------------------
[...truncated 19984 lines...]
[INFO] Processing war project
[INFO] Copying webapp resources[<http://grid.sonatype.org/ci/job/maven-plugins-UTs/./jdk=1.5,label=ubuntu/ws/trunk/maven-war-plugin/target/test-classes/unit/warexplodedmojo/test-dir/testExplodedWarMergeWarLocalFileOverride-test-data/source]>
[INFO] Processing overlay[ id wartests:simple]
[INFO] Webapp assembled in [10 msecs]
[INFO] Exploding webapp
[INFO] Assembling webapp[maven-war-plugin-test] in [<http://grid.sonatype.org/ci/job/maven-plugins-UTs/./jdk=1.5,label=ubuntu/ws/trunk/maven-war-plugin/target/test-classes/unit/warexplodedmojo/test-dir/testExplodedWarMergeWarLocalFileOverride]>
[INFO] Processing war project
[INFO] Copying webapp resources[<http://grid.sonatype.org/ci/job/maven-plugins-UTs/./jdk=1.5,label=ubuntu/ws/trunk/maven-war-plugin/target/test-classes/unit/warexplodedmojo/test-dir/testExplodedWarMergeWarLocalFileOverride-test-data/source]>
[INFO] Processing overlay[ id wartests:simple]
[INFO] Webapp assembled in [5 msecs]
[INFO] Exploding webapp
[INFO] Assembling webapp[maven-war-plugin-test] in [<http://grid.sonatype.org/ci/job/maven-plugins-UTs/./jdk=1.5,label=ubuntu/ws/trunk/maven-war-plugin/target/test-classes/unit/warexplodedmojo/test-dir/ExplodedWar_WithEJB]>
[INFO] Processing war project
[INFO] Copying webapp resources[<http://grid.sonatype.org/ci/job/maven-plugins-UTs/./jdk=1.5,label=ubuntu/ws/trunk/maven-war-plugin/target/test-classes/unit/warexplodedmojo/test-dir/ExplodedWar_WithEJB-test-data/source]>
[INFO] Webapp assembled in [7 msecs]
[INFO] Exploding webapp
[INFO] Assembling webapp[maven-war-plugin-test] in [<http://grid.sonatype.org/ci/job/maven-plugins-UTs/./jdk=1.5,label=ubuntu/ws/trunk/maven-war-plugin/target/test-classes/unit/warexplodedmojo/test-dir/ExplodedWarWithJar]>
[INFO] Processing war project
[INFO] Copying webapp resources[<http://grid.sonatype.org/ci/job/maven-plugins-UTs/./jdk=1.5,label=ubuntu/ws/trunk/maven-war-plugin/target/test-classes/unit/warexplodedmojo/test-dir/ExplodedWarWithJar-test-data/source]>
[INFO] Webapp assembled in [4 msecs]
[INFO] Exploding webapp
[INFO] Assembling webapp[maven-war-plugin-test] in [<http://grid.sonatype.org/ci/job/maven-plugins-UTs/./jdk=1.5,label=ubuntu/ws/trunk/maven-war-plugin/target/test-classes/unit/warexplodedmojo/test-dir/ExplodedWar_WithEJB]>
[INFO] Processing war project
[INFO] Copying webapp resources[<http://grid.sonatype.org/ci/job/maven-plugins-UTs/./jdk=1.5,label=ubuntu/ws/trunk/maven-war-plugin/target/test-classes/unit/warexplodedmojo/test-dir/ExplodedWar_WithEJB-test-data/source]>
[INFO] Webapp assembled in [21 msecs]
[INFO] Exploding webapp
[INFO] Assembling webapp[maven-war-plugin-test] in [<http://grid.sonatype.org/ci/job/maven-plugins-UTs/./jdk=1.5,label=ubuntu/ws/trunk/maven-war-plugin/target/test-classes/unit/warexplodedmojo/test-dir/ExplodedWar_WithTLD]>
[INFO] Processing war project
[INFO] Copying webapp resources[<http://grid.sonatype.org/ci/job/maven-plugins-UTs/./jdk=1.5,label=ubuntu/ws/trunk/maven-war-plugin/target/test-classes/unit/warexplodedmojo/test-dir/ExplodedWar_WithTLD-test-data/source]>
[INFO] Webapp assembled in [7 msecs]
[INFO] Exploding webapp
[INFO] Assembling webapp[maven-war-plugin-test] in [<http://grid.sonatype.org/ci/job/maven-plugins-UTs/./jdk=1.5,label=ubuntu/ws/trunk/maven-war-plugin/target/test-classes/unit/warexplodedmojo/test-dir/ExplodedWar_WithPAR]>
[INFO] Processing war project
[INFO] Copying webapp resources[<http://grid.sonatype.org/ci/job/maven-plugins-UTs/./jdk=1.5,label=ubuntu/ws/trunk/maven-war-plugin/target/test-classes/unit/warexplodedmojo/test-dir/ExplodedWar_WithPAR-test-data/source]>
[INFO] Webapp assembled in [5 msecs]
[INFO] Exploding webapp
[INFO] Assembling webapp[maven-war-plugin-test] in [<http://grid.sonatype.org/ci/job/maven-plugins-UTs/./jdk=1.5,label=ubuntu/ws/trunk/maven-war-plugin/target/test-classes/unit/warexplodedmojo/test-dir/ExplodedWarWithAar]>
[INFO] Processing war project
[INFO] Copying webapp resources[<http://grid.sonatype.org/ci/job/maven-plugins-UTs/./jdk=1.5,label=ubuntu/ws/trunk/maven-war-plugin/target/test-classes/unit/warexplodedmojo/test-dir/ExplodedWarWithAar-test-data/source]>
[INFO] Webapp assembled in [5 msecs]
[INFO] Exploding webapp
[INFO] Assembling webapp[maven-war-plugin-test] in [<http://grid.sonatype.org/ci/job/maven-plugins-UTs/./jdk=1.5,label=ubuntu/ws/trunk/maven-war-plugin/target/test-classes/unit/warexplodedmojo/test-dir/ExplodedWar_WithDuplicateDependencies]>
[INFO] Processing war project
[INFO] Copying webapp resources[<http://grid.sonatype.org/ci/job/maven-plugins-UTs/./jdk=1.5,label=ubuntu/ws/trunk/maven-war-plugin/target/test-classes/unit/warexplodedmojo/test-dir/ExplodedWar_WithDuplicateDependencies-test-data/source]>
[INFO] Webapp assembled in [5 msecs]
[INFO] Exploding webapp
[INFO] Assembling webapp[maven-war-plugin-test] in [<http://grid.sonatype.org/ci/job/maven-plugins-UTs/./jdk=1.5,label=ubuntu/ws/trunk/maven-war-plugin/target/test-classes/unit/warexplodedmojo/test-dir/ExplodedWar_DuplicateWithClassifier]>
[INFO] Processing war project
[INFO] Copying webapp resources[<http://grid.sonatype.org/ci/job/maven-plugins-UTs/./jdk=1.5,label=ubuntu/ws/trunk/maven-war-plugin/target/test-classes/unit/warexplodedmojo/test-dir/ExplodedWar_DuplicateWithClassifier-test-data/source]>
[INFO] Webapp assembled in [6 msecs]
[INFO] Exploding webapp
[INFO] Assembling webapp[maven-war-plugin-test] in [<http://grid.sonatype.org/ci/job/maven-plugins-UTs/./jdk=1.5,label=ubuntu/ws/trunk/maven-war-plugin/target/test-classes/unit/warexplodedmojo/test-dir/ExplodedWar_WithClasses]>
[INFO] Processing war project
[INFO] Copying webapp resources[<http://grid.sonatype.org/ci/job/maven-plugins-UTs/./jdk=1.5,label=ubuntu/ws/trunk/maven-war-plugin/target/test-classes/unit/warexplodedmojo/test-dir/ExplodedWar_WithClasses-test-data/source]>
[INFO] Webapp assembled in [4 msecs]
[INFO] Exploding webapp
[INFO] Assembling webapp[maven-war-plugin-test] in [<http://grid.sonatype.org/ci/job/maven-plugins-UTs/./jdk=1.5,label=ubuntu/ws/trunk/maven-war-plugin/target/test-classes/unit/warexplodedmojo/test-dir/ExplodedWar_WithSourceIncludeExclude]>
[INFO] Processing war project
[INFO] Copying webapp resources[<http://grid.sonatype.org/ci/job/maven-plugins-UTs/./jdk=1.5,label=ubuntu/ws/trunk/maven-war-plugin/target/test-classes/unit/warexplodedmojo/test-dir/ExplodedWar_WithSourceIncludeExclude-test-data/source]>
[INFO] Webapp assembled in [3 msecs]
[INFO] Exploding webapp
[INFO] Assembling webapp[maven-war-plugin-test] in [<http://grid.sonatype.org/ci/job/maven-plugins-UTs/./jdk=1.5,label=ubuntu/ws/trunk/maven-war-plugin/target/test-classes/unit/warexplodedmojo/test-dir/ExplodedWar_WithWarDependencyIncludeExclude]>
[INFO] Processing war project
[INFO] Copying webapp resources[<http://grid.sonatype.org/ci/job/maven-plugins-UTs/./jdk=1.5,label=ubuntu/ws/trunk/maven-war-plugin/target/test-classes/unit/warexplodedmojo/test-dir/ExplodedWar_WithWarDependencyIncludeExclude-test-data/source]>
[INFO] Processing overlay[ id wartests:war-include-exclude]
[INFO] Webapp assembled in [11 msecs]
[INFO] Exploding webapp
[INFO] Assembling webapp[maven-war-plugin-test] in [<http://grid.sonatype.org/ci/job/maven-plugins-UTs/./jdk=1.5,label=ubuntu/ws/trunk/maven-war-plugin/target/test-classes/unit/warexplodedmojo/test-dir/ExplodedWarWithSourceModificationCheck]>
[INFO] Processing war project
[INFO] Copying webapp resources[<http://grid.sonatype.org/ci/job/maven-plugins-UTs/./jdk=1.5,label=ubuntu/ws/trunk/maven-war-plugin/target/test-classes/unit/warexplodedmojo/test-dir/ExplodedWarWithSourceModificationCheck-test-data/source]>
[INFO] Webapp assembled in [4 msecs]
[INFO] Exploding webapp
[INFO] Assembling webapp[maven-war-plugin-test] in [<http://grid.sonatype.org/ci/job/maven-plugins-UTs/./jdk=1.5,label=ubuntu/ws/trunk/maven-war-plugin/target/test-classes/unit/warexplodedmojo/test-dir/ExplodedWarWithFileNameMapping]>
[INFO] Processing war project
[INFO] Copying webapp resources[<http://grid.sonatype.org/ci/job/maven-plugins-UTs/./jdk=1.5,label=ubuntu/ws/trunk/maven-war-plugin/target/test-classes/unit/warexplodedmojo/test-dir/ExplodedWarWithFileNameMapping-test-data/source]>
[INFO] Webapp assembled in [4 msecs]
[INFO] Exploding webapp
[INFO] Assembling webapp[maven-war-plugin-test] in [<http://grid.sonatype.org/ci/job/maven-plugins-UTs/./jdk=1.5,label=ubuntu/ws/trunk/maven-war-plugin/target/test-classes/unit/warexplodedmojo/test-dir/ExplodedWarWithFileNameMappingAndDuplicateDependencies]>
[INFO] Processing war project
[INFO] Copying webapp resources[<http://grid.sonatype.org/ci/job/maven-plugins-UTs/./jdk=1.5,label=ubuntu/ws/trunk/maven-war-plugin/target/test-classes/unit/warexplodedmojo/test-dir/ExplodedWarWithFileNameMappingAndDuplicateDependencies-test-data/source]>
[INFO] Webapp assembled in [6 msecs]
Tests run: 20, Failures: 0, Errors: 0, Skipped: 0, Time elapsed: 1.39 sec
Running org.apache.maven.plugin.war.WarInPlaceMojoTest
[INFO] Generating webapp in source directory[<http://grid.sonatype.org/ci/job/maven-plugins-UTs/./jdk=1.5,label=ubuntu/ws/trunk/maven-war-plugin/target/test-classes/unit/warexplodedinplacemojo/test-dir/SimpleExplodedInplaceWar-test-data/source]>
[INFO] Assembling webapp[maven-war-plugin-test] in [<http://grid.sonatype.org/ci/job/maven-plugins-UTs/./jdk=1.5,label=ubuntu/ws/trunk/maven-war-plugin/target/test-classes/unit/warexplodedinplacemojo/test-dir/SimpleExplodedInplaceWar-test-data/source]>
[INFO] Processing war project
[INFO] Copying webapp webResources[<http://grid.sonatype.org/ci/job/maven-plugins-UTs/./jdk=1.5,label=ubuntu/ws/trunk/maven-war-plugin/target/test-classes/unit/warexplodedinplacemojo/test-dir/resources]>
to[<http://grid.sonatype.org/ci/job/maven-plugins-UTs/./jdk=1.5,label=ubuntu/ws/trunk/maven-war-plugin/target/test-classes/unit/warexplodedinplacemojo/test-dir/SimpleExplodedInplaceWar-test-data/source]>
[INFO] Webapp assembled in [3 msecs]
Tests run: 2, Failures: 0, Errors: 0, Skipped: 0, Time elapsed: 0.074 sec
Running org.apache.maven.plugin.war.WarManifestMojoTest
Tests run: 5, Failures: 0, Errors: 0, Skipped: 0, Time elapsed: 0.274 sec
Running org.apache.maven.plugin.war.util.PathSetTest
Tests run: 5, Failures: 0, Errors: 0, Skipped: 0, Time elapsed: 0.01 sec
Running org.apache.maven.plugin.war.util.WarUtilsTest
Tests run: 1, Failures: 0, Errors: 0, Skipped: 0, Time elapsed: 0.002 sec
Running org.apache.maven.plugin.war.overlay.OverlayManagerTest
Tests run: 5, Failures: 0, Errors: 0, Skipped: 0, Time elapsed: 0.197 sec
Running org.apache.maven.plugin.war.WarDependenciesAnalysisTest
[INFO] Exploding webapp
[INFO] Assembling webapp[maven-war-plugin-test] in [<http://grid.sonatype.org/ci/job/maven-plugins-UTs/./jdk=1.5,label=ubuntu/ws/trunk/maven-war-plugin/target/test-classes/unit/dependenciesanalysis/test-dir/no-change]>
[INFO] Processing war project
[INFO] Copying webapp resources[<http://grid.sonatype.org/ci/job/maven-plugins-UTs/./jdk=1.5,label=ubuntu/ws/trunk/maven-war-plugin/target/test-classes/unit/dependenciesanalysis/test-dir/no-change-test-data/source]>
[INFO] Webapp assembled in [6 msecs]
[INFO] Exploding webapp
[INFO] Assembling webapp[maven-war-plugin-test] in [<http://grid.sonatype.org/ci/job/maven-plugins-UTs/./jdk=1.5,label=ubuntu/ws/trunk/maven-war-plugin/target/test-classes/unit/dependenciesanalysis/test-dir/no-change]>
[INFO] Processing war project
[INFO] Copying webapp resources[<http://grid.sonatype.org/ci/job/maven-plugins-UTs/./jdk=1.5,label=ubuntu/ws/trunk/maven-war-plugin/target/test-classes/unit/dependenciesanalysis/test-dir/no-change-test-data/source]>
[INFO] Webapp assembled in [4 msecs]
[INFO] Exploding webapp
[INFO] Assembling webapp[maven-war-plugin-test] in [<http://grid.sonatype.org/ci/job/maven-plugins-UTs/./jdk=1.5,label=ubuntu/ws/trunk/maven-war-plugin/target/test-classes/unit/dependenciesanalysis/test-dir/remove-dependency]>
[INFO] Processing war project
[INFO] Copying webapp resources[<http://grid.sonatype.org/ci/job/maven-plugins-UTs/./jdk=1.5,label=ubuntu/ws/trunk/maven-war-plugin/target/test-classes/unit/dependenciesanalysis/test-dir/remove-dependency-test-data/source]>
[INFO] Webapp assembled in [5 msecs]
[INFO] Exploding webapp
[INFO] Assembling webapp[maven-war-plugin-test] in [<http://grid.sonatype.org/ci/job/maven-plugins-UTs/./jdk=1.5,label=ubuntu/ws/trunk/maven-war-plugin/target/test-classes/unit/dependenciesanalysis/test-dir/remove-dependency]>
[INFO] Dependency[Dependency {groupId=org.sample.jar, artifactId=lib-test, version=1.0, type=jar}]
has been removed from the project.
[INFO] Processing war project
[INFO] Copying webapp resources[<http://grid.sonatype.org/ci/job/maven-plugins-UTs/./jdk=1.5,label=ubuntu/ws/trunk/maven-war-plugin/target/test-classes/unit/dependenciesanalysis/test-dir/remove-dependency-test-data/source]>
[INFO] Webapp assembled in [3 msecs]
[INFO] Exploding webapp
[INFO] Assembling webapp[maven-war-plugin-test] in [<http://grid.sonatype.org/ci/job/maven-plugins-UTs/./jdk=1.5,label=ubuntu/ws/trunk/maven-war-plugin/target/test-classes/unit/dependenciesanalysis/test-dir/dependency-update-version]>
[INFO] Processing war project
[INFO] Copying webapp resources[<http://grid.sonatype.org/ci/job/maven-plugins-UTs/./jdk=1.5,label=ubuntu/ws/trunk/maven-war-plugin/target/test-classes/unit/dependenciesanalysis/test-dir/dependency-update-version-test-data/source]>
[INFO] Webapp assembled in [5 msecs]
[INFO] Exploding webapp
[INFO] Assembling webapp[maven-war-plugin-test] in [<http://grid.sonatype.org/ci/job/maven-plugins-UTs/./jdk=1.5,label=ubuntu/ws/trunk/maven-war-plugin/target/test-classes/unit/dependenciesanalysis/test-dir/dependency-update-version]>
[INFO] Version of dependency[Dependency {groupId=org.sample.jar, artifactId=lib-test, version=2.0,
type=jar}] has changed (1.0 -> 2.0).
[INFO] Processing war project
[INFO] Copying webapp resources[<http://grid.sonatype.org/ci/job/maven-plugins-UTs/./jdk=1.5,label=ubuntu/ws/trunk/maven-war-plugin/target/test-classes/unit/dependenciesanalysis/test-dir/dependency-update-version-test-data/source]>
[INFO] Webapp assembled in [3 msecs]
[INFO] Exploding webapp
[INFO] Assembling webapp[maven-war-plugin-test] in [<http://grid.sonatype.org/ci/job/maven-plugins-UTs/./jdk=1.5,label=ubuntu/ws/trunk/maven-war-plugin/target/test-classes/unit/dependenciesanalysis/test-dir/dependency-now-provided]>
[INFO] Processing war project
[INFO] Copying webapp resources[<http://grid.sonatype.org/ci/job/maven-plugins-UTs/./jdk=1.5,label=ubuntu/ws/trunk/maven-war-plugin/target/test-classes/unit/dependenciesanalysis/test-dir/dependency-now-provided-test-data/source]>
[INFO] Webapp assembled in [6 msecs]
[INFO] Exploding webapp
[INFO] Assembling webapp[maven-war-plugin-test] in [<http://grid.sonatype.org/ci/job/maven-plugins-UTs/./jdk=1.5,label=ubuntu/ws/trunk/maven-war-plugin/target/test-classes/unit/dependenciesanalysis/test-dir/dependency-now-provided]>
[INFO] Scope of dependency[Dependency {groupId=org.sample.jar, artifactId=lib-test, version=1.0,
type=jar}] has changed (runtime -> provided).
[INFO] Processing war project
[INFO] Copying webapp resources[<http://grid.sonatype.org/ci/job/maven-plugins-UTs/./jdk=1.5,label=ubuntu/ws/trunk/maven-war-plugin/target/test-classes/unit/dependenciesanalysis/test-dir/dependency-now-provided-test-data/source]>
[INFO] Webapp assembled in [4 msecs]
Tests run: 4, Failures: 0, Errors: 0, Skipped: 0, Time elapsed: 0.205 sec

Results :

Tests run: 81, Failures: 0, Errors: 0, Skipped: 0

[INFO] [jar:jar {execution: default-jar}]
[INFO] Building jar: <http://grid.sonatype.org/ci/job/maven-plugins-UTs/./jdk=1.5,label=ubuntu/ws/trunk/maven-war-plugin/target/maven-war-plugin-2.1-beta-2-SNAPSHOT.jar>
[INFO] [plugin:addPluginArtifactMetadata {execution: default-addPluginArtifactMetadata}]
[INFO] [install:install {execution: default-install}]
[INFO] Installing <http://grid.sonatype.org/ci/job/maven-plugins-UTs/./jdk=1.5,label=ubuntu/ws/trunk/maven-war-plugin/target/maven-war-plugin-2.1-beta-2-SNAPSHOT.jar>
to /opt/repos/local-repository/org/apache/maven/plugins/maven-war-plugin/2.1-beta-2-SNAPSHOT/maven-war-plugin-2.1-beta-2-SNAPSHOT.jar
[INFO] ------------------------------------------------------------------------
[INFO] Building Maven Plugins Aggregator
[INFO]    task-segment: [clean, install]
[INFO] ------------------------------------------------------------------------
[INFO] [clean:clean {execution: default-clean}]
[INFO] [remote-resources:process {execution: default}]
[INFO] [site:attach-descriptor {execution: default-attach-descriptor}]
[INFO] [install:install {execution: default-install}]
[INFO] Installing <http://grid.sonatype.org/ci/job/maven-plugins-UTs/./jdk=1.5,label=ubuntu/ws/trunk/pom.xml>
to /opt/repos/local-repository/org/apache/maven/plugins/maven-plugins-aggregator/1-SNAPSHOT/maven-plugins-aggregator-1-SNAPSHOT.pom
[INFO] 
[INFO] 
[INFO] ------------------------------------------------------------------------
[INFO] Reactor Summary:
[INFO] ------------------------------------------------------------------------
[INFO] Maven Plugins ......................................... SUCCESS [9.010s]
[INFO] Maven Ant Plugin ...................................... SUCCESS [15.925s]
[INFO] Maven AntRun Plugin ................................... SUCCESS [6.380s]
[INFO] Maven Eclipse Plugin .................................. SUCCESS [21.838s]
[INFO] Maven Changelog Plugin ................................ SUCCESS [21.398s]
[INFO] Maven Changes Report Plugin ........................... SUCCESS [27.220s]
[INFO] Maven Checkstyle Plugin ............................... SUCCESS [32.727s]
[INFO] Maven Clean Plugin .................................... SUCCESS [5.878s]
[INFO] Maven Compiler Plugin ................................. SUCCESS [11.835s]
[INFO] Maven Dependency Plugin ............................... SUCCESS [3:28.815s]
[INFO] Maven Deploy Plugin ................................... SUCCESS [7.841s]
[INFO] Maven DOAP Plugin ..................................... SUCCESS [11.340s]
[INFO] Maven Documentation Checker Plugin .................... SUCCESS [3.670s]
[INFO] Maven EAR Plugin ...................................... SUCCESS [7.400s]
[INFO] Maven EJB Plugin ...................................... SUCCESS [19.093s]
[INFO] Maven GPG Plugin ...................................... SUCCESS [4.068s]
[INFO] Maven Help Plugin ..................................... SUCCESS [8.500s]
[INFO] Maven IDEA Plugin ..................................... SUCCESS [21.520s]
[INFO] Maven Install Plugin .................................. SUCCESS [7.445s]
[INFO] Maven Invoker Plugin .................................. SUCCESS [15.263s]
[INFO] Maven JAR Plugin ...................................... SUCCESS [6.527s]
[INFO] Maven Jarsigner Plugin ................................ SUCCESS [4.383s]
[INFO] Maven Shade Plugin .................................... SUCCESS [15.986s]
[INFO] Maven Javadoc Plugin .................................. FAILED [6:32.615s]
[INFO] Maven Linkcheck Plugin ................................ SUCCESS [3.169s]
[INFO] Maven One Plugin ...................................... SUCCESS [3.106s]
[INFO] Maven Patch Plugin .................................... SUCCESS [3.467s]
[INFO] Maven PDF Plugin ...................................... SUCCESS [46.953s]
[INFO] Maven PMD Plugin ...................................... SUCCESS [17.956s]
[INFO] Maven RAR Plugin ...................................... SUCCESS [5.540s]
[INFO] Maven Reactor Plugin .................................. SUCCESS [8.870s]
[INFO] Maven Repository Plugin ............................... SUCCESS [9.822s]
[INFO] Maven Resources Plugin ................................ SUCCESS [9.023s]
[INFO] Maven Site Plugin ..................................... SUCCESS [9.586s]
[INFO] Maven Source Plugin ................................... SUCCESS [9.146s]
[INFO] Maven Stage Plugin .................................... SUCCESS [1.672s]
[INFO] Maven Toolchains Plugin ............................... SUCCESS [2.296s]
[INFO] Maven Verifier Plugin ................................. SUCCESS [2.737s]
[INFO] Maven WAR Plugin ...................................... SUCCESS [19.823s]
[INFO] Maven Plugins Aggregator .............................. SUCCESS [0.021s]
[INFO] ------------------------------------------------------------------------
[INFO] Error for project: Maven Javadoc Plugin (during install)
[INFO] ------------------------------------------------------------------------
[INFO] There are test failures.

Please refer to <http://grid.sonatype.org/ci/job/maven-plugins-UTs/./jdk=1.5,label=ubuntu/ws/trunk/maven-javadoc-plugin/target/surefire-reports>
for the individual test results.
[INFO] ------------------------------------------------------------------------
[INFO] Trace
org.apache.maven.BuildFailureException: There are test failures.

Please refer to <http://grid.sonatype.org/ci/job/maven-plugins-UTs/./jdk=1.5,label=ubuntu/ws/trunk/maven-javadoc-plugin/target/surefire-reports>
for the individual test results.
	at org.apache.maven.lifecycle.DefaultLifecycleExecutor.executeGoals(DefaultLifecycleExecutor.java:715)
	at org.apache.maven.lifecycle.DefaultLifecycleExecutor.executeGoalWithLifecycle(DefaultLifecycleExecutor.java:556)
	at org.apache.maven.lifecycle.DefaultLifecycleExecutor.executeGoal(DefaultLifecycleExecutor.java:535)
	at org.apache.maven.lifecycle.DefaultLifecycleExecutor.executeGoalAndHandleFailures(DefaultLifecycleExecutor.java:387)
	at org.apache.maven.lifecycle.DefaultLifecycleExecutor.executeTaskSegments(DefaultLifecycleExecutor.java:348)
	at org.apache.maven.lifecycle.DefaultLifecycleExecutor.execute(DefaultLifecycleExecutor.java:180)
	at org.apache.maven.DefaultMaven.doExecute(DefaultMaven.java:328)
	at org.apache.maven.DefaultMaven.execute(DefaultMaven.java:138)
	at org.apache.maven.cli.MavenCli.main(MavenCli.java:362)
	at org.apache.maven.cli.compat.CompatibleMain.main(CompatibleMain.java:60)
	at sun.reflect.NativeMethodAccessorImpl.invoke0(Native Method)
	at sun.reflect.NativeMethodAccessorImpl.invoke(NativeMethodAccessorImpl.java:39)
	at sun.reflect.DelegatingMethodAccessorImpl.invoke(DelegatingMethodAccessorImpl.java:25)
	at java.lang.reflect.Method.invoke(Method.java:585)
	at org.codehaus.classworlds.Launcher.launchEnhanced(Launcher.java:315)
	at org.codehaus.classworlds.Launcher.launch(Launcher.java:255)
	at org.codehaus.classworlds.Launcher.mainWithExitCode(Launcher.java:430)
	at org.codehaus.classworlds.Launcher.main(Launcher.java:375)
Caused by: org.apache.maven.plugin.MojoFailureException: There are test failures.

Please refer to <http://grid.sonatype.org/ci/job/maven-plugins-UTs/./jdk=1.5,label=ubuntu/ws/trunk/maven-javadoc-plugin/target/surefire-reports>
for the individual test results.
	at org.apache.maven.plugin.surefire.SurefirePlugin.execute(SurefirePlugin.java:575)
	at org.apache.maven.plugin.DefaultPluginManager.executeMojo(DefaultPluginManager.java:490)
	at org.apache.maven.lifecycle.DefaultLifecycleExecutor.executeGoals(DefaultLifecycleExecutor.java:694)
	... 17 more
[INFO] ------------------------------------------------------------------------
[INFO] BUILD ERRORS
[INFO] ------------------------------------------------------------------------
[INFO] Total time: 17 minutes 24 seconds
[INFO] Finished at: Sat Jul 17 11:30:17 GMT-06:00 2010
[INFO] Final Memory: 96M/148M
[INFO] ------------------------------------------------------------------------


Mime
View raw message