maven-notifications mailing list archives

Site index · List index
Message view « Date » · « Thread »
Top « Date » · « Thread »
From Hudson <Hud...@sonatype.org>
Subject Build failed in Hudson: maven-3.0.x-ITs » 1.5,windows #292
Date Sat, 10 Jul 2010 10:52:48 GMT
See <http://grid.sonatype.org/ci/job/maven-3.0.x-ITs/./jdk=1.5,label=windows/292/changes>

Changes:

[Benjamin Bentmann] [MNG-4721] Create an integration test to check handling of optional plugin
dependencies

------------------------------------------
[...truncated 2046 lines...]
Downloading: http://repository.sonatype.org/content/repositories/maven.snapshots/org/apache/maven/its/plugins/maven-it-plugin-project-interpolation/2.1-SNAPSHOT/maven-it-plugin-project-interpolation-2.1-20100709.155356-760.jar
Downloaded: http://repository.sonatype.org/content/repositories/maven.snapshots/org/apache/maven/its/plugins/maven-it-plugin-project-interpolation/2.1-SNAPSHOT/maven-it-plugin-project-interpolation-2.1-20100709.155356-760.jar
(13 KB at 248.3 KB/sec)
Downloading: http://repository.sonatype.org/content/repositories/maven.snapshots/org/apache/maven/its/plugins/maven-it-plugin-setter/2.1-SNAPSHOT/maven-it-plugin-setter-2.1-20100709.155356-760.jar
Downloaded: http://repository.sonatype.org/content/repositories/maven.snapshots/org/apache/maven/its/plugins/maven-it-plugin-setter/2.1-SNAPSHOT/maven-it-plugin-setter-2.1-20100709.155356-760.jar
(10 KB at 204.8 KB/sec)
Downloading: http://repository.sonatype.org/content/repositories/maven.snapshots/org/apache/maven/its/plugins/maven-it-plugin-singleton-component/2.1-SNAPSHOT/maven-it-plugin-singleton-component-2.1-20100709.155356-128.jar
Downloaded: http://repository.sonatype.org/content/repositories/maven.snapshots/org/apache/maven/its/plugins/maven-it-plugin-singleton-component/2.1-SNAPSHOT/maven-it-plugin-singleton-component-2.1-20100709.155356-128.jar
(12 KB at 167.8 KB/sec)
Downloading: http://repository.sonatype.org/content/repositories/maven.snapshots/org/apache/maven/its/plugins/maven-it-plugin-site/2.1-SNAPSHOT/maven-it-plugin-site-2.1-20100709.155356-631.jar
Downloaded: http://repository.sonatype.org/content/repositories/maven.snapshots/org/apache/maven/its/plugins/maven-it-plugin-site/2.1-SNAPSHOT/maven-it-plugin-site-2.1-20100709.155356-631.jar
(15 KB at 344.2 KB/sec)
Downloading: http://repository.sonatype.org/content/repositories/maven.snapshots/org/apache/maven/its/plugins/maven-it-plugin-touch/2.1-SNAPSHOT/maven-it-plugin-touch-2.1-20100709.155356-758.jar
Downloaded: http://repository.sonatype.org/content/repositories/maven.snapshots/org/apache/maven/its/plugins/maven-it-plugin-touch/2.1-SNAPSHOT/maven-it-plugin-touch-2.1-20100709.155356-758.jar
(12 KB at 289.3 KB/sec)
Downloading: http://repository.sonatype.org/content/repositories/maven.snapshots/org/apache/maven/maven-archiver/2.0/maven-archiver-2.0.jar
Downloading: http://repository.apache.org/snapshots/org/apache/maven/maven-archiver/2.0/maven-archiver-2.0.jar
Downloading: http://repository.sonatype.org/content/repositories/maven.snapshots/org/codehaus/plexus/plexus-archiver/1.0-alpha-3/plexus-archiver-1.0-alpha-3.jar
Downloaded: http://repo1.maven.org/maven2/org/codehaus/plexus/plexus-component-api/1.0-alpha-20/plexus-component-api-1.0-alpha-20.jar
(33 KB at 20.4 KB/sec)
Downloading: http://repository.apache.org/snapshots/org/codehaus/plexus/plexus-archiver/1.0-alpha-3/plexus-archiver-1.0-alpha-3.jar
Downloading: http://repo1.maven.org/maven2/org/apache/maven/maven-archiver/2.0/maven-archiver-2.0.jar
Downloading: http://repository.sonatype.org/content/repositories/maven.snapshots/org/apache/maven/its/plugins/maven-it-plugin-toolchain/2.1-SNAPSHOT/maven-it-plugin-toolchain-2.1-20100709.155356-428.jar
Downloaded: http://repository.sonatype.org/content/repositories/maven.snapshots/org/apache/maven/its/plugins/maven-it-plugin-toolchain/2.1-SNAPSHOT/maven-it-plugin-toolchain-2.1-20100709.155356-428.jar
(15 KB at 263.1 KB/sec)
Downloading: http://repo1.maven.org/maven2/org/codehaus/plexus/plexus-archiver/1.0-alpha-3/plexus-archiver-1.0-alpha-3.jar
Downloading: http://repository.sonatype.org/content/repositories/maven.snapshots/org/apache/maven/its/plugins/maven-it-plugin-uses-properties/2.1-SNAPSHOT/maven-it-plugin-uses-properties-2.1-20100709.155356-757.jar
Downloaded: http://repository.sonatype.org/content/repositories/maven.snapshots/org/apache/maven/its/plugins/maven-it-plugin-uses-properties/2.1-SNAPSHOT/maven-it-plugin-uses-properties-2.1-20100709.155356-757.jar
(10 KB at 182.2 KB/sec)
Downloading: http://repository.sonatype.org/content/repositories/maven.snapshots/org/apache/maven/its/plugins/maven-it-plugin-uses-wagon/2.1-SNAPSHOT/maven-it-plugin-uses-wagon-2.1-20100709.155356-744.jar
Downloaded: http://repository.sonatype.org/content/repositories/maven.snapshots/org/apache/maven/its/plugins/maven-it-plugin-uses-wagon/2.1-SNAPSHOT/maven-it-plugin-uses-wagon-2.1-20100709.155356-744.jar
(19 KB at 275.1 KB/sec)
Downloading: http://repository.sonatype.org/content/repositories/maven.snapshots/org/apache/maven/plugins/maven-clean-plugin/0.1-stub-SNAPSHOT/maven-clean-plugin-0.1-stub-20100709.155356-649.jar
Downloaded: http://repository.sonatype.org/content/repositories/maven.snapshots/org/apache/maven/plugins/maven-clean-plugin/0.1-stub-SNAPSHOT/maven-clean-plugin-0.1-stub-20100709.155356-649.jar
(11 KB at 183.1 KB/sec)
Downloading: http://repository.sonatype.org/content/repositories/maven.snapshots/org/apache/maven/plugins/maven-compiler-plugin/0.1-stub-SNAPSHOT/maven-compiler-plugin-0.1-stub-20100709.155356-649.jar
Downloaded: http://repository.sonatype.org/content/repositories/maven.snapshots/org/apache/maven/plugins/maven-compiler-plugin/0.1-stub-SNAPSHOT/maven-compiler-plugin-0.1-stub-20100709.155356-649.jar
(12 KB at 174.7 KB/sec)
Downloading: http://repository.sonatype.org/content/repositories/maven.snapshots/org/apache/maven/plugins/maven-deploy-plugin/0.1-stub-SNAPSHOT/maven-deploy-plugin-0.1-stub-20100709.155356-648.jar
Downloaded: http://repository.sonatype.org/content/repositories/maven.snapshots/org/apache/maven/plugins/maven-deploy-plugin/0.1-stub-SNAPSHOT/maven-deploy-plugin-0.1-stub-20100709.155356-648.jar
(11 KB at 173.9 KB/sec)
Downloading: http://repository.sonatype.org/content/repositories/maven.snapshots/org/apache/maven/plugins/maven-ear-plugin/0.1-stub-SNAPSHOT/maven-ear-plugin-0.1-stub-20100709.155356-648.jar
Downloaded: http://repository.sonatype.org/content/repositories/maven.snapshots/org/apache/maven/plugins/maven-ear-plugin/0.1-stub-SNAPSHOT/maven-ear-plugin-0.1-stub-20100709.155356-648.jar
(12 KB at 236.5 KB/sec)
Downloaded: http://repo1.maven.org/maven2/org/apache/maven/its/maven-core-it-support/1.0/maven-core-it-support-1.0.jar
(3 KB at 1.1 KB/sec)
[WARNING] *** CHECKSUM FAILED - Checksum failed on download: local = '1be25dbf1d1850754653fbf003b70cf600e9ed28';
remote = '32cea7e195f2f463d645638f12e7f6728e2fde7a' - IGNORING
Downloading: http://repository.sonatype.org/content/repositories/maven.snapshots/org/apache/maven/plugins/maven-ejb-plugin/0.1-stub-SNAPSHOT/maven-ejb-plugin-0.1-stub-20100709.155356-648.jar
Downloaded: http://repo1.maven.org/maven2/org/apache/maven/maven-archiver/2.0/maven-archiver-2.0.jar
(12 KB at 14.2 KB/sec)
Downloading: http://repository.sonatype.org/content/repositories/maven.snapshots/org/apache/maven/plugins/maven-install-plugin/0.1-stub-SNAPSHOT/maven-install-plugin-0.1-stub-20100709.155356-648.jar
Downloaded: http://repository.sonatype.org/content/repositories/maven.snapshots/org/apache/maven/plugins/maven-ejb-plugin/0.1-stub-SNAPSHOT/maven-ejb-plugin-0.1-stub-20100709.155356-648.jar
(11 KB at 159.6 KB/sec)
Downloaded: http://repository.sonatype.org/content/repositories/maven.snapshots/org/apache/maven/plugins/maven-install-plugin/0.1-stub-SNAPSHOT/maven-install-plugin-0.1-stub-20100709.155356-648.jar
(11 KB at 190.4 KB/sec)
Downloading: http://repository.sonatype.org/content/repositories/maven.snapshots/org/apache/maven/plugins/maven-jar-plugin/0.1-stub-SNAPSHOT/maven-jar-plugin-0.1-stub-20100709.155356-656.jar
Downloading: http://repository.sonatype.org/content/repositories/maven.snapshots/org/apache/maven/plugins/maven-javadoc-plugin/0.1-stub-SNAPSHOT/maven-javadoc-plugin-0.1-stub-20100709.155356-648.jar
Downloaded: http://repository.sonatype.org/content/repositories/maven.snapshots/org/apache/maven/plugins/maven-jar-plugin/0.1-stub-SNAPSHOT/maven-jar-plugin-0.1-stub-20100709.155356-656.jar
(11 KB at 173.3 KB/sec)
Downloaded: http://repo1.maven.org/maven2/org/codehaus/plexus/plexus-classworlds/1.2-alpha-7/plexus-classworlds-1.2-alpha-7.jar
(42 KB at 17.9 KB/sec)
Downloaded: http://repository.sonatype.org/content/repositories/maven.snapshots/org/apache/maven/plugins/maven-javadoc-plugin/0.1-stub-SNAPSHOT/maven-javadoc-plugin-0.1-stub-20100709.155356-648.jar
(11 KB at 168.3 KB/sec)
Downloading: http://repository.sonatype.org/content/repositories/maven.snapshots/org/apache/maven/plugins/maven-plugin-plugin/0.1-stub-SNAPSHOT/maven-plugin-plugin-0.1-stub-20100709.155356-648.jar
Downloading: http://repository.sonatype.org/content/repositories/maven.snapshots/org/apache/maven/plugins/maven-rar-plugin/0.1-stub-SNAPSHOT/maven-rar-plugin-0.1-stub-20100709.155356-648.jar
Downloaded: http://repository.sonatype.org/content/repositories/maven.snapshots/org/apache/maven/plugins/maven-plugin-plugin/0.1-stub-SNAPSHOT/maven-plugin-plugin-0.1-stub-20100709.155356-648.jar
(13 KB at 97.2 KB/sec)
Downloading: http://repository.sonatype.org/content/repositories/maven.snapshots/org/apache/maven/plugins/maven-resources-plugin/0.1-stub-SNAPSHOT/maven-resources-plugin-0.1-stub-20100709.155356-648.jar
Downloaded: http://repository.sonatype.org/content/repositories/maven.snapshots/org/apache/maven/plugins/maven-rar-plugin/0.1-stub-SNAPSHOT/maven-rar-plugin-0.1-stub-20100709.155356-648.jar
(11 KB at 99.5 KB/sec)
Downloaded: http://repository.sonatype.org/content/repositories/maven.snapshots/org/apache/maven/plugins/maven-resources-plugin/0.1-stub-SNAPSHOT/maven-resources-plugin-0.1-stub-20100709.155356-648.jar
(12 KB at 135.8 KB/sec)
Downloading: http://repository.sonatype.org/content/repositories/maven.snapshots/org/apache/maven/plugins/maven-site-plugin/0.1-stub-SNAPSHOT/maven-site-plugin-0.1-stub-20100709.155356-647.jar
Downloading: http://repository.sonatype.org/content/repositories/maven.snapshots/org/apache/maven/plugins/maven-source-plugin/0.1-stub-SNAPSHOT/maven-source-plugin-0.1-stub-20100709.155356-648.jar
Downloaded: http://repository.sonatype.org/content/repositories/maven.snapshots/org/apache/maven/plugins/maven-site-plugin/0.1-stub-SNAPSHOT/maven-site-plugin-0.1-stub-20100709.155356-647.jar
(13 KB at 165.0 KB/sec)
Downloaded: http://repository.sonatype.org/content/repositories/maven.snapshots/org/apache/maven/plugins/maven-source-plugin/0.1-stub-SNAPSHOT/maven-source-plugin-0.1-stub-20100709.155356-648.jar
(11 KB at 193.8 KB/sec)
Downloading: http://repository.sonatype.org/content/repositories/maven.snapshots/org/apache/maven/plugins/maven-surefire-plugin/0.1-stub-SNAPSHOT/maven-surefire-plugin-0.1-stub-20100709.155356-656.jar
Downloading: http://repository.sonatype.org/content/repositories/maven.snapshots/org/apache/maven/plugins/maven-war-plugin/0.1-stub-SNAPSHOT/maven-war-plugin-0.1-stub-20100709.155356-647.jar
Downloaded: http://repository.sonatype.org/content/repositories/maven.snapshots/org/apache/maven/plugins/maven-surefire-plugin/0.1-stub-SNAPSHOT/maven-surefire-plugin-0.1-stub-20100709.155356-656.jar
(11 KB at 134.7 KB/sec)
Downloaded: http://repository.sonatype.org/content/repositories/maven.snapshots/org/apache/maven/plugins/maven-war-plugin/0.1-stub-SNAPSHOT/maven-war-plugin-0.1-stub-20100709.155356-647.jar
(11 KB at 170.4 KB/sec)
Downloaded: http://repo1.maven.org/maven2/org/codehaus/plexus/plexus-archiver/1.0-alpha-3/plexus-archiver-1.0-alpha-3.jar
(128 KB at 79.1 KB/sec)
[INFO] ------------------------------------------------------------------------
[INFO] BUILD FAILURE
[INFO] ------------------------------------------------------------------------
[INFO] Total time: 2:21.269s
[INFO] Finished at: Sat Jul 10 03:42:32 PDT 2010
[INFO] Final Memory: 4M/7M
[INFO] ------------------------------------------------------------------------
[ERROR] Failed to execute goal on project maven-it-boostrap: Error transferring file: Server
returned HTTP response code: 500 for URL: http://repository.apache.org/snapshots/org/apache/maven/its/plugins/maven-it-plugin-context-passing/2.1-SNAPSHOT/maven-it-plugin-context-passing-2.1-20100709.155356-762.jar
  org.apache.maven.its.plugins:maven-it-plugin-context-passing:jar:2.1-20100709.155356-762

from the specified remote repositories:
  maven.it (http://repository.sonatype.org/content/repositories/maven.snapshots, releases=true,
snapshots=true),
  apache.snapshots (http://repository.apache.org/snapshots, releases=true, snapshots=true),
  central (http://repo1.maven.org/maven2, releases=true, snapshots=false)
Path to dependency: 
	1) org.apache.maven.its.bootstrap:maven-it-boostrap:pom:1.0
	2) org.apache.maven.its.plugins:maven-it-plugin-context-passing:jar:2.1-SNAPSHOT
-> [Help 1]
org.apache.maven.lifecycle.LifecycleExecutionException: Failed to execute goal on project
maven-it-boostrap: Error transferring file: Server returned HTTP response code: 500 for URL:
http://repository.apache.org/snapshots/org/apache/maven/its/plugins/maven-it-plugin-context-passing/2.1-SNAPSHOT/maven-it-plugin-context-passing-2.1-20100709.155356-762.jar
  org.apache.maven.its.plugins:maven-it-plugin-context-passing:jar:2.1-20100709.155356-762

from the specified remote repositories:
  maven.it (http://repository.sonatype.org/content/repositories/maven.snapshots, releases=true,
snapshots=true),
  apache.snapshots (http://repository.apache.org/snapshots, releases=true, snapshots=true),
  central (http://repo1.maven.org/maven2, releases=true, snapshots=false)
Path to dependency: 
	1) org.apache.maven.its.bootstrap:maven-it-boostrap:pom:1.0
	2) org.apache.maven.its.plugins:maven-it-plugin-context-passing:jar:2.1-SNAPSHOT


	at org.apache.maven.lifecycle.internal.LifecycleDependencyResolver.getProjectDependencies(LifecycleDependencyResolver.java:171)
	at org.apache.maven.lifecycle.internal.LifecycleDependencyResolver.resolveProjectDependencies(LifecycleDependencyResolver.java:125)
	at org.apache.maven.lifecycle.internal.LifecycleDependencyResolver.resolveDependencies(LifecycleDependencyResolver.java:114)
	at org.apache.maven.lifecycle.internal.LifecycleDependencyResolver.resolveDependencies(LifecycleDependencyResolver.java:78)
	at org.apache.maven.lifecycle.internal.BuilderCommon.resolveBuildPlan(BuilderCommon.java:129)
	at org.apache.maven.lifecycle.internal.LifecycleModuleBuilder.buildProject(LifecycleModuleBuilder.java:82)
	at org.apache.maven.lifecycle.internal.LifecycleModuleBuilder.buildProject(LifecycleModuleBuilder.java:58)
	at org.apache.maven.lifecycle.internal.LifecycleStarter.singleThreadedBuild(LifecycleStarter.java:183)
	at org.apache.maven.lifecycle.internal.LifecycleStarter.execute(LifecycleStarter.java:161)
	at org.apache.maven.DefaultMaven.doExecute(DefaultMaven.java:252)
	at org.apache.maven.DefaultMaven.execute(DefaultMaven.java:100)
	at org.apache.maven.cli.MavenCli.execute(MavenCli.java:443)
	at org.apache.maven.cli.MavenCli.doMain(MavenCli.java:166)
	at org.apache.maven.cli.MavenCli.doMain(MavenCli.java:148)
	at sun.reflect.NativeMethodAccessorImpl.invoke0(Native Method)
	at sun.reflect.NativeMethodAccessorImpl.invoke(NativeMethodAccessorImpl.java:39)
	at sun.reflect.DelegatingMethodAccessorImpl.invoke(DelegatingMethodAccessorImpl.java:25)
	at java.lang.reflect.Method.invoke(Method.java:585)
	at org.apache.maven.it.Embedded3xLauncher.run(Embedded3xLauncher.java:176)
	at org.apache.maven.it.Verifier.executeGoals(Verifier.java:1326)
	at org.apache.maven.it.Verifier.executeGoal(Verifier.java:1191)
	at org.apache.maven.it.Verifier.executeGoal(Verifier.java:1185)
	at org.apache.maven.it.MavenITBootstrapTest.testBootstrap(MavenITBootstrapTest.java:52)
Caused by: org.apache.maven.artifact.resolver.ArtifactResolutionException: Error transferring
file: Server returned HTTP response code: 500 for URL: http://repository.apache.org/snapshots/org/apache/maven/its/plugins/maven-it-plugin-context-passing/2.1-SNAPSHOT/maven-it-plugin-context-passing-2.1-20100709.155356-762.jar
  org.apache.maven.its.plugins:maven-it-plugin-context-passing:jar:2.1-20100709.155356-762

from the specified remote repositories:
  maven.it (http://repository.sonatype.org/content/repositories/maven.snapshots, releases=true,
snapshots=true),
  apache.snapshots (http://repository.apache.org/snapshots, releases=true, snapshots=true),
  central (http://repo1.maven.org/maven2, releases=true, snapshots=false)
Path to dependency: 
	1) org.apache.maven.its.bootstrap:maven-it-boostrap:pom:1.0
	2) org.apache.maven.its.plugins:maven-it-plugin-context-passing:jar:2.1-SNAPSHOT


	at org.apache.maven.artifact.resolver.DefaultArtifactResolver.resolve(DefaultArtifactResolver.java:277)
	at org.apache.maven.artifact.resolver.DefaultArtifactResolver.access$000(DefaultArtifactResolver.java:77)
	at org.apache.maven.artifact.resolver.DefaultArtifactResolver$ResolveTask.run(DefaultArtifactResolver.java:723)
	at java.util.concurrent.ThreadPoolExecutor$Worker.runTask(ThreadPoolExecutor.java:650)
	at java.util.concurrent.ThreadPoolExecutor$Worker.run(ThreadPoolExecutor.java:675)
	at java.lang.Thread.run(Thread.java:595)
Caused by: org.apache.maven.wagon.TransferFailedException: Error transferring file: Server
returned HTTP response code: 500 for URL: http://repository.apache.org/snapshots/org/apache/maven/its/plugins/maven-it-plugin-context-passing/2.1-SNAPSHOT/maven-it-plugin-context-passing-2.1-20100709.155356-762.jar
	at org.apache.maven.wagon.providers.http.LightweightHttpWagon.fillInputData(LightweightHttpWagon.java:143)
	at org.apache.maven.wagon.StreamWagon.getInputStream(StreamWagon.java:116)
	at org.apache.maven.wagon.StreamWagon.getIfNewer(StreamWagon.java:88)
	at org.apache.maven.wagon.StreamWagon.get(StreamWagon.java:61)
	at org.apache.maven.repository.legacy.DefaultWagonManager.getRemoteFile(DefaultWagonManager.java:351)
	at org.apache.maven.repository.legacy.DefaultWagonManager.getArtifact(DefaultWagonManager.java:100)
	at org.apache.maven.artifact.resolver.DefaultArtifactResolver.resolve(DefaultArtifactResolver.java:254)
	... 5 more
Caused by: java.io.IOException: Server returned HTTP response code: 500 for URL: http://repository.apache.org/snapshots/org/apache/maven/its/plugins/maven-it-plugin-context-passing/2.1-SNAPSHOT/maven-it-plugin-context-passing-2.1-20100709.155356-762.jar
	at sun.reflect.NativeConstructorAccessorImpl.newInstance0(Native Method)
	at sun.reflect.NativeConstructorAccessorImpl.newInstance(NativeConstructorAccessorImpl.java:39)
	at sun.reflect.DelegatingConstructorAccessorImpl.newInstance(DelegatingConstructorAccessorImpl.java:27)
	at java.lang.reflect.Constructor.newInstance(Constructor.java:494)
	at sun.net.www.protocol.http.HttpURLConnection$6.run(HttpURLConnection.java:1225)
	at java.security.AccessController.doPrivileged(Native Method)
	at sun.net.www.protocol.http.HttpURLConnection.getChainedException(HttpURLConnection.java:1219)
	at sun.net.www.protocol.http.HttpURLConnection.getInputStream(HttpURLConnection.java:906)
	at org.apache.maven.wagon.providers.http.LightweightHttpWagon.fillInputData(LightweightHttpWagon.java:122)
	... 11 more
Caused by: java.io.IOException: Server returned HTTP response code: 500 for URL: http://repository.apache.org/snapshots/org/apache/maven/its/plugins/maven-it-plugin-context-passing/2.1-SNAPSHOT/maven-it-plugin-context-passing-2.1-20100709.155356-762.jar
	at sun.net.www.protocol.http.HttpURLConnection.getInputStream(HttpURLConnection.java:1170)
	at java.net.HttpURLConnection.getResponseCode(HttpURLConnection.java:367)
	at org.apache.maven.wagon.providers.http.LightweightHttpWagon.fillInputData(LightweightHttpWagon.java:115)
	... 11 more
[ERROR] 
[ERROR] Re-run Maven using the -X switch to enable full debug logging.
[ERROR] 
[ERROR] For more information about the errors and possible solutions, please read the following
articles:
[ERROR] [Help 1] http://cwiki.apache.org/confluence/display/MAVEN/ArtifactResolutionException

	at org.apache.maven.it.Verifier.executeGoals(Verifier.java:1348)
	at org.apache.maven.it.Verifier.executeGoal(Verifier.java:1191)
	at org.apache.maven.it.Verifier.executeGoal(Verifier.java:1185)
	at org.apache.maven.it.MavenITBootstrapTest.testBootstrap(MavenITBootstrapTest.java:52)
	at sun.reflect.NativeMethodAccessorImpl.invoke0(Native Method)
	at sun.reflect.NativeMethodAccessorImpl.invoke(NativeMethodAccessorImpl.java:39)
	at sun.reflect.DelegatingMethodAccessorImpl.invoke(DelegatingMethodAccessorImpl.java:25)
	at java.lang.reflect.Method.invoke(Method.java:585)
	at junit.framework.TestCase.runTest(TestCase.java:164)
	at org.apache.maven.it.AbstractMavenIntegrationTestCase.runTest(AbstractMavenIntegrationTestCase.java:198)
	at junit.framework.TestCase.runBare(TestCase.java:130)
	at junit.framework.TestResult$1.protect(TestResult.java:106)
	at junit.framework.TestResult.runProtected(TestResult.java:124)
	at junit.framework.TestResult.run(TestResult.java:109)
	at junit.framework.TestCase.run(TestCase.java:120)
	at junit.framework.TestSuite.runTest(TestSuite.java:230)
	at junit.framework.TestSuite.run(TestSuite.java:225)
	at junit.framework.TestSuite.runTest(TestSuite.java:230)
	at junit.framework.TestSuite.run(TestSuite.java:225)
	at sun.reflect.NativeMethodAccessorImpl.invoke0(Native Method)
	at sun.reflect.NativeMethodAccessorImpl.invoke(NativeMethodAccessorImpl.java:39)
	at sun.reflect.DelegatingMethodAccessorImpl.invoke(DelegatingMethodAccessorImpl.java:25)
	at java.lang.reflect.Method.invoke(Method.java:585)
	at org.apache.maven.surefire.junit.JUnitTestSet.execute(JUnitTestSet.java:213)
	at org.apache.maven.surefire.suite.AbstractDirectoryTestSuite.executeTestSet(AbstractDirectoryTestSuite.java:140)
	at org.apache.maven.surefire.suite.AbstractDirectoryTestSuite.execute(AbstractDirectoryTestSuite.java:127)
	at org.apache.maven.surefire.Surefire.run(Surefire.java:177)
	at sun.reflect.NativeMethodAccessorImpl.invoke0(Native Method)
	at sun.reflect.NativeMethodAccessorImpl.invoke(NativeMethodAccessorImpl.java:39)
	at sun.reflect.DelegatingMethodAccessorImpl.invoke(DelegatingMethodAccessorImpl.java:25)
	at java.lang.reflect.Method.invoke(Method.java:585)
	at org.apache.maven.surefire.booter.SurefireBooter.runSuitesInProcess(SurefireBooter.java:345)
	at org.apache.maven.surefire.booter.SurefireBooter.main(SurefireBooter.java:1009)


Results :

Tests in error: 
  testBootstrap(org.apache.maven.it.MavenITBootstrapTest)

Tests run: 607, Failures: 0, Errors: 1, Skipped: 0

[INFO] ------------------------------------------------------------------------
[INFO] BUILD FAILURE
[INFO] ------------------------------------------------------------------------
[INFO] Total time: 16:39.798s
[INFO] Finished at: Sat Jul 10 03:52:47 PDT 2010
[INFO] Final Memory: 7M/31M
[INFO] ------------------------------------------------------------------------
[ERROR] Failed to execute goal org.apache.maven.plugins:maven-surefire-plugin:2.4.3:test (default-test)
on project core-it-suite: There are test failures.

Please refer to C:\home\hudson\workspace\maven-3.0.x-ITs\jdk\1.5\label\windows\core-integration-tests\target\surefire-reports
for the individual test results.
-> [Help 1]
org.apache.maven.lifecycle.LifecycleExecutionException: Failed to execute goal org.apache.maven.plugins:maven-surefire-plugin:2.4.3:test
(default-test) on project core-it-suite: There are test failures.

Please refer to C:\home\hudson\workspace\maven-3.0.x-ITs\jdk\1.5\label\windows\core-integration-tests\target\surefire-reports
for the individual test results.
	at org.apache.maven.lifecycle.internal.MojoExecutor.execute(MojoExecutor.java:148)
	at org.apache.maven.lifecycle.internal.MojoExecutor.execute(MojoExecutor.java:87)
	at org.apache.maven.lifecycle.internal.MojoExecutor.execute(MojoExecutor.java:79)
	at org.apache.maven.lifecycle.internal.LifecycleModuleBuilder.buildProject(LifecycleModuleBuilder.java:86)
	at org.apache.maven.lifecycle.internal.LifecycleModuleBuilder.buildProject(LifecycleModuleBuilder.java:58)
	at org.apache.maven.lifecycle.internal.LifecycleStarter.singleThreadedBuild(LifecycleStarter.java:183)
	at org.apache.maven.lifecycle.internal.LifecycleStarter.execute(LifecycleStarter.java:161)
	at org.apache.maven.DefaultMaven.doExecute(DefaultMaven.java:252)
	at org.apache.maven.DefaultMaven.execute(DefaultMaven.java:100)
	at org.apache.maven.cli.MavenCli.execute(MavenCli.java:443)
	at org.apache.maven.cli.MavenCli.doMain(MavenCli.java:166)
	at org.apache.maven.cli.MavenCli.main(MavenCli.java:130)
	at sun.reflect.NativeMethodAccessorImpl.invoke0(Native Method)
	at sun.reflect.NativeMethodAccessorImpl.invoke(NativeMethodAccessorImpl.java:39)
	at sun.reflect.DelegatingMethodAccessorImpl.invoke(DelegatingMethodAccessorImpl.java:25)
	at java.lang.reflect.Method.invoke(Method.java:585)
	at org.codehaus.plexus.classworlds.launcher.Launcher.launchEnhanced(Launcher.java:290)
	at org.codehaus.plexus.classworlds.launcher.Launcher.launch(Launcher.java:230)
	at org.codehaus.plexus.classworlds.launcher.Launcher.mainWithExitCode(Launcher.java:409)
	at org.codehaus.plexus.classworlds.launcher.Launcher.main(Launcher.java:352)
Caused by: org.apache.maven.plugin.MojoFailureException: There are test failures.

Please refer to C:\home\hudson\workspace\maven-3.0.x-ITs\jdk\1.5\label\windows\core-integration-tests\target\surefire-reports
for the individual test results.
	at org.apache.maven.plugin.surefire.SurefirePlugin.execute(SurefirePlugin.java:575)
	at org.apache.maven.plugin.DefaultBuildPluginManager.executeMojo(DefaultBuildPluginManager.java:110)
	at org.apache.maven.lifecycle.internal.MojoExecutor.execute(MojoExecutor.java:144)
	... 19 more
[ERROR] 
[ERROR] Re-run Maven using the -X switch to enable full debug logging.
[ERROR] 
[ERROR] For more information about the errors and possible solutions, please read the following
articles:
[ERROR] [Help 1] http://cwiki.apache.org/confluence/display/MAVEN/MojoFailureException
Emma: looking for coverage reports in the provided path: core-integration-tests/target/site/emma/coverage.xml


Mime
View raw message