maven-notifications mailing list archives

Site index · List index
Message view « Date » · « Thread »
Top « Date » · « Thread »
From Hudson <Hud...@sonatype.org>
Subject Build failed in Hudson: maven-ant-tasks » 1.5,windows #87
Date Mon, 19 Jul 2010 21:55:05 GMT
See <http://grid.sonatype.org/ci/job/maven-ant-tasks/./jdk=1.5,label=windows/87/changes>

Changes:

[Hervé Boutemy] [maven-release-plugin] prepare for next development iteration

[Hervé Boutemy] [maven-release-plugin] prepare release maven-ant-tasks-2.1.1

[Hervé Boutemy] prepared release notes for Maven Ant Tasks 2.1.1

[Hervé Boutemy] [MANTTASKS-185] fixed NPE when caching dependency information and versionsId
attribute is not set
Submitted by: Frank Wilson

[Hervé Boutemy] [MANTTASKS-188] fixed dependencyRefsBuildFile attribute with absolute path

[Hervé Boutemy] [MANTTASKS-195] fixed remote repository overriding

------------------------------------------
[...truncated 879 lines...]
     [echo] Current profile = myprofile2
     [echo] Current profile = noprofile

test-pom-with-parent:
[artifact:pom] Downloading: it/ant-tasks/pom/1.0/pom-1.0.pom from repository central at http://Nexus
[artifact:pom] Unable to locate resource in repository
[artifact:pom] [INFO] Unable to find resource 'it.ant-tasks:pom:pom:1.0' in repository central
(http://Nexus)
[artifact:pom] Downloading: it/ant-tasks/pom/1.0/pom-1.0.pom from repository test.repo at
file://C:\home\hudson\workspace\maven-ant-tasks\jdk\1.5\label\windows\trunk/src/test/repo
[artifact:pom] Transferring 1K from test.repo
     [echo] Checking for existence of file: C:\home\hudson\workspace\maven-ant-tasks\jdk\1.5\label\windows\trunk/target/tmp/it/ant-tasks/pom/1.0/pom-1.0.pom
     [echo] Artifact ID = project-with-parent-pom
     [echo] Parent Artifact ID = pom
   [delete] Deleting directory C:\home\hudson\workspace\maven-ant-tasks\jdk\1.5\label\windows\trunk\target\tmp
[artifact:pom] Downloading: it/ant-tasks/pom/1.1/pom-1.1.pom from repository central at http://Nexus
[artifact:pom] Unable to locate resource in repository
[artifact:pom] [INFO] Unable to find resource 'it.ant-tasks:pom:pom:1.1' in repository central
(http://Nexus)
[artifact:pom] Downloading: it/ant-tasks/pom/1.1/pom-1.1.pom from repository test.repo at
file:./src/test/repo
[artifact:pom] Transferring 1K from test.repo
[artifact:pom] [WARNING] *** CHECKSUM FAILED - Checksum failed on download: local = '963a4625baccc1987e25d81c41c5c1b1d6692bb2';
remote = '401796bed6bc9796aade7e68abd365f552695221' - RETRYING
[artifact:pom] Downloading: it/ant-tasks/pom/1.1/pom-1.1.pom from repository test.repo at
file:./src/test/repo
[artifact:pom] Transferring 1K from test.repo
[artifact:pom] [WARNING] *** CHECKSUM FAILED - Checksum failed on download: local = '963a4625baccc1987e25d81c41c5c1b1d6692bb2';
remote = '401796bed6bc9796aade7e68abd365f552695221' - IGNORING
     [echo] Checking for existence of file: C:\home\hudson\workspace\maven-ant-tasks\jdk\1.5\label\windows\trunk/target/tmp/it/ant-tasks/pom/1.1/pom-1.1.pom

test-no-deps:
[artifact:dependencies] There were no dependencies specified

test-pom-deps:
[artifact:dependencies] Downloading: org/apache/ant/ant/1.8.0/ant-1.8.0.pom from repository
Nexus at http://repository.sonatype.org:8081/content/groups/sonatype-public-grid
[artifact:dependencies] Transferring 9K from Nexus
[artifact:dependencies] Downloading: org/apache/ant/ant-parent/1.8.0/ant-parent-1.8.0.pom
from repository Nexus at http://repository.sonatype.org:8081/content/groups/sonatype-public-grid
[artifact:dependencies] Transferring 4K from Nexus
[artifact:dependencies] Downloading: org/apache/ant/ant-launcher/1.8.0/ant-launcher-1.8.0.pom
from repository Nexus at http://repository.sonatype.org:8081/content/groups/sonatype-public-grid
[artifact:dependencies] Transferring 2K from Nexus
[artifact:dependencies] Downloading: org/codehaus/plexus/plexus-interpolation/1.11/plexus-interpolation-1.11.pom
from repository Nexus at http://repository.sonatype.org:8081/content/groups/sonatype-public-grid
[artifact:dependencies] Transferring 1K from Nexus
[artifact:dependencies] Downloading: org/apache/maven/maven-artifact/2.2.1/maven-artifact-2.2.1.pom
from repository Nexus at http://repository.sonatype.org:8081/content/groups/sonatype-public-grid
[artifact:dependencies] Transferring 2K from Nexus
[artifact:dependencies] Downloading: org/apache/maven/maven/2.2.1/maven-2.2.1.pom from repository
Nexus at http://repository.sonatype.org:8081/content/groups/sonatype-public-grid
[artifact:dependencies] Transferring 22K from Nexus
[artifact:dependencies] Downloading: org/apache/maven/maven-artifact-manager/2.2.1/maven-artifact-manager-2.2.1.pom
from repository Nexus at http://repository.sonatype.org:8081/content/groups/sonatype-public-grid
[artifact:dependencies] Transferring 3K from Nexus
[artifact:dependencies] Downloading: org/apache/maven/maven-repository-metadata/2.2.1/maven-repository-metadata-2.2.1.pom
from repository Nexus at http://repository.sonatype.org:8081/content/groups/sonatype-public-grid
[artifact:dependencies] Transferring 2K from Nexus
[artifact:dependencies] Downloading: org/apache/maven/wagon/wagon-provider-api/1.0-beta-6/wagon-provider-api-1.0-beta-6.pom
from repository Nexus at http://repository.sonatype.org:8081/content/groups/sonatype-public-grid
[artifact:dependencies] Transferring 2K from Nexus
[artifact:dependencies] Downloading: org/apache/maven/wagon/wagon/1.0-beta-6/wagon-1.0-beta-6.pom
from repository Nexus at http://repository.sonatype.org:8081/content/groups/sonatype-public-grid
[artifact:dependencies] Transferring 12K from Nexus
[artifact:dependencies] Downloading: backport-util-concurrent/backport-util-concurrent/3.1/backport-util-concurrent-3.1.pom
from repository Nexus at http://repository.sonatype.org:8081/content/groups/sonatype-public-grid
[artifact:dependencies] Transferring 1K from Nexus
[artifact:dependencies] Downloading: org/apache/maven/maven-model/2.2.1/maven-model-2.2.1.pom
from repository Nexus at http://repository.sonatype.org:8081/content/groups/sonatype-public-grid
[artifact:dependencies] Transferring 3K from Nexus
[artifact:dependencies] Downloading: org/apache/maven/maven-project/2.2.1/maven-project-2.2.1.pom
from repository Nexus at http://repository.sonatype.org:8081/content/groups/sonatype-public-grid
[artifact:dependencies] Transferring 3K from Nexus
[artifact:dependencies] Downloading: org/apache/maven/maven-settings/2.2.1/maven-settings-2.2.1.pom
from repository Nexus at http://repository.sonatype.org:8081/content/groups/sonatype-public-grid
[artifact:dependencies] Transferring 2K from Nexus
[artifact:dependencies] Downloading: org/apache/maven/maven-profile/2.2.1/maven-profile-2.2.1.pom
from repository Nexus at http://repository.sonatype.org:8081/content/groups/sonatype-public-grid
[artifact:dependencies] Transferring 2K from Nexus
[artifact:dependencies] Downloading: org/apache/maven/maven-plugin-registry/2.2.1/maven-plugin-registry-2.2.1.pom
from repository Nexus at http://repository.sonatype.org:8081/content/groups/sonatype-public-grid
[artifact:dependencies] Transferring 2K from Nexus
[artifact:dependencies] Downloading: org/apache/maven/maven-error-diagnostics/2.2.1/maven-error-diagnostics-2.2.1.pom
from repository Nexus at http://repository.sonatype.org:8081/content/groups/sonatype-public-grid
[artifact:dependencies] Transferring 2K from Nexus
[artifact:dependencies] Downloading: org/apache/maven/wagon/wagon-file/1.0-beta-6/wagon-file-1.0-beta-6.pom
from repository Nexus at http://repository.sonatype.org:8081/content/groups/sonatype-public-grid
[artifact:dependencies] Transferring 1K from Nexus
[artifact:dependencies] Downloading: org/apache/maven/wagon/wagon-providers/1.0-beta-6/wagon-providers-1.0-beta-6.pom
from repository Nexus at http://repository.sonatype.org:8081/content/groups/sonatype-public-grid
[artifact:dependencies] Transferring 2K from Nexus
[artifact:dependencies] Downloading: org/apache/maven/wagon/wagon-http-lightweight/1.0-beta-6/wagon-http-lightweight-1.0-beta-6.pom
from repository Nexus at http://repository.sonatype.org:8081/content/groups/sonatype-public-grid
[artifact:dependencies] Transferring 2K from Nexus
[artifact:dependencies] Downloading: org/apache/maven/wagon/wagon-http-shared/1.0-beta-6/wagon-http-shared-1.0-beta-6.pom
from repository Nexus at http://repository.sonatype.org:8081/content/groups/sonatype-public-grid
[artifact:dependencies] Transferring 2K from Nexus
[artifact:dependencies] Downloading: org/apache/ant/ant/1.8.0/ant-1.8.0.jar from repository
Nexus at http://repository.sonatype.org:8081/content/groups/sonatype-public-grid
[artifact:dependencies] Downloading: backport-util-concurrent/backport-util-concurrent/3.1/backport-util-concurrent-3.1.jar
from repository Nexus at http://repository.sonatype.org:8081/content/groups/sonatype-public-grid
[artifact:dependencies] Downloading: org/apache/maven/wagon/wagon-provider-api/1.0-beta-6/wagon-provider-api-1.0-beta-6.jar
from repository Nexus at http://repository.sonatype.org:8081/content/groups/sonatype-public-grid
[artifact:dependencies] Downloading: org/codehaus/plexus/plexus-interpolation/1.11/plexus-interpolation-1.11.jar
from repository Nexus at http://repository.sonatype.org:8081/content/groups/sonatype-public-grid
[artifact:dependencies] Downloading: org/apache/maven/maven-artifact/2.2.1/maven-artifact-2.2.1.jar
from repository Nexus at http://repository.sonatype.org:8081/content/groups/sonatype-public-grid
[artifact:dependencies] Transferring 324K from Nexus
[artifact:dependencies] Transferring 50K from Nexus
[artifact:dependencies] Transferring 78K from Nexus
[artifact:dependencies] Transferring 1471K from Nexus
[artifact:dependencies] Transferring 52K from Nexus
[artifact:dependencies] Downloading: org/apache/maven/maven-artifact-manager/2.2.1/maven-artifact-manager-2.2.1.jar
from repository Nexus at http://repository.sonatype.org:8081/content/groups/sonatype-public-grid
[artifact:dependencies] Transferring 66K from Nexus
[artifact:dependencies] Downloading: org/apache/maven/wagon/wagon-file/1.0-beta-6/wagon-file-1.0-beta-6.jar
from repository Nexus at http://repository.sonatype.org:8081/content/groups/sonatype-public-grid
[artifact:dependencies] Downloading: org/apache/ant/ant-launcher/1.8.0/ant-launcher-1.8.0.jar
from repository Nexus at http://repository.sonatype.org:8081/content/groups/sonatype-public-grid
[artifact:dependencies] Downloading: org/apache/maven/maven-repository-metadata/2.2.1/maven-repository-metadata-2.2.1.jar
from repository Nexus at http://repository.sonatype.org:8081/content/groups/sonatype-public-grid
[artifact:dependencies] Transferring 11K from Nexus
[artifact:dependencies] Transferring 12K from Nexus
[artifact:dependencies] Transferring 25K from Nexus
[artifact:dependencies] Downloading: org/apache/maven/wagon/wagon-http-lightweight/1.0-beta-6/wagon-http-lightweight-1.0-beta-6.jar
from repository Nexus at http://repository.sonatype.org:8081/content/groups/sonatype-public-grid
[artifact:dependencies] Transferring 14K from Nexus
[artifact:dependencies] Downloading: org/apache/maven/maven-model/2.2.1/maven-model-2.2.1.jar
from repository Nexus at http://repository.sonatype.org:8081/content/groups/sonatype-public-grid
[artifact:dependencies] Transferring 86K from Nexus
[artifact:dependencies] Downloading: org/apache/maven/wagon/wagon-http-shared/1.0-beta-6/wagon-http-shared-1.0-beta-6.jar
from repository Nexus at http://repository.sonatype.org:8081/content/groups/sonatype-public-grid
[artifact:dependencies] Transferring 25K from Nexus
[artifact:dependencies] Downloading: org/apache/maven/maven-project/2.2.1/maven-project-2.2.1.jar
from repository Nexus at http://repository.sonatype.org:8081/content/groups/sonatype-public-grid
[artifact:dependencies] Transferring 153K from Nexus
[artifact:dependencies] Downloading: org/apache/maven/maven-settings/2.2.1/maven-settings-2.2.1.jar
from repository Nexus at http://repository.sonatype.org:8081/content/groups/sonatype-public-grid
[artifact:dependencies] Transferring 48K from Nexus
[artifact:dependencies] Downloading: org/apache/maven/maven-profile/2.2.1/maven-profile-2.2.1.jar
from repository Nexus at http://repository.sonatype.org:8081/content/groups/sonatype-public-grid
[artifact:dependencies] Transferring 35K from Nexus
[artifact:dependencies] Downloading: org/apache/maven/maven-plugin-registry/2.2.1/maven-plugin-registry-2.2.1.jar
from repository Nexus at http://repository.sonatype.org:8081/content/groups/sonatype-public-grid
[artifact:dependencies] Transferring 29K from Nexus
[artifact:dependencies] Downloading: org/apache/maven/maven-error-diagnostics/2.2.1/maven-error-diagnostics-2.2.1.jar
from repository Nexus at http://repository.sonatype.org:8081/content/groups/sonatype-public-grid
[artifact:dependencies] Transferring 13K from Nexus
     [copy] Copying 23 files to C:\home\hudson\workspace\maven-ant-tasks\jdk\1.5\label\windows\trunk\target\maven-ant-tasks-dependencies
     [echo] dependencies versions: 1.0-beta-6;1.9.6.2;1.11;3.1;1.1-alpha-2;1.5.15;1.8.0;1.0-alpha-9-stable-1;2.2.1
     [copy] Copying 22 files to C:\home\hudson\workspace\maven-ant-tasks\jdk\1.5\label\windows\trunk\target\maven-ant-tasks-compile-dependencies\fileset
     [copy] Copying 22 files to C:\home\hudson\workspace\maven-ant-tasks\jdk\1.5\label\windows\trunk\target\maven-ant-tasks-compile-dependencies\versionMapper
     [copy] Copying 22 files to C:\home\hudson\workspace\maven-ant-tasks\jdk\1.5\label\windows\trunk\target\maven-ant-tasks-compile-dependencies\versionMapperFlatten
     [copy] Copying 22 files to C:\home\hudson\workspace\maven-ant-tasks\jdk\1.5\label\windows\trunk\target\maven-ant-tasks-compile-dependencies\WEB-INF\lib

test-deps-two-repos:
   [delete] Deleting directory C:\home\hudson\workspace\maven-ant-tasks\jdk\1.5\label\windows\trunk\target\tmp
Option "verbose" is deprecated.  Please use the standard Ant -v option.
[artifact:dependencies] Each remote repository must specify a unique id. For backward-compatibility,
a default id will be used. In future releases, a missing repository id will raise an error.
[artifact:dependencies] Each remote repository must specify a unique id. For backward-compatibility,
a default id will be used. In future releases, a missing repository id will raise an error.
[artifact:dependencies] [INFO] snapshot it.ant-tasks:snapshotUniqueFalse:2.0.7-SNAPSHOT: checking
for updates from 16a780cc0eaad51d30546777e7f40fac
[artifact:dependencies] [WARNING] *** CHECKSUM FAILED - Checksum failed on download: local
= '68dc0013255155fa844da7bea87834521bff5a95'; remote = '11c3918c1a10cbbf0e10537fc1fe250cb4051674'
- RETRYING
[artifact:dependencies] [WARNING] *** CHECKSUM FAILED - Checksum failed on download: local
= '68dc0013255155fa844da7bea87834521bff5a95'; remote = '11c3918c1a10cbbf0e10537fc1fe250cb4051674'
- IGNORING
[artifact:dependencies] [INFO] snapshot it.ant-tasks:snapshotUniqueFalse:2.0.7-SNAPSHOT: checking
for updates from -26fa215faac07924bf8ad22241cac6e1
[artifact:dependencies] [INFO] snapshot it.ant-tasks:snapshotUniqueFalse:2.0.7-SNAPSHOT: checking
for updates from Nexus
[artifact:dependencies] Downloading: it/ant-tasks/snapshotUniqueFalse/2.0.7-SNAPSHOT/snapshotUniqueFalse-2.0.7-SNAPSHOT.pom
from repository 16a780cc0eaad51d30546777e7f40fac at file://C:\home\hudson\workspace\maven-ant-tasks\jdk\1.5\label\windows\trunk/src/test/repo
[artifact:dependencies] Transferring 1K from 16a780cc0eaad51d30546777e7f40fac
[artifact:dependencies] Downloading: it/ant-tasks/snapshotUniqueFalse/2.0.7-SNAPSHOT/snapshotUniqueFalse-2.0.7-SNAPSHOT.jar
from repository 16a780cc0eaad51d30546777e7f40fac at file://C:\home\hudson\workspace\maven-ant-tasks\jdk\1.5\label\windows\trunk/src/test/repo
[artifact:dependencies] Transferring 2K from 16a780cc0eaad51d30546777e7f40fac

test-deps:
Option "verbose" is deprecated.  Please use the standard Ant -v option.
[artifact:dependencies] Downloading: org/apache/maven/wagon/wagon-provider-test/1.0-alpha-4/wagon-provider-test-1.0-alpha-4.pom
from repository Nexus at http://repository.sonatype.org:8081/content/groups/sonatype-public-grid
[artifact:dependencies] Transferring 1K from Nexus
[artifact:dependencies] Downloading: org/apache/maven/wagon/wagon/1.0-alpha-4/wagon-1.0-alpha-4.pom
from repository Nexus at http://repository.sonatype.org:8081/content/groups/sonatype-public-grid
[artifact:dependencies] Transferring 3K from Nexus
[artifact:dependencies] Downloading: org/apache/maven/wagon/wagon-provider-api/1.0-alpha-4/wagon-provider-api-1.0-alpha-4.pom
from repository Nexus at http://repository.sonatype.org:8081/content/groups/sonatype-public-grid
[artifact:dependencies] Transferring 0K from Nexus
[artifact:dependencies] Downloading: plexus/plexus-container-default/1.0-alpha-3/plexus-container-default-1.0-alpha-3.pom
from repository Nexus at http://repository.sonatype.org:8081/content/groups/sonatype-public-grid
[artifact:dependencies] Transferring 1K from Nexus
[artifact:dependencies] Downloading: plexus/plexus-containers/1.0-alpha-3/plexus-containers-1.0-alpha-3.pom
from repository Nexus at http://repository.sonatype.org:8081/content/groups/sonatype-public-grid
[artifact:dependencies] Transferring 0K from Nexus
[artifact:dependencies] Downloading: plexus/plexus-root/1.0/plexus-root-1.0.pom from repository
Nexus at http://repository.sonatype.org:8081/content/groups/sonatype-public-grid
[artifact:dependencies] Transferring 5K from Nexus
[artifact:dependencies] Downloading: classworlds/classworlds/1.1-alpha-1/classworlds-1.1-alpha-1.pom
from repository Nexus at http://repository.sonatype.org:8081/content/groups/sonatype-public-grid
[artifact:dependencies] Transferring 3K from Nexus
[artifact:dependencies] Downloading: org/apache/maven/maven-core-it-support-old-location/1.1/maven-core-it-support-old-location-1.1.pom
from repository Nexus at http://repository.sonatype.org:8081/content/groups/sonatype-public-grid
[artifact:dependencies] Transferring 1K from Nexus
[artifact:dependencies] [WARNING] While downloading org.apache.maven:maven-core-it-support-old-location:1.1
[artifact:dependencies]   This artifact has been relocated to org.apache.maven:maven-core-it-support:1.1.
[artifact:dependencies]   Testing
[artifact:dependencies] 
[artifact:dependencies] 
[artifact:dependencies] Downloading: org/apache/maven/maven-core-it-support/1.1/maven-core-it-support-1.1.pom
from repository Nexus at http://repository.sonatype.org:8081/content/groups/sonatype-public-grid
[artifact:dependencies] Transferring 0K from Nexus
[artifact:dependencies] [INFO] snapshot it.ant-tasks:snapshotUniqueTrue:2.0.7-SNAPSHOT: checking
for updates from Nexus
[artifact:dependencies] [INFO] snapshot it.ant-tasks:snapshotUniqueTrue:2.0.7-SNAPSHOT: checking
for updates from test.repo
[artifact:dependencies] [WARNING] *** CHECKSUM FAILED - Checksum failed on download: local
= '9dabee4104005d750615721eefc8a629d688dcd1'; remote = 'e91515c9ce29ab01b52587a787e4fa44496e8c6f'
- RETRYING
[artifact:dependencies] [WARNING] *** CHECKSUM FAILED - Checksum failed on download: local
= '9dabee4104005d750615721eefc8a629d688dcd1'; remote = 'e91515c9ce29ab01b52587a787e4fa44496e8c6f'
- IGNORING
[artifact:dependencies] Downloading: it/ant-tasks/snapshotUniqueTrue/2.0.7-SNAPSHOT/snapshotUniqueTrue-2.0.7-20070610.180356-1.pom
from repository test.repo at file://C:\home\hudson\workspace\maven-ant-tasks\jdk\1.5\label\windows\trunk/src/test/repo
[artifact:dependencies] Transferring 1K from test.repo
[artifact:dependencies] Downloading: it/ant-tasks/snapshotUniqueFalse/2.0.7-SNAPSHOT/snapshotUniqueFalse-2.0.7-SNAPSHOT.jar
from repository Nexus at http://repository.sonatype.org:8081/content/groups/sonatype-public-grid
[artifact:dependencies] Downloading: plexus/plexus-container-default/1.0-alpha-3/plexus-container-default-1.0-alpha-3.jar
from repository Nexus at http://repository.sonatype.org:8081/content/groups/sonatype-public-grid
[artifact:dependencies] Downloading: classworlds/classworlds/1.1-alpha-1/classworlds-1.1-alpha-1.jar
from repository Nexus at http://repository.sonatype.org:8081/content/groups/sonatype-public-grid
[artifact:dependencies] Downloading: org/apache/maven/maven-core-it-support/1.1/maven-core-it-support-1.1.jar
from repository Nexus at http://repository.sonatype.org:8081/content/groups/sonatype-public-grid
[artifact:dependencies] Downloading: org/apache/maven/wagon/wagon-provider-test/1.0-alpha-4/wagon-provider-test-1.0-alpha-4.jar
from repository Nexus at http://repository.sonatype.org:8081/content/groups/sonatype-public-grid
[artifact:dependencies] Transferring 3K from Nexus
[artifact:dependencies] Transferring 37K from Nexus
[artifact:dependencies] Transferring 279K from Nexus
[artifact:dependencies] Transferring 6K from Nexus
[artifact:dependencies] Downloading: org/apache/maven/wagon/wagon-provider-api/1.0-alpha-4/wagon-provider-api-1.0-alpha-4.jar
from repository Nexus at http://repository.sonatype.org:8081/content/groups/sonatype-public-grid
[artifact:dependencies] Transferring 45K from Nexus
[artifact:dependencies] Unable to locate resource in repository
[artifact:dependencies] [INFO] Unable to find resource 'it.ant-tasks:snapshotUniqueFalse:jar:2.0.7-SNAPSHOT'
in repository Nexus (http://repository.sonatype.org:8081/content/groups/sonatype-public-grid)
[artifact:dependencies] Downloading: it/ant-tasks/snapshotUniqueFalse/2.0.7-SNAPSHOT/snapshotUniqueFalse-2.0.7-SNAPSHOT.jar
from repository test.repo at file://C:\home\hudson\workspace\maven-ant-tasks\jdk\1.5\label\windows\trunk/src/test/repo
[artifact:dependencies] Transferring 2K from test.repo
[artifact:dependencies] Downloading: it/ant-tasks/snapshotUniqueTrue/2.0.7-SNAPSHOT/snapshotUniqueTrue-2.0.7-20070610.180356-1.jar
from repository test.repo at file://C:\home\hudson\workspace\maven-ant-tasks\jdk\1.5\label\windows\trunk/src/test/repo
[artifact:dependencies] Transferring 2K from test.repo
     [copy] Copying 7 files to C:\home\hudson\workspace\maven-ant-tasks\jdk\1.5\label\windows\trunk\target\files\binaries
     [echo] Checking for non-existence of dir: target/files/binaries/junit/junit
     [echo] Checking for existence of dir: target/files/binaries/it/ant-tasks/snapshotUniqueFalse
     [echo] Checking for existence of dir: target/files/binaries/it/ant-tasks/snapshotUniqueTrue
     [copy] Copying 7 files to C:\home\hudson\workspace\maven-ant-tasks\jdk\1.5\label\windows\trunk\target\files\versionMapperFlatten
     [echo] Checking for non-existence of dir: target/files/versionMapperFlatten/it
     [echo] Checking for existence of file: C:\home\hudson\workspace\maven-ant-tasks\jdk\1.5\label\windows\trunk\target\local-repo\it\ant-tasks\snapshotUniqueTrue\2.0.7-SNAPSHOT\snapshotUniqueTrue-2.0.7-SNAPSHOT.jar

test-legacy-pom:
[artifact:dependencies] Downloading: geronimo-spec/poms/geronimo-spec-javamail-1.3.1-rc5.pom
from repository Nexus at http://repository.sonatype.org:8081/content/groups/sonatype-public-grid
[artifact:dependencies] Unable to locate resource in repository
[artifact:dependencies] [INFO] Unable to find resource 'geronimo-spec:geronimo-spec-javamail:pom:1.3.1-rc5'
in repository Nexus (http://repository.sonatype.org:8081/content/groups/sonatype-public-grid)
[artifact:dependencies] Downloading: geronimo-spec/jars/geronimo-spec-javamail-1.3.1-rc5.jar
from repository Nexus at http://repository.sonatype.org:8081/content/groups/sonatype-public-grid
[artifact:dependencies] Unable to locate resource in repository
[artifact:dependencies] [INFO] Unable to find resource 'geronimo-spec:geronimo-spec-javamail:jar:1.3.1-rc5'
in repository Nexus (http://repository.sonatype.org:8081/content/groups/sonatype-public-grid)
[artifact:dependencies] An error has occurred while processing the Maven artifact tasks.
[artifact:dependencies]  Diagnosis:
[artifact:dependencies] 
[artifact:dependencies] Unable to resolve artifact: Missing:
[artifact:dependencies] ----------
[artifact:dependencies] 1) geronimo-spec:geronimo-spec-javamail:jar:1.3.1-rc5
[artifact:dependencies] 
[artifact:dependencies]   Try downloading the file manually from the project website.
[artifact:dependencies] 
[artifact:dependencies]   Then, install it using the command: 
[artifact:dependencies]       mvn install:install-file -DgroupId=geronimo-spec -DartifactId=geronimo-spec-javamail
-Dversion=1.3.1-rc5 -Dpackaging=jar -Dfile=/path/to/file
[artifact:dependencies] 
[artifact:dependencies]   Alternatively, if you host your own repository you can deploy the
file there: 
[artifact:dependencies]       mvn deploy:deploy-file -DgroupId=geronimo-spec -DartifactId=geronimo-spec-javamail
-Dversion=1.3.1-rc5 -Dpackaging=jar -Dfile=/path/to/file -Durl=[url] -DrepositoryId=[id]
[artifact:dependencies] 
[artifact:dependencies]   Path to dependency: 
[artifact:dependencies]   	1) org.apache.maven:super-pom:jar:2.0
[artifact:dependencies]   	2) geronimo-spec:geronimo-spec-javamail:jar:1.3.1-rc5
[artifact:dependencies] 
[artifact:dependencies] ----------
[artifact:dependencies] 1 required artifact is missing.
[artifact:dependencies] 
[artifact:dependencies] for artifact: 
[artifact:dependencies]   org.apache.maven:super-pom:jar:2.0
[artifact:dependencies] 
[artifact:dependencies] from the specified remote repositories:
[artifact:dependencies]   Nexus (http://repository.sonatype.org:8081/content/groups/sonatype-public-grid)
[artifact:dependencies] 
[artifact:dependencies] 
[artifact:dependencies] 

BUILD FAILED
C:\home\hudson\workspace\maven-ant-tasks\jdk\1.5\label\windows\trunk\build-tests.xml:199:
Unable to resolve artifact: Missing:
----------
1) geronimo-spec:geronimo-spec-javamail:jar:1.3.1-rc5

  Try downloading the file manually from the project website.

  Then, install it using the command: 
      mvn install:install-file -DgroupId=geronimo-spec -DartifactId=geronimo-spec-javamail
-Dversion=1.3.1-rc5 -Dpackaging=jar -Dfile=/path/to/file

  Alternatively, if you host your own repository you can deploy the file there: 
      mvn deploy:deploy-file -DgroupId=geronimo-spec -DartifactId=geronimo-spec-javamail -Dversion=1.3.1-rc5
-Dpackaging=jar -Dfile=/path/to/file -Durl=[url] -DrepositoryId=[id]

  Path to dependency: 
  	1) org.apache.maven:super-pom:jar:2.0
  	2) geronimo-spec:geronimo-spec-javamail:jar:1.3.1-rc5

----------
1 required artifact is missing.

for artifact: 
  org.apache.maven:super-pom:jar:2.0

from the specified remote repositories:
  Nexus (http://repository.sonatype.org:8081/content/groups/sonatype-public-grid)



Total time: 15 seconds


Mime
View raw message