maven-notifications mailing list archives

Site index · List index
Message view « Date » · « Thread »
Top « Date » · « Thread »
From Hudson <Hud...@sonatype.org>
Subject Build failed in Hudson: Maven-2.2.x » 1.5,ubuntu #74
Date Fri, 09 Jul 2010 05:15:14 GMT
See <http://grid.sonatype.org/ci/job/Maven-2.2.x/./jdk=1.5,label=ubuntu/74/changes>

Changes:

[Hervé Boutemy] fixed ambiguous relative links

------------------------------------------
[...truncated 2032 lines...]
2K downloaded  (spice-parent-10.pom)
Downloading: http://repository.sonatype.org:8081/content/groups/sonatype-public-grid/org/sonatype/forge/forge-parent/3/forge-parent-3.pom
4K downloaded  (forge-parent-3.pom)
Downloading: http://repository.sonatype.org:8081/content/groups/sonatype-public-grid/org/codehaus/plexus/plexus-classworlds/1.2-alpha-9/plexus-classworlds-1.2-alpha-9.pom
3K downloaded  (plexus-classworlds-1.2-alpha-9.pom)
Downloading: http://repository.sonatype.org:8081/content/groups/sonatype-public-grid/org/codehaus/modello/modello-plugin-converters/1.0.2/modello-plugin-converters-1.0.2.pom
1K downloaded  (modello-plugin-converters-1.0.2.pom)
Downloading: http://repository.sonatype.org:8081/content/groups/sonatype-public-grid/org/codehaus/modello/modello-plugins/1.0.2/modello-plugins-1.0.2.pom
1K downloaded  (modello-plugins-1.0.2.pom)
Downloading: http://repository.sonatype.org:8081/content/groups/sonatype-public-grid/org/codehaus/modello/modello-plugin-java/1.0.2/modello-plugin-java-1.0.2.pom
1K downloaded  (modello-plugin-java-1.0.2.pom)
Downloading: http://repository.sonatype.org:8081/content/groups/sonatype-public-grid/org/codehaus/modello/modello-plugin-dom4j/1.0.2/modello-plugin-dom4j-1.0.2.pom
1K downloaded  (modello-plugin-dom4j-1.0.2.pom)
Downloading: http://repository.sonatype.org:8081/content/groups/sonatype-public-grid/org/codehaus/modello/modello-plugin-xml/1.0.2/modello-plugin-xml-1.0.2.pom
922b downloaded  (modello-plugin-xml-1.0.2.pom)
Downloading: http://repository.sonatype.org:8081/content/groups/sonatype-public-grid/org/codehaus/modello/modello-plugin-jdom/1.0.2/modello-plugin-jdom-1.0.2.pom
1K downloaded  (modello-plugin-jdom-1.0.2.pom)
Downloading: http://repository.sonatype.org:8081/content/groups/sonatype-public-grid/org/codehaus/modello/modello-plugin-stax/1.0.2/modello-plugin-stax-1.0.2.pom
2K downloaded  (modello-plugin-stax-1.0.2.pom)
Downloading: http://repository.sonatype.org:8081/content/groups/sonatype-public-grid/org/codehaus/modello/modello-plugin-xdoc/1.0.2/modello-plugin-xdoc-1.0.2.pom
843b downloaded  (modello-plugin-xdoc-1.0.2.pom)
Downloading: http://repository.sonatype.org:8081/content/groups/sonatype-public-grid/org/codehaus/modello/modello-plugin-xpp3/1.0.2/modello-plugin-xpp3-1.0.2.pom
1K downloaded  (modello-plugin-xpp3-1.0.2.pom)
Downloading: http://repository.sonatype.org:8081/content/groups/sonatype-public-grid/org/codehaus/modello/modello-plugin-xsd/1.0.2/modello-plugin-xsd-1.0.2.pom
1K downloaded  (modello-plugin-xsd-1.0.2.pom)
Downloading: http://repository.sonatype.org:8081/content/groups/sonatype-public-grid/org/codehaus/modello/modello-core/1.0.2/modello-core-1.0.2.jar
Downloading: http://repository.sonatype.org:8081/content/groups/sonatype-public-grid/org/sonatype/plexus/plexus-build-api/0.0.3/plexus-build-api-0.0.3.jar
5K downloaded  (plexus-build-api-0.0.3.jar)
57K downloaded  (modello-core-1.0.2.jar)
Downloading: http://repository.sonatype.org:8081/content/groups/sonatype-public-grid/org/codehaus/modello/modello-plugin-converters/1.0.2/modello-plugin-converters-1.0.2.jar
8K downloaded  (modello-plugin-converters-1.0.2.jar)
Downloading: http://repository.sonatype.org:8081/content/groups/sonatype-public-grid/org/codehaus/modello/modello-plugin-java/1.0.2/modello-plugin-java-1.0.2.jar
71K downloaded  (modello-plugin-java-1.0.2.jar)
Downloading: http://repository.sonatype.org:8081/content/groups/sonatype-public-grid/org/codehaus/modello/modello-plugin-dom4j/1.0.2/modello-plugin-dom4j-1.0.2.jar
17K downloaded  (modello-plugin-dom4j-1.0.2.jar)
Downloading: http://repository.sonatype.org:8081/content/groups/sonatype-public-grid/org/codehaus/modello/modello-plugin-xml/1.0.2/modello-plugin-xml-1.0.2.jar
13K downloaded  (modello-plugin-xml-1.0.2.jar)
Downloading: http://repository.sonatype.org:8081/content/groups/sonatype-public-grid/org/codehaus/modello/modello-plugin-jdom/1.0.2/modello-plugin-jdom-1.0.2.jar
13K downloaded  (modello-plugin-jdom-1.0.2.jar)
Downloading: http://repository.sonatype.org:8081/content/groups/sonatype-public-grid/org/codehaus/modello/modello-plugin-stax/1.0.2/modello-plugin-stax-1.0.2.jar
28K downloaded  (modello-plugin-stax-1.0.2.jar)
Downloading: http://repository.sonatype.org:8081/content/groups/sonatype-public-grid/org/codehaus/modello/modello-plugin-xdoc/1.0.2/modello-plugin-xdoc-1.0.2.jar
13K downloaded  (modello-plugin-xdoc-1.0.2.jar)
Downloading: http://repository.sonatype.org:8081/content/groups/sonatype-public-grid/org/codehaus/modello/modello-plugin-xpp3/1.0.2/modello-plugin-xpp3-1.0.2.jar
22K downloaded  (modello-plugin-xpp3-1.0.2.jar)
Downloading: http://repository.sonatype.org:8081/content/groups/sonatype-public-grid/org/codehaus/modello/modello-plugin-xsd/1.0.2/modello-plugin-xsd-1.0.2.jar
13K downloaded  (modello-plugin-xsd-1.0.2.jar)
[INFO] [modello:java {execution: standard}]
[INFO] outputDirectory: <http://grid.sonatype.org/ci/job/Maven-2.2.x/./jdk=1.5,label=ubuntu/ws/maven-2.2.x/maven-repository-metadata/target/generated-sources/modello>
[INFO] Working on model: src/main/mdo/metadata.mdo
[INFO] Generating current version: 1.0.0
[INFO] [modello:xpp3-reader {execution: standard}]
[INFO] outputDirectory: <http://grid.sonatype.org/ci/job/Maven-2.2.x/./jdk=1.5,label=ubuntu/ws/maven-2.2.x/maven-repository-metadata/target/generated-sources/modello>
[INFO] Working on model: src/main/mdo/metadata.mdo
[INFO] Generating current version: 1.0.0
[INFO] [modello:xpp3-writer {execution: standard}]
[INFO] outputDirectory: <http://grid.sonatype.org/ci/job/Maven-2.2.x/./jdk=1.5,label=ubuntu/ws/maven-2.2.x/maven-repository-metadata/target/generated-sources/modello>
[INFO] Working on model: src/main/mdo/metadata.mdo
[INFO] Generating current version: 1.0.0
[INFO] [remote-resources:process {execution: default}]
[INFO] [resources:resources {execution: default-resources}]
[INFO] Using 'UTF-8' encoding to copy filtered resources.
[INFO] skip non existing resourceDirectory <http://grid.sonatype.org/ci/job/Maven-2.2.x/./jdk=1.5,label=ubuntu/ws/maven-2.2.x/maven-repository-metadata/src/main/resources>
[INFO] Copying 3 resources
[INFO] [compiler:compile {execution: default-compile}]
[INFO] Compiling 6 source files to <http://grid.sonatype.org/ci/job/Maven-2.2.x/./jdk=1.5,label=ubuntu/ws/maven-2.2.x/maven-repository-metadata/target/classes>
[INFO] [resources:testResources {execution: default-testResources}]
[INFO] Using 'UTF-8' encoding to copy filtered resources.
[INFO] skip non existing resourceDirectory <http://grid.sonatype.org/ci/job/Maven-2.2.x/./jdk=1.5,label=ubuntu/ws/maven-2.2.x/maven-repository-metadata/src/test/resources>
[INFO] Copying 3 resources
[INFO] [compiler:testCompile {execution: default-testCompile}]
[INFO] No sources to compile
[INFO] [surefire:test {execution: default-test}]
[INFO] Surefire report directory: <http://grid.sonatype.org/ci/job/Maven-2.2.x/./jdk=1.5,label=ubuntu/ws/maven-2.2.x/maven-repository-metadata/target/surefire-reports>

-------------------------------------------------------
 T E S T S
-------------------------------------------------------
There are no tests to run.

Results :

Tests run: 0, Failures: 0, Errors: 0, Skipped: 0

[INFO] [jar:jar {execution: default-jar}]
[INFO] Building jar: <http://grid.sonatype.org/ci/job/Maven-2.2.x/./jdk=1.5,label=ubuntu/ws/maven-2.2.x/maven-repository-metadata/target/maven-repository-metadata-2.2.2-RC1-SNAPSHOT.jar>
[INFO] [install:install {execution: default-install}]
[INFO] Installing <http://grid.sonatype.org/ci/job/Maven-2.2.x/./jdk=1.5,label=ubuntu/ws/maven-2.2.x/maven-repository-metadata/target/maven-repository-metadata-2.2.2-RC1-SNAPSHOT.jar>
to /opt/repos/maven-2.2.x/org/apache/maven/maven-repository-metadata/2.2.2-RC1-SNAPSHOT/maven-repository-metadata-2.2.2-RC1-SNAPSHOT.jar
[INFO] ------------------------------------------------------------------------
[INFO] Building Maven Artifact Manager
[INFO]    task-segment: [clean, install]
[INFO] ------------------------------------------------------------------------
[INFO] [clean:clean {execution: default-clean}]
Downloading: http://repository.sonatype.org:8081/content/groups/sonatype-public-grid/org/apache/maven/wagon/wagon-file/1.0-beta-6/wagon-file-1.0-beta-6.pom
1K downloaded  (wagon-file-1.0-beta-6.pom)
Downloading: http://repository.sonatype.org:8081/content/groups/sonatype-public-grid/org/apache/maven/wagon/wagon-providers/1.0-beta-6/wagon-providers-1.0-beta-6.pom
2K downloaded  (wagon-providers-1.0-beta-6.pom)
Downloading: http://repository.sonatype.org:8081/content/groups/sonatype-public-grid/org/apache/maven/wagon/wagon/1.0-beta-6/wagon-1.0-beta-6.pom
12K downloaded  (wagon-1.0-beta-6.pom)
Downloading: http://repository.sonatype.org:8081/content/groups/sonatype-public-grid/org/apache/maven/wagon/wagon-provider-api/1.0-beta-6/wagon-provider-api-1.0-beta-6.pom
1K downloaded  (wagon-provider-api-1.0-beta-6.pom)
Downloading: http://repository.sonatype.org:8081/content/groups/sonatype-public-grid/org/apache/maven/wagon/wagon-http/1.0-beta-6/wagon-http-1.0-beta-6.pom
3K downloaded  (wagon-http-1.0-beta-6.pom)
Downloading: http://repository.sonatype.org:8081/content/groups/sonatype-public-grid/org/apache/maven/wagon/wagon-http-shared/1.0-beta-6/wagon-http-shared-1.0-beta-6.pom
2K downloaded  (wagon-http-shared-1.0-beta-6.pom)
Downloading: http://repository.sonatype.org:8081/content/groups/sonatype-public-grid/nekohtml/xercesMinimal/1.9.6.2/xercesMinimal-1.9.6.2.pom
390b downloaded  (xercesMinimal-1.9.6.2.pom)
Downloading: http://repository.sonatype.org:8081/content/groups/sonatype-public-grid/nekohtml/nekohtml/1.9.6.2/nekohtml-1.9.6.2.pom
704b downloaded  (nekohtml-1.9.6.2.pom)
Downloading: http://repository.sonatype.org:8081/content/groups/sonatype-public-grid/commons-httpclient/commons-httpclient/3.1/commons-httpclient-3.1.pom
7K downloaded  (commons-httpclient-3.1.pom)
Downloading: http://repository.sonatype.org:8081/content/groups/sonatype-public-grid/commons-codec/commons-codec/1.2/commons-codec-1.2.pom
3K downloaded  (commons-codec-1.2.pom)
Downloading: http://repository.sonatype.org:8081/content/groups/sonatype-public-grid/backport-util-concurrent/backport-util-concurrent/3.1/backport-util-concurrent-3.1.pom
880b downloaded  (backport-util-concurrent-3.1.pom)
Downloading: http://repository.sonatype.org:8081/content/groups/sonatype-public-grid/easymock/easymock/1.2_Java1.3/easymock-1.2_Java1.3.pom
192b downloaded  (easymock-1.2_Java1.3.pom)
Downloading: http://repository.sonatype.org:8081/content/groups/sonatype-public-grid/edu/umd/cs/mtc/multithreadedtc-jdk14/1.01/multithreadedtc-jdk14-1.01.pom
1K downloaded  (multithreadedtc-jdk14-1.01.pom)
Downloading: http://repository.sonatype.org:8081/content/groups/sonatype-public-grid/net/sf/retrotranslator/retrotranslator-runtime/1.2.7/retrotranslator-runtime-1.2.7.pom
1K downloaded  (retrotranslator-runtime-1.2.7.pom)
Downloading: http://repository.sonatype.org:8081/content/groups/sonatype-public-grid/commons-codec/commons-codec/1.2/commons-codec-1.2.jar
Downloading: http://repository.sonatype.org:8081/content/groups/sonatype-public-grid/commons-httpclient/commons-httpclient/3.1/commons-httpclient-3.1.jar
Downloading: http://repository.sonatype.org:8081/content/groups/sonatype-public-grid/nekohtml/xercesMinimal/1.9.6.2/xercesMinimal-1.9.6.2.jar
Downloading: http://repository.sonatype.org:8081/content/groups/sonatype-public-grid/org/apache/maven/wagon/wagon-file/1.0-beta-6/wagon-file-1.0-beta-6.jar
Downloading: http://repository.sonatype.org:8081/content/groups/sonatype-public-grid/commons-logging/commons-logging/1.0.4/commons-logging-1.0.4.jar
10K downloaded  (wagon-file-1.0-beta-6.jar)
29K downloaded  (commons-codec-1.2.jar)
297K downloaded  (commons-httpclient-3.1.jar)
Downloading: http://repository.sonatype.org:8081/content/groups/sonatype-public-grid/backport-util-concurrent/backport-util-concurrent/3.1/backport-util-concurrent-3.1.jar
Downloading: http://repository.sonatype.org:8081/content/groups/sonatype-public-grid/easymock/easymock/1.2_Java1.3/easymock-1.2_Java1.3.jar
37K downloaded  (commons-logging-1.0.4.jar)
38K downloaded  (xercesMinimal-1.9.6.2.jar)
Downloading: http://repository.sonatype.org:8081/content/groups/sonatype-public-grid/edu/umd/cs/mtc/multithreadedtc-jdk14/1.01/multithreadedtc-jdk14-1.01.jar
35K downloaded  (easymock-1.2_Java1.3.jar)
Downloading: http://repository.sonatype.org:8081/content/groups/sonatype-public-grid/net/sf/retrotranslator/retrotranslator-runtime/1.2.7/retrotranslator-runtime-1.2.7.jar
19K downloaded  (multithreadedtc-jdk14-1.01.jar)
323K downloaded  (backport-util-concurrent-3.1.jar)
Downloading: http://repository.sonatype.org:8081/content/groups/sonatype-public-grid/org/apache/maven/wagon/wagon-provider-api/1.0-beta-6/wagon-provider-api-1.0-beta-6.jar
Downloading: http://repository.sonatype.org:8081/content/groups/sonatype-public-grid/nekohtml/nekohtml/1.9.6.2/nekohtml-1.9.6.2.jar
299K downloaded  (retrotranslator-runtime-1.2.7.jar)
109K downloaded  (nekohtml-1.9.6.2.jar)
51K downloaded  (wagon-provider-api-1.0-beta-6.jar)
Downloading: http://repository.sonatype.org:8081/content/groups/sonatype-public-grid/org/apache/maven/wagon/wagon-http/1.0-beta-6/wagon-http-1.0-beta-6.jar
10K downloaded  (wagon-http-1.0-beta-6.jar)
Downloading: http://repository.sonatype.org:8081/content/groups/sonatype-public-grid/org/apache/maven/wagon/wagon-http-shared/1.0-beta-6/wagon-http-shared-1.0-beta-6.jar
24K downloaded  (wagon-http-shared-1.0-beta-6.jar)
[INFO] [enforcer:enforce {execution: enforce-jdk}]
[INFO] [remote-resources:process {execution: default}]
[INFO] [resources:resources {execution: default-resources}]
[INFO] Using 'UTF-8' encoding to copy filtered resources.
[INFO] Copying 1 resource
[INFO] Copying 3 resources
[INFO] [compiler:compile {execution: default-compile}]
[INFO] Compiling 26 source files to <http://grid.sonatype.org/ci/job/Maven-2.2.x/./jdk=1.5,label=ubuntu/ws/maven-2.2.x/maven-artifact-manager/target/classes>
[INFO] [resources:testResources {execution: default-testResources}]
[INFO] Using 'UTF-8' encoding to copy filtered resources.
[INFO] Copying 6 resources
[INFO] Copying 3 resources
[INFO] [compiler:testCompile {execution: default-testCompile}]
[INFO] Compiling 14 source files to <http://grid.sonatype.org/ci/job/Maven-2.2.x/./jdk=1.5,label=ubuntu/ws/maven-2.2.x/maven-artifact-manager/target/test-classes>
[INFO] [surefire:test {execution: default-test}]
[INFO] Surefire report directory: <http://grid.sonatype.org/ci/job/Maven-2.2.x/./jdk=1.5,label=ubuntu/ws/maven-2.2.x/maven-artifact-manager/target/surefire-reports>

-------------------------------------------------------
 T E S T S
-------------------------------------------------------
Running org.apache.maven.artifact.installer.ArtifactInstallerTest
[INFO] Installing <http://grid.sonatype.org/ci/job/Maven-2.2.x/./jdk=1.5,label=ubuntu/ws/maven-2.2.x/maven-artifact-manager/src/test/resources/artifact-install/artifact-1.0.jar>
to <http://grid.sonatype.org/ci/job/Maven-2.2.x/./jdk=1.5,label=ubuntu/ws/maven-2.2.x/maven-artifact-manager/target/test-classes/repositories/installer/local-repository/org.apache.maven/jars/artifact-1.0.jar>
Tests run: 1, Failures: 0, Errors: 0, Skipped: 0, Time elapsed: 0.702 sec
Running org.apache.maven.artifact.repository.metadata.AbstractRepositoryMetadataTest
Tests run: 2, Failures: 0, Errors: 0, Skipped: 0, Time elapsed: 0.123 sec
Running org.apache.maven.artifact.manager.DefaultWagonManagerTest
[WARNING] You are using a mirror that doesn't declare an <id/> element. Using 'mirror-0'
instead:
Id: mirror-0
mirrorOf: test
url: http://www.nowhere.com/

[WARNING] Component returned which is not the same manager. Ignored. component=org.apache.maven.artifact.manager.WagonComponentConfigurator@1be2893
[WARNING] *** CHECKSUM FAILED - Checksum failed on download: local = '8475b5cae2c9e7a2490a664535a5c22949d4702d';
remote = 'b7bb97d7d0b9244398d9b47296907f73313663e6' - RETRYING
Tests run: 14, Failures: 0, Errors: 1, Skipped: 0, Time elapsed: 15.498 sec <<< FAILURE!
testGetWagonMultithreaded(org.apache.maven.artifact.manager.DefaultWagonManagerTest)  Time
elapsed: 5.72 sec  <<< ERROR!
java.lang.IllegalStateException: No progress
	at edu.umd.cs.mtc.TestFramework$1.run(TestFramework.java:445)

Running org.apache.maven.artifact.deployer.ArtifactDeployerTest
[INFO] Retrieving previous metadata from test
[INFO] repository metadata for: 'artifact org.apache.maven:artifact' could not be found on
repository: test, so will be created
[INFO] Uploading repository metadata for: 'artifact org.apache.maven:artifact'
Tests run: 1, Failures: 0, Errors: 0, Skipped: 0, Time elapsed: 0.369 sec
Running org.apache.maven.artifact.resolver.ArtifactResolverTest
[WARNING] *** CHECKSUM FAILED - Error retrieving checksum file for org.apache.maven/jars/b-1.0.jar
- IGNORING
[WARNING] *** CHECKSUM FAILED - Error retrieving checksum file for org.apache.maven/jars/i-1.0.jar
- IGNORING
[WARNING] *** CHECKSUM FAILED - Error retrieving checksum file for org.apache.maven/jars/j-1.0.jar
- IGNORING
[INFO] Unable to find resource 'org.apache.maven:k:jar:1.0' in repository test (file://<http://grid.sonatype.org/ci/job/Maven-2.2.x/./jdk=1.5,label=ubuntu/ws/maven-2.2.x/maven-artifact-manager/target/test-classes/repositories/resolver/remote-repository)>
[INFO] Unable to find resource 'org.apache.maven:k:jar:1.0' in repository test (file://<http://grid.sonatype.org/ci/job/Maven-2.2.x/./jdk=1.5,label=ubuntu/ws/maven-2.2.x/maven-artifact-manager/target/test-classes/repositories/resolver/remote-repository)>
[WARNING] *** CHECKSUM FAILED - Error retrieving checksum file for org.apache.maven/jars/l-1.0.jar
- IGNORING
[INFO] Unable to find resource 'org.apache.maven:n:jar:1.0' in repository test (file://<http://grid.sonatype.org/ci/job/Maven-2.2.x/./jdk=1.5,label=ubuntu/ws/maven-2.2.x/maven-artifact-manager/target/test-classes/repositories/resolver/remote-repository)>
[INFO] Unable to find resource 'org.apache.maven:o:jar:1.0' in repository test (file://<http://grid.sonatype.org/ci/job/Maven-2.2.x/./jdk=1.5,label=ubuntu/ws/maven-2.2.x/maven-artifact-manager/target/test-classes/repositories/resolver/remote-repository)>
Tests run: 11, Failures: 0, Errors: 0, Skipped: 0, Time elapsed: 2.264 sec

Results :

Tests in error: 
  testGetWagonMultithreaded(org.apache.maven.artifact.manager.DefaultWagonManagerTest)

Tests run: 29, Failures: 0, Errors: 1, Skipped: 0

[INFO] ------------------------------------------------------------------------
[ERROR] BUILD FAILURE
[INFO] ------------------------------------------------------------------------
[INFO] There are test failures.

Please refer to <http://grid.sonatype.org/ci/job/Maven-2.2.x/./jdk=1.5,label=ubuntu/ws/maven-2.2.x/maven-artifact-manager/target/surefire-reports>
for the individual test results.
[INFO] ------------------------------------------------------------------------
[INFO] Trace
org.apache.maven.BuildFailureException: There are test failures.

Please refer to <http://grid.sonatype.org/ci/job/Maven-2.2.x/./jdk=1.5,label=ubuntu/ws/maven-2.2.x/maven-artifact-manager/target/surefire-reports>
for the individual test results.
	at org.apache.maven.lifecycle.DefaultLifecycleExecutor.executeGoals(DefaultLifecycleExecutor.java:715)
	at org.apache.maven.lifecycle.DefaultLifecycleExecutor.executeGoalWithLifecycle(DefaultLifecycleExecutor.java:556)
	at org.apache.maven.lifecycle.DefaultLifecycleExecutor.executeGoal(DefaultLifecycleExecutor.java:535)
	at org.apache.maven.lifecycle.DefaultLifecycleExecutor.executeGoalAndHandleFailures(DefaultLifecycleExecutor.java:387)
	at org.apache.maven.lifecycle.DefaultLifecycleExecutor.executeTaskSegments(DefaultLifecycleExecutor.java:348)
	at org.apache.maven.lifecycle.DefaultLifecycleExecutor.execute(DefaultLifecycleExecutor.java:180)
	at org.apache.maven.DefaultMaven.doExecute(DefaultMaven.java:328)
	at org.apache.maven.DefaultMaven.execute(DefaultMaven.java:138)
	at org.apache.maven.cli.MavenCli.main(MavenCli.java:362)
	at org.apache.maven.cli.compat.CompatibleMain.main(CompatibleMain.java:60)
	at sun.reflect.NativeMethodAccessorImpl.invoke0(Native Method)
	at sun.reflect.NativeMethodAccessorImpl.invoke(NativeMethodAccessorImpl.java:39)
	at sun.reflect.DelegatingMethodAccessorImpl.invoke(DelegatingMethodAccessorImpl.java:25)
	at java.lang.reflect.Method.invoke(Method.java:585)
	at org.codehaus.classworlds.Launcher.launchEnhanced(Launcher.java:315)
	at org.codehaus.classworlds.Launcher.launch(Launcher.java:255)
	at org.codehaus.classworlds.Launcher.mainWithExitCode(Launcher.java:430)
	at org.codehaus.classworlds.Launcher.main(Launcher.java:375)
Caused by: org.apache.maven.plugin.MojoFailureException: There are test failures.

Please refer to <http://grid.sonatype.org/ci/job/Maven-2.2.x/./jdk=1.5,label=ubuntu/ws/maven-2.2.x/maven-artifact-manager/target/surefire-reports>
for the individual test results.
	at org.apache.maven.plugin.surefire.SurefirePlugin.execute(SurefirePlugin.java:575)
	at org.apache.maven.plugin.DefaultPluginManager.executeMojo(DefaultPluginManager.java:490)
	at org.apache.maven.lifecycle.DefaultLifecycleExecutor.executeGoals(DefaultLifecycleExecutor.java:694)
	... 17 more
[INFO] ------------------------------------------------------------------------
[INFO] Total time: 3 minutes 37 seconds
[INFO] Finished at: Thu Jul 08 23:15:00 GMT-06:00 2010
[INFO] Final Memory: 30M/85M
[INFO] ------------------------------------------------------------------------


Mime
View raw message