maven-notifications mailing list archives

Site index · List index
Message view « Date » · « Thread »
Top « Date » · « Thread »
From Hudson <Hud...@sonatype.org>
Subject Build failed in Hudson: Maven-2.2.x-bootstrap » 1.5,ubuntu #109
Date Mon, 19 Jul 2010 21:37:06 GMT
See <http://grid.sonatype.org/ci/job/Maven-2.2.x-bootstrap/./jdk=1.5,label=ubuntu/109/changes>

Changes:

[Hervé Boutemy] use more Java 5 generics

------------------------------------------
[...truncated 1008 lines...]
     [java] Downloading: http://repository.sonatype.org:8081/content/groups/sonatype-public-grid/org/codehaus/plexus/plexus-archiver/1.0-alpha-9/plexus-archiver-1.0-alpha-9.pom
     [java] 1K downloaded  (plexus-archiver-1.0-alpha-9.pom)
     [java] Downloading: http://repository.sonatype.org:8081/content/groups/sonatype-public-grid/org/codehaus/plexus/plexus-container-default/1.0-alpha-15/plexus-container-default-1.0-alpha-15.pom
     [java] 1K downloaded  (plexus-container-default-1.0-alpha-15.pom)
     [java] Downloading: http://repository.sonatype.org:8081/content/groups/sonatype-public-grid/org/codehaus/plexus/plexus-containers/1.0-alpha-15/plexus-containers-1.0-alpha-15.pom
     [java] 1K downloaded  (plexus-containers-1.0-alpha-15.pom)
     [java] Downloading: http://repository.sonatype.org:8081/content/groups/sonatype-public-grid/org/codehaus/plexus/plexus-component-api/1.0-alpha-15/plexus-component-api-1.0-alpha-15.pom
     [java] 948b downloaded  (plexus-component-api-1.0-alpha-15.pom)
     [java] Downloading: http://repository.sonatype.org:8081/content/groups/sonatype-public-grid/org/codehaus/plexus/plexus-classworlds/1.2-alpha-6/plexus-classworlds-1.2-alpha-6.pom
     [java] 2K downloaded  (plexus-classworlds-1.2-alpha-6.pom)
     [java] Downloading: http://repository.sonatype.org:8081/content/groups/sonatype-public-grid/org/codehaus/plexus/plexus-io/1.0-alpha-1/plexus-io-1.0-alpha-1.pom
     [java] 1K downloaded  (plexus-io-1.0-alpha-1.pom)
     [java] Downloading: http://repository.sonatype.org:8081/content/groups/sonatype-public-grid/org/codehaus/plexus/plexus-component-api/1.0-alpha-16/plexus-component-api-1.0-alpha-16.pom
     [java] 2K downloaded  (plexus-component-api-1.0-alpha-16.pom)
     [java] Downloading: http://repository.sonatype.org:8081/content/groups/sonatype-public-grid/org/codehaus/plexus/plexus-containers/1.0-alpha-16/plexus-containers-1.0-alpha-16.pom
     [java] 1K downloaded  (plexus-containers-1.0-alpha-16.pom)
     [java] Downloading: http://repository.sonatype.org:8081/content/groups/sonatype-public-grid/org/codehaus/plexus/plexus-utils/1.4.9/plexus-utils-1.4.9.pom
     [java] 2K downloaded  (plexus-utils-1.4.9.pom)
     [java] Downloading: http://repository.sonatype.org:8081/content/groups/sonatype-public-grid/org/codehaus/plexus/plexus-utils/1.4.9/plexus-utils-1.4.9.jar
     [java] Downloading: http://repository.sonatype.org:8081/content/groups/sonatype-public-grid/org/apache/maven/maven-archiver/2.3/maven-archiver-2.3.jar
     [java] 17K downloaded  (maven-archiver-2.3.jar)
     [java] 199K downloaded  (plexus-utils-1.4.9.jar)
     [java] Downloading: http://repository.sonatype.org:8081/content/groups/sonatype-public-grid/org/codehaus/plexus/plexus-archiver/1.0-alpha-9/plexus-archiver-1.0-alpha-9.jar
     [java] 153K downloaded  (plexus-archiver-1.0-alpha-9.jar)
     [java] Downloading: http://repository.sonatype.org:8081/content/groups/sonatype-public-grid/org/codehaus/plexus/plexus-io/1.0-alpha-1/plexus-io-1.0-alpha-1.jar
     [java] 11K downloaded  (plexus-io-1.0-alpha-1.jar)
     [java] [INFO] [jar:jar {execution: default-jar}]
     [java] [INFO] Building jar: <http://grid.sonatype.org/ci/job/Maven-2.2.x-bootstrap/./jdk=1.5,label=ubuntu/ws/maven-2.2.x/maven-artifact/target/maven-artifact-2.2.2-RC1-SNAPSHOT.jar>
     [java] [INFO] [install:install {execution: default-install}]
     [java] [INFO] Installing <http://grid.sonatype.org/ci/job/Maven-2.2.x-bootstrap/./jdk=1.5,label=ubuntu/ws/maven-2.2.x/maven-artifact/target/maven-artifact-2.2.2-RC1-SNAPSHOT.jar>
to /opt/repos/bootstrap-maven-2.2.x/org/apache/maven/maven-artifact/2.2.2-RC1-SNAPSHOT/maven-artifact-2.2.2-RC1-SNAPSHOT.jar
     [java] [INFO] ------------------------------------------------------------------------
     [java] [INFO] Building Maven Repository Metadata Model
     [java] [INFO]    task-segment: [clean, install]
     [java] [INFO] ------------------------------------------------------------------------
     [java] Downloading: http://repository.sonatype.org:8081/content/groups/sonatype-public-grid/org/codehaus/modello/modello-maven-plugin/1.0.2/modello-maven-plugin-1.0.2.pom
     [java] 3K downloaded  (modello-maven-plugin-1.0.2.pom)
     [java] Downloading: http://repository.sonatype.org:8081/content/groups/sonatype-public-grid/org/codehaus/modello/modello/1.0.2/modello-1.0.2.pom
     [java] 21K downloaded  (modello-1.0.2.pom)
     [java] Downloading: http://repository.sonatype.org:8081/content/groups/sonatype-public-grid/org/codehaus/modello/modello-maven-plugin/1.0.2/modello-maven-plugin-1.0.2.jar
     [java] 22K downloaded  (modello-maven-plugin-1.0.2.jar)
     [java] [INFO] [clean:clean {execution: default-clean}]
     [java] [INFO] Deleting file set: <http://grid.sonatype.org/ci/job/Maven-2.2.x-bootstrap/./jdk=1.5,label=ubuntu/ws/maven-2.2.x/maven-repository-metadata/target>
(included: [**], excluded: [])
     [java] [INFO] [enforcer:enforce {execution: enforce-jdk}]
     [java] Downloading: http://repository.sonatype.org:8081/content/groups/sonatype-public-grid/org/codehaus/modello/modello-core/1.0.2/modello-core-1.0.2.pom
     [java] 1K downloaded  (modello-core-1.0.2.pom)
     [java] Downloading: http://repository.sonatype.org:8081/content/groups/sonatype-public-grid/org/sonatype/plexus/plexus-build-api/0.0.3/plexus-build-api-0.0.3.pom
     [java] 2K downloaded  (plexus-build-api-0.0.3.pom)
     [java] Downloading: http://repository.sonatype.org:8081/content/groups/sonatype-public-grid/org/sonatype/spice/spice-parent/10/spice-parent-10.pom
     [java] 2K downloaded  (spice-parent-10.pom)
     [java] Downloading: http://repository.sonatype.org:8081/content/groups/sonatype-public-grid/org/sonatype/forge/forge-parent/3/forge-parent-3.pom
     [java] 4K downloaded  (forge-parent-3.pom)
     [java] Downloading: http://repository.sonatype.org:8081/content/groups/sonatype-public-grid/org/codehaus/modello/modello-plugin-converters/1.0.2/modello-plugin-converters-1.0.2.pom
     [java] 1K downloaded  (modello-plugin-converters-1.0.2.pom)
     [java] Downloading: http://repository.sonatype.org:8081/content/groups/sonatype-public-grid/org/codehaus/modello/modello-plugins/1.0.2/modello-plugins-1.0.2.pom
     [java] 1K downloaded  (modello-plugins-1.0.2.pom)
     [java] Downloading: http://repository.sonatype.org:8081/content/groups/sonatype-public-grid/org/codehaus/modello/modello-plugin-java/1.0.2/modello-plugin-java-1.0.2.pom
     [java] 1K downloaded  (modello-plugin-java-1.0.2.pom)
     [java] Downloading: http://repository.sonatype.org:8081/content/groups/sonatype-public-grid/org/codehaus/modello/modello-plugin-dom4j/1.0.2/modello-plugin-dom4j-1.0.2.pom
     [java] 1K downloaded  (modello-plugin-dom4j-1.0.2.pom)
     [java] Downloading: http://repository.sonatype.org:8081/content/groups/sonatype-public-grid/org/codehaus/modello/modello-plugin-xml/1.0.2/modello-plugin-xml-1.0.2.pom
     [java] 922b downloaded  (modello-plugin-xml-1.0.2.pom)
     [java] Downloading: http://repository.sonatype.org:8081/content/groups/sonatype-public-grid/org/codehaus/modello/modello-plugin-jdom/1.0.2/modello-plugin-jdom-1.0.2.pom
     [java] 1K downloaded  (modello-plugin-jdom-1.0.2.pom)
     [java] Downloading: http://repository.sonatype.org:8081/content/groups/sonatype-public-grid/org/codehaus/modello/modello-plugin-stax/1.0.2/modello-plugin-stax-1.0.2.pom
     [java] 2K downloaded  (modello-plugin-stax-1.0.2.pom)
     [java] Downloading: http://repository.sonatype.org:8081/content/groups/sonatype-public-grid/org/codehaus/modello/modello-plugin-xdoc/1.0.2/modello-plugin-xdoc-1.0.2.pom
     [java] 843b downloaded  (modello-plugin-xdoc-1.0.2.pom)
     [java] Downloading: http://repository.sonatype.org:8081/content/groups/sonatype-public-grid/org/codehaus/modello/modello-plugin-xpp3/1.0.2/modello-plugin-xpp3-1.0.2.pom
     [java] 1K downloaded  (modello-plugin-xpp3-1.0.2.pom)
     [java] Downloading: http://repository.sonatype.org:8081/content/groups/sonatype-public-grid/org/codehaus/modello/modello-plugin-xsd/1.0.2/modello-plugin-xsd-1.0.2.pom
     [java] 1K downloaded  (modello-plugin-xsd-1.0.2.pom)
     [java] Downloading: http://repository.sonatype.org:8081/content/groups/sonatype-public-grid/org/sonatype/plexus/plexus-build-api/0.0.3/plexus-build-api-0.0.3.jar
     [java] Downloading: http://repository.sonatype.org:8081/content/groups/sonatype-public-grid/org/codehaus/modello/modello-core/1.0.2/modello-core-1.0.2.jar
     [java] 5K downloaded  (plexus-build-api-0.0.3.jar)
     [java] 57K downloaded  (modello-core-1.0.2.jar)
     [java] Downloading: http://repository.sonatype.org:8081/content/groups/sonatype-public-grid/org/codehaus/modello/modello-plugin-converters/1.0.2/modello-plugin-converters-1.0.2.jar
     [java] 8K downloaded  (modello-plugin-converters-1.0.2.jar)
     [java] Downloading: http://repository.sonatype.org:8081/content/groups/sonatype-public-grid/org/codehaus/modello/modello-plugin-java/1.0.2/modello-plugin-java-1.0.2.jar
     [java] 71K downloaded  (modello-plugin-java-1.0.2.jar)
     [java] Downloading: http://repository.sonatype.org:8081/content/groups/sonatype-public-grid/org/codehaus/modello/modello-plugin-dom4j/1.0.2/modello-plugin-dom4j-1.0.2.jar
     [java] 17K downloaded  (modello-plugin-dom4j-1.0.2.jar)
     [java] Downloading: http://repository.sonatype.org:8081/content/groups/sonatype-public-grid/org/codehaus/modello/modello-plugin-xml/1.0.2/modello-plugin-xml-1.0.2.jar
     [java] 13K downloaded  (modello-plugin-xml-1.0.2.jar)
     [java] Downloading: http://repository.sonatype.org:8081/content/groups/sonatype-public-grid/org/codehaus/modello/modello-plugin-jdom/1.0.2/modello-plugin-jdom-1.0.2.jar
     [java] 13K downloaded  (modello-plugin-jdom-1.0.2.jar)
     [java] Downloading: http://repository.sonatype.org:8081/content/groups/sonatype-public-grid/org/codehaus/modello/modello-plugin-stax/1.0.2/modello-plugin-stax-1.0.2.jar
     [java] 28K downloaded  (modello-plugin-stax-1.0.2.jar)
     [java] Downloading: http://repository.sonatype.org:8081/content/groups/sonatype-public-grid/org/codehaus/modello/modello-plugin-xdoc/1.0.2/modello-plugin-xdoc-1.0.2.jar
     [java] 13K downloaded  (modello-plugin-xdoc-1.0.2.jar)
     [java] Downloading: http://repository.sonatype.org:8081/content/groups/sonatype-public-grid/org/codehaus/modello/modello-plugin-xpp3/1.0.2/modello-plugin-xpp3-1.0.2.jar
     [java] 22K downloaded  (modello-plugin-xpp3-1.0.2.jar)
     [java] Downloading: http://repository.sonatype.org:8081/content/groups/sonatype-public-grid/org/codehaus/modello/modello-plugin-xsd/1.0.2/modello-plugin-xsd-1.0.2.jar
     [java] 13K downloaded  (modello-plugin-xsd-1.0.2.jar)
     [java] [INFO] [modello:java {execution: standard}]
     [java] [INFO] outputDirectory: <http://grid.sonatype.org/ci/job/Maven-2.2.x-bootstrap/./jdk=1.5,label=ubuntu/ws/maven-2.2.x/maven-repository-metadata/target/generated-sources/modello>
     [java] [INFO] Working on model: src/main/mdo/metadata.mdo
     [java] [INFO] Generating current version: 1.0.0
     [java] [INFO] [modello:xpp3-reader {execution: standard}]
     [java] [INFO] outputDirectory: <http://grid.sonatype.org/ci/job/Maven-2.2.x-bootstrap/./jdk=1.5,label=ubuntu/ws/maven-2.2.x/maven-repository-metadata/target/generated-sources/modello>
     [java] [INFO] Working on model: src/main/mdo/metadata.mdo
     [java] [INFO] Generating current version: 1.0.0
     [java] [INFO] [modello:xpp3-writer {execution: standard}]
     [java] [INFO] outputDirectory: <http://grid.sonatype.org/ci/job/Maven-2.2.x-bootstrap/./jdk=1.5,label=ubuntu/ws/maven-2.2.x/maven-repository-metadata/target/generated-sources/modello>
     [java] [INFO] Working on model: src/main/mdo/metadata.mdo
     [java] [INFO] Generating current version: 1.0.0
     [java] [INFO] [remote-resources:process {execution: default}]
     [java] [INFO] [resources:resources {execution: default-resources}]
     [java] [INFO] Using 'UTF-8' encoding to copy filtered resources.
     [java] [INFO] skip non existing resourceDirectory <http://grid.sonatype.org/ci/job/Maven-2.2.x-bootstrap/./jdk=1.5,label=ubuntu/ws/maven-2.2.x/maven-repository-metadata/src/main/resources>
     [java] [INFO] Copying 3 resources
     [java] [INFO] [compiler:compile {execution: default-compile}]
     [java] [INFO] Compiling 6 source files to <http://grid.sonatype.org/ci/job/Maven-2.2.x-bootstrap/./jdk=1.5,label=ubuntu/ws/maven-2.2.x/maven-repository-metadata/target/classes>
     [java] [INFO] [resources:testResources {execution: default-testResources}]
     [java] [INFO] Using 'UTF-8' encoding to copy filtered resources.
     [java] [INFO] skip non existing resourceDirectory <http://grid.sonatype.org/ci/job/Maven-2.2.x-bootstrap/./jdk=1.5,label=ubuntu/ws/maven-2.2.x/maven-repository-metadata/src/test/resources>
     [java] [INFO] Copying 3 resources
     [java] [INFO] [compiler:testCompile {execution: default-testCompile}]
     [java] [INFO] No sources to compile
     [java] [INFO] [surefire:test {execution: default-test}]
     [java] [INFO] Surefire report directory: <http://grid.sonatype.org/ci/job/Maven-2.2.x-bootstrap/./jdk=1.5,label=ubuntu/ws/maven-2.2.x/maven-repository-metadata/target/surefire-reports>
     [java] 
     [java] -------------------------------------------------------
     [java]  T E S T S
     [java] -------------------------------------------------------
     [java] There are no tests to run.
     [java] 
     [java] Results :
     [java] 
     [java] Tests run: 0, Failures: 0, Errors: 0, Skipped: 0
     [java] 
     [java] [INFO] [jar:jar {execution: default-jar}]
     [java] [INFO] Building jar: <http://grid.sonatype.org/ci/job/Maven-2.2.x-bootstrap/./jdk=1.5,label=ubuntu/ws/maven-2.2.x/maven-repository-metadata/target/maven-repository-metadata-2.2.2-RC1-SNAPSHOT.jar>
     [java] [INFO] [install:install {execution: default-install}]
     [java] [INFO] Installing <http://grid.sonatype.org/ci/job/Maven-2.2.x-bootstrap/./jdk=1.5,label=ubuntu/ws/maven-2.2.x/maven-repository-metadata/target/maven-repository-metadata-2.2.2-RC1-SNAPSHOT.jar>
to /opt/repos/bootstrap-maven-2.2.x/org/apache/maven/maven-repository-metadata/2.2.2-RC1-SNAPSHOT/maven-repository-metadata-2.2.2-RC1-SNAPSHOT.jar
     [java] [INFO] ------------------------------------------------------------------------
     [java] [INFO] Building Maven Artifact Manager
     [java] [INFO]    task-segment: [clean, install]
     [java] [INFO] ------------------------------------------------------------------------
     [java] [INFO] [clean:clean {execution: default-clean}]
     [java] [INFO] Deleting file set: <http://grid.sonatype.org/ci/job/Maven-2.2.x-bootstrap/./jdk=1.5,label=ubuntu/ws/maven-2.2.x/maven-artifact-manager/target>
(included: [**], excluded: [])
     [java] Downloading: http://repository.sonatype.org:8081/content/groups/sonatype-public-grid/edu/umd/cs/mtc/multithreadedtc-jdk14/1.01/multithreadedtc-jdk14-1.01.pom
     [java] 1K downloaded  (multithreadedtc-jdk14-1.01.pom)
     [java] Downloading: http://repository.sonatype.org:8081/content/groups/sonatype-public-grid/net/sf/retrotranslator/retrotranslator-runtime/1.2.7/retrotranslator-runtime-1.2.7.pom
     [java] 1K downloaded  (retrotranslator-runtime-1.2.7.pom)
     [java] Downloading: http://repository.sonatype.org:8081/content/groups/sonatype-public-grid/easymock/easymock/1.2_Java1.3/easymock-1.2_Java1.3.jar
     [java] Downloading: http://repository.sonatype.org:8081/content/groups/sonatype-public-grid/edu/umd/cs/mtc/multithreadedtc-jdk14/1.01/multithreadedtc-jdk14-1.01.jar
     [java] Downloading: http://repository.sonatype.org:8081/content/groups/sonatype-public-grid/net/sf/retrotranslator/retrotranslator-runtime/1.2.7/retrotranslator-runtime-1.2.7.jar
     [java] 19K downloaded  (multithreadedtc-jdk14-1.01.jar)
     [java] 35K downloaded  (easymock-1.2_Java1.3.jar)
     [java] 299K downloaded  (retrotranslator-runtime-1.2.7.jar)
     [java] [INFO] [enforcer:enforce {execution: enforce-jdk}]
     [java] [INFO] [remote-resources:process {execution: default}]
     [java] [INFO] [resources:resources {execution: default-resources}]
     [java] [INFO] Using 'UTF-8' encoding to copy filtered resources.
     [java] [INFO] Copying 1 resource
     [java] [INFO] Copying 3 resources
     [java] [INFO] [compiler:compile {execution: default-compile}]
     [java] [INFO] Compiling 26 source files to <http://grid.sonatype.org/ci/job/Maven-2.2.x-bootstrap/./jdk=1.5,label=ubuntu/ws/maven-2.2.x/maven-artifact-manager/target/classes>
     [java] [INFO] [resources:testResources {execution: default-testResources}]
     [java] [INFO] Using 'UTF-8' encoding to copy filtered resources.
     [java] [INFO] Copying 6 resources
     [java] [INFO] Copying 3 resources
     [java] [INFO] [compiler:testCompile {execution: default-testCompile}]
     [java] [INFO] Compiling 14 source files to <http://grid.sonatype.org/ci/job/Maven-2.2.x-bootstrap/./jdk=1.5,label=ubuntu/ws/maven-2.2.x/maven-artifact-manager/target/test-classes>
     [java] [INFO] [surefire:test {execution: default-test}]
     [java] [INFO] Surefire report directory: <http://grid.sonatype.org/ci/job/Maven-2.2.x-bootstrap/./jdk=1.5,label=ubuntu/ws/maven-2.2.x/maven-artifact-manager/target/surefire-reports>
     [java] 
     [java] -------------------------------------------------------
     [java]  T E S T S
     [java] -------------------------------------------------------
     [java] Running org.apache.maven.artifact.installer.ArtifactInstallerTest
     [java] [INFO] Installing <http://grid.sonatype.org/ci/job/Maven-2.2.x-bootstrap/./jdk=1.5,label=ubuntu/ws/maven-2.2.x/maven-artifact-manager/src/test/resources/artifact-install/artifact-1.0.jar>
to <http://grid.sonatype.org/ci/job/Maven-2.2.x-bootstrap/./jdk=1.5,label=ubuntu/ws/maven-2.2.x/maven-artifact-manager/target/test-classes/repositories/installer/local-repository/org.apache.maven/jars/artifact-1.0.jar>
     [java] Tests run: 1, Failures: 0, Errors: 0, Skipped: 0, Time elapsed: 9.23 sec
     [java] Running org.apache.maven.artifact.repository.metadata.AbstractRepositoryMetadataTest
     [java] Tests run: 2, Failures: 0, Errors: 0, Skipped: 0, Time elapsed: 0.485 sec
     [java] Running org.apache.maven.artifact.manager.DefaultWagonManagerTest
     [java] [WARNING] You are using a mirror that doesn't declare an <id/> element.
Using 'mirror-0' instead:
     [java] Id: mirror-0
     [java] mirrorOf: test
     [java] url: http://www.nowhere.com/
     [java] 
     [java] [WARNING] Component returned which is not the same manager. Ignored. component=org.apache.maven.artifact.manager.WagonComponentConfigurator@190ef12
     [java] [WARNING] *** CHECKSUM FAILED - Checksum failed on download: local = '8475b5cae2c9e7a2490a664535a5c22949d4702d';
remote = 'b7bb97d7d0b9244398d9b47296907f73313663e6' - RETRYING
     [java] Tests run: 14, Failures: 0, Errors: 1, Skipped: 0, Time elapsed: 21.11 sec <<<
FAILURE!
     [java] Running org.apache.maven.artifact.deployer.ArtifactDeployerTest
     [java] [INFO] Retrieving previous metadata from test
     [java] [INFO] repository metadata for: 'artifact org.apache.maven:artifact' could not
be found on repository: test, so will be created
     [java] [INFO] Uploading repository metadata for: 'artifact org.apache.maven:artifact'
     [java] Tests run: 1, Failures: 0, Errors: 0, Skipped: 0, Time elapsed: 0.616 sec
     [java] Running org.apache.maven.artifact.resolver.ArtifactResolverTest
     [java] [WARNING] *** CHECKSUM FAILED - Error retrieving checksum file for org.apache.maven/jars/b-1.0.jar
- IGNORING
     [java] [WARNING] *** CHECKSUM FAILED - Error retrieving checksum file for org.apache.maven/jars/i-1.0.jar
- IGNORING
     [java] [WARNING] *** CHECKSUM FAILED - Error retrieving checksum file for org.apache.maven/jars/j-1.0.jar
- IGNORING
     [java] [INFO] Unable to find resource 'org.apache.maven:k:jar:1.0' in repository test
(file://<http://grid.sonatype.org/ci/job/Maven-2.2.x-bootstrap/./jdk=1.5,label=ubuntu/ws/maven-2.2.x/maven-artifact-manager/target/test-classes/repositories/resolver/remote-repository)>
     [java] [INFO] Unable to find resource 'org.apache.maven:k:jar:1.0' in repository test
(file://<http://grid.sonatype.org/ci/job/Maven-2.2.x-bootstrap/./jdk=1.5,label=ubuntu/ws/maven-2.2.x/maven-artifact-manager/target/test-classes/repositories/resolver/remote-repository)>
     [java] [WARNING] *** CHECKSUM FAILED - Error retrieving checksum file for org.apache.maven/jars/l-1.0.jar
- IGNORING
     [java] [INFO] Unable to find resource 'org.apache.maven:n:jar:1.0' in repository test
(file://<http://grid.sonatype.org/ci/job/Maven-2.2.x-bootstrap/./jdk=1.5,label=ubuntu/ws/maven-2.2.x/maven-artifact-manager/target/test-classes/repositories/resolver/remote-repository)>
     [java] [INFO] Unable to find resource 'org.apache.maven:o:jar:1.0' in repository test
(file://<http://grid.sonatype.org/ci/job/Maven-2.2.x-bootstrap/./jdk=1.5,label=ubuntu/ws/maven-2.2.x/maven-artifact-manager/target/test-classes/repositories/resolver/remote-repository)>
     [java] Tests run: 11, Failures: 0, Errors: 0, Skipped: 0, Time elapsed: 5.935 sec
     [java] 
     [java] Results :
     [java] 
     [java] Tests in error: 
     [java]   testGetWagonMultithreaded(org.apache.maven.artifact.manager.DefaultWagonManagerTest)
     [java] 
     [java] Tests run: 29, Failures: 0, Errors: 1, Skipped: 0
     [java] 
     [java] [INFO] ------------------------------------------------------------------------
     [java] [ERROR] BUILD FAILURE
     [java] [INFO] ------------------------------------------------------------------------
     [java] [INFO] There are test failures.
     [java] 
     [java] Please refer to <http://grid.sonatype.org/ci/job/Maven-2.2.x-bootstrap/./jdk=1.5,label=ubuntu/ws/maven-2.2.x/maven-artifact-manager/target/surefire-reports>
for the individual test results.
     [java] [INFO] ------------------------------------------------------------------------
     [java] [INFO] Trace
     [java] org.apache.maven.BuildFailureException: There are test failures.
     [java] 
     [java] Please refer to <http://grid.sonatype.org/ci/job/Maven-2.2.x-bootstrap/./jdk=1.5,label=ubuntu/ws/maven-2.2.x/maven-artifact-manager/target/surefire-reports>
for the individual test results.
     [java] 	at org.apache.maven.lifecycle.DefaultLifecycleExecutor.executeGoals(DefaultLifecycleExecutor.java:715)
     [java] 	at org.apache.maven.lifecycle.DefaultLifecycleExecutor.executeGoalWithLifecycle(DefaultLifecycleExecutor.java:556)
     [java] 	at org.apache.maven.lifecycle.DefaultLifecycleExecutor.executeGoal(DefaultLifecycleExecutor.java:535)
     [java] 	at org.apache.maven.lifecycle.DefaultLifecycleExecutor.executeGoalAndHandleFailures(DefaultLifecycleExecutor.java:387)
     [java] 	at org.apache.maven.lifecycle.DefaultLifecycleExecutor.executeTaskSegments(DefaultLifecycleExecutor.java:348)
     [java] 	at org.apache.maven.lifecycle.DefaultLifecycleExecutor.execute(DefaultLifecycleExecutor.java:180)
     [java] 	at org.apache.maven.DefaultMaven.doExecute(DefaultMaven.java:334)
     [java] 	at org.apache.maven.DefaultMaven.execute(DefaultMaven.java:141)
     [java] 	at org.apache.maven.cli.MavenCli.main(MavenCli.java:362)
     [java] 	at org.apache.maven.cli.compat.CompatibleMain.main(CompatibleMain.java:60)
     [java] 	at org.apache.maven.cli.compat.CompatibleMain.main(CompatibleMain.java:37)
     [java] Caused by: org.apache.maven.plugin.MojoFailureException: There are test failures.
     [java] 
     [java] Please refer to <http://grid.sonatype.org/ci/job/Maven-2.2.x-bootstrap/./jdk=1.5,label=ubuntu/ws/maven-2.2.x/maven-artifact-manager/target/surefire-reports>
for the individual test results.
     [java] 	at org.apache.maven.plugin.surefire.SurefirePlugin.execute(SurefirePlugin.java:575)
     [java] 	at org.apache.maven.plugin.DefaultPluginManager.executeMojo(DefaultPluginManager.java:490)
     [java] 	at org.apache.maven.lifecycle.DefaultLifecycleExecutor.executeGoals(DefaultLifecycleExecutor.java:694)
     [java] 	... 10 more
     [java] [INFO] ------------------------------------------------------------------------
     [java] [INFO] Total time: 5 minutes 
     [java] [INFO] Finished at: Mon Jul 19 15:36:32 GMT-06:00 2010
     [java] [INFO] Final Memory: 31M/63M
     [java] [INFO] ------------------------------------------------------------------------

BUILD FAILED
<http://grid.sonatype.org/ci/job/Maven-2.2.x-bootstrap/./jdk=1.5,label=ubuntu/ws/maven-2.2.x/build.xml>:194:
Java returned: 1

Total time: 7 minutes 37 seconds
Archiving artifacts
Jabber notifier plugin: Sending notification to: jdcasey@jabber.org
Jabber notifier plugin: [ERROR] not connected. Cannot send message to 'jdcasey@jabber.org'


Mime
View raw message