maven-notifications mailing list archives

Site index · List index
Message view « Date » · « Thread »
Top « Date » · « Thread »
From Hudson <Hud...@sonatype.org>
Subject Build failed in Hudson: maven-release » 1.5,windows #123
Date Fri, 30 Jul 2010 14:46:37 GMT
See <http://grid.sonatype.org/ci/job/maven-release/./jdk=1.5,label=windows/123/>

------------------------------------------
[...truncated 6220 lines...]
testModificationsToIncludedFilesOnly(org.apache.maven.shared.release.phase.ScmCheckModificationsPhaseTest)
 Time elapsed: 0.058 sec  <<< ERROR!
org.codehaus.plexus.PlexusContainerException: Error starting container
	at org.codehaus.plexus.DefaultPlexusContainer.start(DefaultPlexusContainer.java:795)
	at org.codehaus.plexus.PlexusTestCase.setUp(PlexusTestCase.java:121)
	at org.apache.maven.shared.release.phase.ScmCheckModificationsPhaseTest.setUp(ScmCheckModificationsPhaseTest.java:65)
	at junit.framework.TestCase.runBare(TestCase.java:128)
	at junit.framework.TestResult$1.protect(TestResult.java:106)
	at junit.framework.TestResult.runProtected(TestResult.java:124)
	at junit.framework.TestResult.run(TestResult.java:109)
	at junit.framework.TestCase.run(TestCase.java:120)
	at junit.framework.TestSuite.runTest(TestSuite.java:230)
	at junit.framework.TestSuite.run(TestSuite.java:225)
	at sun.reflect.GeneratedMethodAccessor6.invoke(Unknown Source)
	at sun.reflect.DelegatingMethodAccessorImpl.invoke(DelegatingMethodAccessorImpl.java:25)
	at java.lang.reflect.Method.invoke(Method.java:585)
	at org.apache.maven.surefire.junit.JUnitTestSet.execute(JUnitTestSet.java:213)
	at org.apache.maven.surefire.suite.AbstractDirectoryTestSuite.executeTestSet(AbstractDirectoryTestSuite.java:140)
	at org.apache.maven.surefire.suite.AbstractDirectoryTestSuite.execute(AbstractDirectoryTestSuite.java:127)
	at org.apache.maven.surefire.Surefire.run(Surefire.java:177)
	at sun.reflect.NativeMethodAccessorImpl.invoke0(Native Method)
	at sun.reflect.NativeMethodAccessorImpl.invoke(NativeMethodAccessorImpl.java:39)
	at sun.reflect.DelegatingMethodAccessorImpl.invoke(DelegatingMethodAccessorImpl.java:25)
	at java.lang.reflect.Method.invoke(Method.java:585)
	at org.apache.maven.surefire.booter.SurefireBooter.runSuitesInProcess(SurefireBooter.java:345)
	at org.apache.maven.surefire.booter.SurefireBooter.main(SurefireBooter.java:1009)
Caused by: org.codehaus.plexus.component.repository.exception.ComponentRepositoryException:
Component descriptor role: 'org.apache.maven.scm.manager.ScmManager', implementation: 'org.apache.maven.scm.manager.plexus.DefaultScmManager',
role hint: 'default' has a hint, but there are other implementations that don't
	at org.codehaus.plexus.component.repository.DefaultComponentRepository.addComponentDescriptor(DefaultComponentRepository.java:184)
	at org.codehaus.plexus.DefaultPlexusContainer.addComponentDescriptor(DefaultPlexusContainer.java:515)
	at org.codehaus.plexus.DefaultPlexusContainer.discoverComponents(DefaultPlexusContainer.java:738)
	at org.codehaus.plexus.DefaultPlexusContainer.start(DefaultPlexusContainer.java:779)
	... 22 more
Caused by: org.codehaus.plexus.component.repository.exception.ComponentRepositoryException:
Component descriptor role: 'org.apache.maven.scm.manager.ScmManager', implementation: 'org.apache.maven.scm.manager.plexus.DefaultScmManager',
role hint: 'default' has a hint, but there are other implementations that don't
	at org.codehaus.plexus.component.repository.DefaultComponentRepository.addComponentDescriptor(DefaultComponentRepository.java:184)
	at org.codehaus.plexus.DefaultPlexusContainer.addComponentDescriptor(DefaultPlexusContainer.java:515)
	at org.codehaus.plexus.DefaultPlexusContainer.discoverComponents(DefaultPlexusContainer.java:738)
	at org.codehaus.plexus.DefaultPlexusContainer.start(DefaultPlexusContainer.java:779)
	... 22 more

testModificationsToIncludedAndExcludedFiles(org.apache.maven.shared.release.phase.ScmCheckModificationsPhaseTest)
 Time elapsed: 0.058 sec  <<< ERROR!
org.codehaus.plexus.PlexusContainerException: Error starting container
	at org.codehaus.plexus.DefaultPlexusContainer.start(DefaultPlexusContainer.java:795)
	at org.codehaus.plexus.PlexusTestCase.setUp(PlexusTestCase.java:121)
	at org.apache.maven.shared.release.phase.ScmCheckModificationsPhaseTest.setUp(ScmCheckModificationsPhaseTest.java:65)
	at junit.framework.TestCase.runBare(TestCase.java:128)
	at junit.framework.TestResult$1.protect(TestResult.java:106)
	at junit.framework.TestResult.runProtected(TestResult.java:124)
	at junit.framework.TestResult.run(TestResult.java:109)
	at junit.framework.TestCase.run(TestCase.java:120)
	at junit.framework.TestSuite.runTest(TestSuite.java:230)
	at junit.framework.TestSuite.run(TestSuite.java:225)
	at sun.reflect.GeneratedMethodAccessor6.invoke(Unknown Source)
	at sun.reflect.DelegatingMethodAccessorImpl.invoke(DelegatingMethodAccessorImpl.java:25)
	at java.lang.reflect.Method.invoke(Method.java:585)
	at org.apache.maven.surefire.junit.JUnitTestSet.execute(JUnitTestSet.java:213)
	at org.apache.maven.surefire.suite.AbstractDirectoryTestSuite.executeTestSet(AbstractDirectoryTestSuite.java:140)
	at org.apache.maven.surefire.suite.AbstractDirectoryTestSuite.execute(AbstractDirectoryTestSuite.java:127)
	at org.apache.maven.surefire.Surefire.run(Surefire.java:177)
	at sun.reflect.NativeMethodAccessorImpl.invoke0(Native Method)
	at sun.reflect.NativeMethodAccessorImpl.invoke(NativeMethodAccessorImpl.java:39)
	at sun.reflect.DelegatingMethodAccessorImpl.invoke(DelegatingMethodAccessorImpl.java:25)
	at java.lang.reflect.Method.invoke(Method.java:585)
	at org.apache.maven.surefire.booter.SurefireBooter.runSuitesInProcess(SurefireBooter.java:345)
	at org.apache.maven.surefire.booter.SurefireBooter.main(SurefireBooter.java:1009)
Caused by: org.codehaus.plexus.component.repository.exception.ComponentRepositoryException:
Component descriptor role: 'org.apache.maven.scm.manager.ScmManager', implementation: 'org.apache.maven.scm.manager.plexus.DefaultScmManager',
role hint: 'default' has a hint, but there are other implementations that don't
	at org.codehaus.plexus.component.repository.DefaultComponentRepository.addComponentDescriptor(DefaultComponentRepository.java:184)
	at org.codehaus.plexus.DefaultPlexusContainer.addComponentDescriptor(DefaultPlexusContainer.java:515)
	at org.codehaus.plexus.DefaultPlexusContainer.discoverComponents(DefaultPlexusContainer.java:738)
	at org.codehaus.plexus.DefaultPlexusContainer.start(DefaultPlexusContainer.java:779)
	... 22 more
Caused by: org.codehaus.plexus.component.repository.exception.ComponentRepositoryException:
Component descriptor role: 'org.apache.maven.scm.manager.ScmManager', implementation: 'org.apache.maven.scm.manager.plexus.DefaultScmManager',
role hint: 'default' has a hint, but there are other implementations that don't
	at org.codehaus.plexus.component.repository.DefaultComponentRepository.addComponentDescriptor(DefaultComponentRepository.java:184)
	at org.codehaus.plexus.DefaultPlexusContainer.addComponentDescriptor(DefaultPlexusContainer.java:515)
	at org.codehaus.plexus.DefaultPlexusContainer.discoverComponents(DefaultPlexusContainer.java:738)
	at org.codehaus.plexus.DefaultPlexusContainer.start(DefaultPlexusContainer.java:779)
	... 22 more

Running org.apache.maven.shared.release.versions.DefaultVersionInfoTest
Tests run: 21, Failures: 0, Errors: 0, Skipped: 0, Time elapsed: 1.336 sec
Running org.apache.maven.shared.release.util.ReleaseUtilTest
Tests run: 16, Failures: 0, Errors: 0, Skipped: 0, Time elapsed: 1.055 sec
Running org.apache.maven.shared.release.phase.CreateBackupPomsPhaseTest
Tests run: 2, Failures: 0, Errors: 0, Skipped: 0, Time elapsed: 0.232 sec
Running org.apache.maven.shared.release.exec.TeeOutputStreamTest
Tests run: 1, Failures: 0, Errors: 0, Skipped: 0, Time elapsed: 0.008 sec
Running org.apache.maven.shared.release.phase.EndReleasePhaseTest
Tests run: 2, Failures: 0, Errors: 0, Skipped: 0, Time elapsed: 0.164 sec

Results :

Tests in error: 
  testPrepareNoCompletedPhase(org.apache.maven.shared.release.DefaultReleaseManagerTest)
  testPrepareCompletedPhase(org.apache.maven.shared.release.DefaultReleaseManagerTest)
  testPrepareCompletedPhaseNoResume(org.apache.maven.shared.release.DefaultReleaseManagerTest)
  testPrepareCompletedAllPhases(org.apache.maven.shared.release.DefaultReleaseManagerTest)
  testPrepareInvalidCompletedPhase(org.apache.maven.shared.release.DefaultReleaseManagerTest)
  testPrepareSimulateNoCompletedPhase(org.apache.maven.shared.release.DefaultReleaseManagerTest)
  testPrepareSimulateCompletedPhase(org.apache.maven.shared.release.DefaultReleaseManagerTest)
  testPrepareSimulateCompletedAllPhases(org.apache.maven.shared.release.DefaultReleaseManagerTest)
  testPrepareSimulateInvalidCompletedPhase(org.apache.maven.shared.release.DefaultReleaseManagerTest)
  testPrepareUnknownPhaseConfigured(org.apache.maven.shared.release.DefaultReleaseManagerTest)
  testReleaseConfigurationStoreReadFailure(org.apache.maven.shared.release.DefaultReleaseManagerTest)
  testReleaseConfigurationStoreWriteFailure(org.apache.maven.shared.release.DefaultReleaseManagerTest)
  testReleaseConfigurationStoreClean(org.apache.maven.shared.release.DefaultReleaseManagerTest)
  testReleasePerform(org.apache.maven.shared.release.DefaultReleaseManagerTest)
  testReleasePerformWithResult(org.apache.maven.shared.release.DefaultReleaseManagerTest)
  testReleasePerformNoReleaseProfile(org.apache.maven.shared.release.DefaultReleaseManagerTest)
  testReleasePerformWithArguments(org.apache.maven.shared.release.DefaultReleaseManagerTest)
  testReleasePerformWithArgumentsNoReleaseProfile(org.apache.maven.shared.release.DefaultReleaseManagerTest)
  testReleasePerformWithReleasePropertiesCompleted(org.apache.maven.shared.release.DefaultReleaseManagerTest)
  testReleaseConfigurationStoreReadFailureOnPerform(org.apache.maven.shared.release.DefaultReleaseManagerTest)
  testReleasePerformWithIncompletePrepare(org.apache.maven.shared.release.DefaultReleaseManagerTest)
  testNoScmUrlPerform(org.apache.maven.shared.release.DefaultReleaseManagerTest)
  testNoSuchScmProviderExceptionThrown(org.apache.maven.shared.release.DefaultReleaseManagerTest)
  testScmRepositoryExceptionThrown(org.apache.maven.shared.release.DefaultReleaseManagerTest)
  testScmExceptionThrown(org.apache.maven.shared.release.DefaultReleaseManagerTest)
  testScmResultFailure(org.apache.maven.shared.release.DefaultReleaseManagerTest)
  testDetermineWorkingDirectory(org.apache.maven.shared.release.DefaultReleaseManagerTest)
  testExecuteStandard(org.apache.maven.shared.release.phase.CheckoutProjectFromScmTest)
  testExecuteMultiModuleWithDeepSubprojects(org.apache.maven.shared.release.phase.CheckoutProjectFromScmTest)
  testExecuteFlatMultiModule(org.apache.maven.shared.release.phase.CheckoutProjectFromScmTest)
  testExecuteBasicPom(org.apache.maven.shared.release.phase.RemoveReleasePomsPhaseTest)
  testExecutePomWithModules(org.apache.maven.shared.release.phase.RemoveReleasePomsPhaseTest)
  testSimulateBasicPom(org.apache.maven.shared.release.phase.RemoveReleasePomsPhaseTest)
  testNoSuchScmProviderExceptionThrown(org.apache.maven.shared.release.phase.ScmCommitPhaseTest)
  testScmRepositoryExceptionThrown(org.apache.maven.shared.release.phase.ScmCommitPhaseTest)
  testScmExceptionThrown(org.apache.maven.shared.release.phase.ScmCommitPhaseTest)
  testScmResultFailure(org.apache.maven.shared.release.phase.ScmCommitPhaseTest)
  testCommit(org.apache.maven.shared.release.phase.ScmCommitPhaseTest)
  testCommitMultiModule(org.apache.maven.shared.release.phase.ScmCommitPhaseTest)
  testCommitDevelopment(org.apache.maven.shared.release.phase.ScmCommitPhaseTest)
  testCommitNoReleaseLabel(org.apache.maven.shared.release.phase.ScmCommitPhaseTest)
  testCommitGenerateReleasePoms(org.apache.maven.shared.release.phase.ScmCommitPhaseTest)
  testSimulateCommit(org.apache.maven.shared.release.phase.ScmCommitPhaseTest)
  testSimulateCommitNoReleaseLabel(org.apache.maven.shared.release.phase.ScmCommitPhaseTest)
  testNoSuchScmProviderExceptionThrown(org.apache.maven.shared.release.phase.ScmTagPhaseTest)
  testScmRepositoryExceptionThrown(org.apache.maven.shared.release.phase.ScmTagPhaseTest)
  testScmExceptionThrown(org.apache.maven.shared.release.phase.ScmTagPhaseTest)
  testScmResultFailure(org.apache.maven.shared.release.phase.ScmTagPhaseTest)
  testCommitMultiModule(org.apache.maven.shared.release.phase.ScmTagPhaseTest)
  testTag(org.apache.maven.shared.release.phase.ScmTagPhaseTest)
  testCommitMultiModuleDeepFolders(org.apache.maven.shared.release.phase.ScmTagPhaseTest)
  testCommitForFlatMultiModule(org.apache.maven.shared.release.phase.ScmTagPhaseTest)
  testTagNoReleaseLabel(org.apache.maven.shared.release.phase.ScmTagPhaseTest)
  testSimulateTag(org.apache.maven.shared.release.phase.ScmTagPhaseTest)
  testSimulateTagNoReleaseLabel(org.apache.maven.shared.release.phase.ScmTagPhaseTest)
  testRewriteExternalRangeDependency(org.apache.maven.shared.release.phase.GenerateReleasePomsPhaseTest)
  testRewriteBasicPom(org.apache.maven.shared.release.phase.GenerateReleasePomsPhaseTest)
  testRewriteBasicPomEntities(org.apache.maven.shared.release.phase.GenerateReleasePomsPhaseTest)
  testRewriteBasicPomNamespace(org.apache.maven.shared.release.phase.GenerateReleasePomsPhaseTest)
  testRewriteBasicPomWithEncoding(org.apache.maven.shared.release.phase.GenerateReleasePomsPhaseTest)
  testRewritePomWithParent(org.apache.maven.shared.release.phase.GenerateReleasePomsPhaseTest)
  testRewritePomWithUnmappedParent(org.apache.maven.shared.release.phase.GenerateReleasePomsPhaseTest)
  testRewritePomWithReleasedParent(org.apache.maven.shared.release.phase.GenerateReleasePomsPhaseTest)
  testRewritePomWithInheritedVersion(org.apache.maven.shared.release.phase.GenerateReleasePomsPhaseTest)
  testRewritePomWithChangedInheritedVersion(org.apache.maven.shared.release.phase.GenerateReleasePomsPhaseTest)
  testRewritePomDependencies(org.apache.maven.shared.release.phase.GenerateReleasePomsPhaseTest)
  testRewritePomUnmappedDependencies(org.apache.maven.shared.release.phase.GenerateReleasePomsPhaseTest)
  testRewritePomDependenciesDifferentVersion(org.apache.maven.shared.release.phase.GenerateReleasePomsPhaseTest)
  testRewriteManagedPomDependencies(org.apache.maven.shared.release.phase.GenerateReleasePomsPhaseTest)
  testRewriteManagedPomUnmappedDependencies(org.apache.maven.shared.release.phase.GenerateReleasePomsPhaseTest)
  testRewritePomPlugins(org.apache.maven.shared.release.phase.GenerateReleasePomsPhaseTest)
  testRewritePomUnmappedPlugins(org.apache.maven.shared.release.phase.GenerateReleasePomsPhaseTest)
  testRewritePomPluginsDifferentVersion(org.apache.maven.shared.release.phase.GenerateReleasePomsPhaseTest)
  testRewriteManagedPomPlugins(org.apache.maven.shared.release.phase.GenerateReleasePomsPhaseTest)
  testRewriteManagedPomUnmappedPlugins(org.apache.maven.shared.release.phase.GenerateReleasePomsPhaseTest)
  testRewritePomReportPlugins(org.apache.maven.shared.release.phase.GenerateReleasePomsPhaseTest)
  testRewritePomUnmappedReportPlugins(org.apache.maven.shared.release.phase.GenerateReleasePomsPhaseTest)
  testRewritePomReportPluginsDifferentVersion(org.apache.maven.shared.release.phase.GenerateReleasePomsPhaseTest)
  testRewritePomExtension(org.apache.maven.shared.release.phase.GenerateReleasePomsPhaseTest)
  testRewritePomUnmappedExtension(org.apache.maven.shared.release.phase.GenerateReleasePomsPhaseTest)
  testRewritePomExtensionDifferentVersion(org.apache.maven.shared.release.phase.GenerateReleasePomsPhaseTest)
  testRewritePomExtensionUndefinedVersion(org.apache.maven.shared.release.phase.GenerateReleasePomsPhaseTest)
  testRewriteAddSchema(org.apache.maven.shared.release.phase.GenerateReleasePomsPhaseTest)
  testSimulateRewriteEditModeSkipped(org.apache.maven.shared.release.phase.GenerateReleasePomsPhaseTest)
  testRewriteUnmappedPom(org.apache.maven.shared.release.phase.GenerateReleasePomsPhaseTest)
  testRewriteBasicPomWithScmRepoException(org.apache.maven.shared.release.phase.GenerateReleasePomsPhaseTest)
  testRewriteBasicPomWithNoSuchProviderException(org.apache.maven.shared.release.phase.GenerateReleasePomsPhaseTest)
  testRewriteWhitespaceAroundValues(org.apache.maven.shared.release.phase.GenerateReleasePomsPhaseTest)
  testRewriteCommentsAroundValues(org.apache.maven.shared.release.phase.GenerateReleasePomsPhaseTest)
  testRewriteCDataAroundValues(org.apache.maven.shared.release.phase.GenerateReleasePomsPhaseTest)
  testCleanNoProjects(org.apache.maven.shared.release.phase.GenerateReleasePomsPhaseTest)
  testRewritePomDependenciesWithNamespace(org.apache.maven.shared.release.phase.GenerateReleasePomsPhaseTest)
  testNoSuchScmProviderExceptionThrown(org.apache.maven.shared.release.phase.ScmCheckModificationsPhaseTest)
  testScmRepositoryExceptionThrown(org.apache.maven.shared.release.phase.ScmCheckModificationsPhaseTest)
  testScmExceptionThrown(org.apache.maven.shared.release.phase.ScmCheckModificationsPhaseTest)
  testScmResultFailure(org.apache.maven.shared.release.phase.ScmCheckModificationsPhaseTest)
  testNoModifications(org.apache.maven.shared.release.phase.ScmCheckModificationsPhaseTest)
  testModificationsToExcludedFilesOnly(org.apache.maven.shared.release.phase.ScmCheckModificationsPhaseTest)
  testModificationsToPoms(org.apache.maven.shared.release.phase.ScmCheckModificationsPhaseTest)
  testModificationsToIncludedFilesOnly(org.apache.maven.shared.release.phase.ScmCheckModificationsPhaseTest)
  testModificationsToIncludedAndExcludedFiles(org.apache.maven.shared.release.phase.ScmCheckModificationsPhaseTest)

Tests run: 345, Failures: 0, Errors: 101, Skipped: 0

[INFO]                                                                         
[INFO] ------------------------------------------------------------------------
[INFO] Skipping Maven Release Plugin
[INFO] This project has been banned from the build due to previous failures.
[INFO] ------------------------------------------------------------------------
[INFO] ------------------------------------------------------------------------
[INFO] Reactor Summary:
[INFO] 
[INFO] Maven Release ..................................... SUCCESS [1:01.921s]
[INFO] Maven Release Manager ............................. FAILURE [3:24.584s]
[INFO] Maven Release Plugin .............................. SKIPPED
[INFO] ------------------------------------------------------------------------
[INFO] BUILD FAILURE
[INFO] ------------------------------------------------------------------------
[INFO] Total time: 4:28.619s
[INFO] Finished at: Fri Jul 30 07:48:02 PDT 2010
[INFO] Final Memory: 9M/26M
[INFO] ------------------------------------------------------------------------
[ERROR] Failed to execute goal org.apache.maven.plugins:maven-surefire-plugin:2.4.3:test (default-test)
on project maven-release-manager: There are test failures.

Please refer to C:\home\hudson\workspace\maven-release\jdk\1.5\label\windows\trunk\maven-release-manager\target\surefire-reports
for the individual test results.
-> [Help 1]
org.apache.maven.lifecycle.LifecycleExecutionException: Failed to execute goal org.apache.maven.plugins:maven-surefire-plugin:2.4.3:test
(default-test) on project maven-release-manager: There are test failures.

Please refer to C:\home\hudson\workspace\maven-release\jdk\1.5\label\windows\trunk\maven-release-manager\target\surefire-reports
for the individual test results.
	at org.apache.maven.lifecycle.DefaultLifecycleExecutor.execute(DefaultLifecycleExecutor.java:566)
	at org.apache.maven.lifecycle.DefaultLifecycleExecutor.execute(DefaultLifecycleExecutor.java:317)
	at org.apache.maven.DefaultMaven.doExecute(DefaultMaven.java:247)
	at org.apache.maven.DefaultMaven.execute(DefaultMaven.java:104)
	at org.apache.maven.cli.MavenCli.execute(MavenCli.java:423)
	at org.apache.maven.cli.MavenCli.doMain(MavenCli.java:158)
	at org.apache.maven.cli.MavenCli.main(MavenCli.java:123)
	at sun.reflect.NativeMethodAccessorImpl.invoke0(Native Method)
	at sun.reflect.NativeMethodAccessorImpl.invoke(NativeMethodAccessorImpl.java:39)
	at sun.reflect.DelegatingMethodAccessorImpl.invoke(DelegatingMethodAccessorImpl.java:25)
	at java.lang.reflect.Method.invoke(Method.java:585)
	at org.codehaus.plexus.classworlds.launcher.Launcher.launchEnhanced(Launcher.java:290)
	at org.codehaus.plexus.classworlds.launcher.Launcher.launch(Launcher.java:230)
	at org.codehaus.plexus.classworlds.launcher.Launcher.mainWithExitCode(Launcher.java:409)
	at org.codehaus.plexus.classworlds.launcher.Launcher.main(Launcher.java:352)
Caused by: org.apache.maven.plugin.MojoFailureException: There are test failures.

Please refer to C:\home\hudson\workspace\maven-release\jdk\1.5\label\windows\trunk\maven-release-manager\target\surefire-reports
for the individual test results.
	at org.apache.maven.plugin.surefire.SurefirePlugin.execute(SurefirePlugin.java:575)
	at org.apache.maven.plugin.DefaultBuildPluginManager.executeMojo(DefaultBuildPluginManager.java:105)
	at org.apache.maven.lifecycle.DefaultLifecycleExecutor.execute(DefaultLifecycleExecutor.java:562)
	... 14 more
[ERROR] 
[ERROR] Re-run Maven using the -X switch to enable full debug logging.
[ERROR] 
[ERROR] For more information about the errors and possible solutions, please read the following
articles:
[ERROR] [Help 1] http://cwiki.apache.org/confluence/display/MAVEN/MojoFailureException
[ERROR] 
[ERROR] After correcting the problems, you can resume the build with the command
[ERROR]   mvn <goals> -rf :maven-release-manager


Mime
View raw message