maven-notifications mailing list archives

Site index · List index
Message view « Date » · « Thread »
Top « Date » · « Thread »
From Hudson <Hud...@sonatype.org>
Subject Build failed in Hudson: maven-release » 1.5,ubuntu #124
Date Fri, 30 Jul 2010 14:51:56 GMT
See <http://grid.sonatype.org/ci/job/maven-release/./jdk=1.5,label=ubuntu/124/>

------------------------------------------
[...truncated 4938 lines...]
org.codehaus.plexus.PlexusContainerException: Error starting container
	at org.codehaus.plexus.DefaultPlexusContainer.start(DefaultPlexusContainer.java:795)
	at org.codehaus.plexus.PlexusTestCase.setUp(PlexusTestCase.java:121)
	at org.apache.maven.shared.release.phase.ScmCheckModificationsPhaseTest.setUp(ScmCheckModificationsPhaseTest.java:65)
	at junit.framework.TestCase.runBare(TestCase.java:128)
	at junit.framework.TestResult$1.protect(TestResult.java:106)
	at junit.framework.TestResult.runProtected(TestResult.java:124)
	at junit.framework.TestResult.run(TestResult.java:109)
	at junit.framework.TestCase.run(TestCase.java:120)
	at junit.framework.TestSuite.runTest(TestSuite.java:230)
	at junit.framework.TestSuite.run(TestSuite.java:225)
	at sun.reflect.GeneratedMethodAccessor6.invoke(Unknown Source)
	at sun.reflect.DelegatingMethodAccessorImpl.invoke(DelegatingMethodAccessorImpl.java:25)
	at java.lang.reflect.Method.invoke(Method.java:585)
	at org.apache.maven.surefire.junit.JUnitTestSet.execute(JUnitTestSet.java:213)
	at org.apache.maven.surefire.suite.AbstractDirectoryTestSuite.executeTestSet(AbstractDirectoryTestSuite.java:140)
	at org.apache.maven.surefire.suite.AbstractDirectoryTestSuite.execute(AbstractDirectoryTestSuite.java:127)
	at org.apache.maven.surefire.Surefire.run(Surefire.java:177)
	at sun.reflect.NativeMethodAccessorImpl.invoke0(Native Method)
	at sun.reflect.NativeMethodAccessorImpl.invoke(NativeMethodAccessorImpl.java:39)
	at sun.reflect.DelegatingMethodAccessorImpl.invoke(DelegatingMethodAccessorImpl.java:25)
	at java.lang.reflect.Method.invoke(Method.java:585)
	at org.apache.maven.surefire.booter.SurefireBooter.runSuitesInProcess(SurefireBooter.java:345)
	at org.apache.maven.surefire.booter.SurefireBooter.main(SurefireBooter.java:1009)
Caused by: org.codehaus.plexus.component.repository.exception.ComponentRepositoryException:
Component descriptor role: 'org.apache.maven.scm.manager.ScmManager', implementation: 'org.apache.maven.scm.manager.plexus.DefaultScmManager',
role hint: 'default' has a hint, but there are other implementations that don't
	at org.codehaus.plexus.component.repository.DefaultComponentRepository.addComponentDescriptor(DefaultComponentRepository.java:184)
	at org.codehaus.plexus.DefaultPlexusContainer.addComponentDescriptor(DefaultPlexusContainer.java:515)
	at org.codehaus.plexus.DefaultPlexusContainer.discoverComponents(DefaultPlexusContainer.java:738)
	at org.codehaus.plexus.DefaultPlexusContainer.start(DefaultPlexusContainer.java:779)
	... 22 more
Caused by: org.codehaus.plexus.component.repository.exception.ComponentRepositoryException:
Component descriptor role: 'org.apache.maven.scm.manager.ScmManager', implementation: 'org.apache.maven.scm.manager.plexus.DefaultScmManager',
role hint: 'default' has a hint, but there are other implementations that don't
	at org.codehaus.plexus.component.repository.DefaultComponentRepository.addComponentDescriptor(DefaultComponentRepository.java:184)
	at org.codehaus.plexus.DefaultPlexusContainer.addComponentDescriptor(DefaultPlexusContainer.java:515)
	at org.codehaus.plexus.DefaultPlexusContainer.discoverComponents(DefaultPlexusContainer.java:738)
	at org.codehaus.plexus.DefaultPlexusContainer.start(DefaultPlexusContainer.java:779)
	... 22 more

testModificationsToIncludedAndExcludedFiles(org.apache.maven.shared.release.phase.ScmCheckModificationsPhaseTest)
 Time elapsed: 0.03 sec  <<< ERROR!
org.codehaus.plexus.PlexusContainerException: Error starting container
	at org.codehaus.plexus.DefaultPlexusContainer.start(DefaultPlexusContainer.java:795)
	at org.codehaus.plexus.PlexusTestCase.setUp(PlexusTestCase.java:121)
	at org.apache.maven.shared.release.phase.ScmCheckModificationsPhaseTest.setUp(ScmCheckModificationsPhaseTest.java:65)
	at junit.framework.TestCase.runBare(TestCase.java:128)
	at junit.framework.TestResult$1.protect(TestResult.java:106)
	at junit.framework.TestResult.runProtected(TestResult.java:124)
	at junit.framework.TestResult.run(TestResult.java:109)
	at junit.framework.TestCase.run(TestCase.java:120)
	at junit.framework.TestSuite.runTest(TestSuite.java:230)
	at junit.framework.TestSuite.run(TestSuite.java:225)
	at sun.reflect.GeneratedMethodAccessor6.invoke(Unknown Source)
	at sun.reflect.DelegatingMethodAccessorImpl.invoke(DelegatingMethodAccessorImpl.java:25)
	at java.lang.reflect.Method.invoke(Method.java:585)
	at org.apache.maven.surefire.junit.JUnitTestSet.execute(JUnitTestSet.java:213)
	at org.apache.maven.surefire.suite.AbstractDirectoryTestSuite.executeTestSet(AbstractDirectoryTestSuite.java:140)
	at org.apache.maven.surefire.suite.AbstractDirectoryTestSuite.execute(AbstractDirectoryTestSuite.java:127)
	at org.apache.maven.surefire.Surefire.run(Surefire.java:177)
	at sun.reflect.NativeMethodAccessorImpl.invoke0(Native Method)
	at sun.reflect.NativeMethodAccessorImpl.invoke(NativeMethodAccessorImpl.java:39)
	at sun.reflect.DelegatingMethodAccessorImpl.invoke(DelegatingMethodAccessorImpl.java:25)
	at java.lang.reflect.Method.invoke(Method.java:585)
	at org.apache.maven.surefire.booter.SurefireBooter.runSuitesInProcess(SurefireBooter.java:345)
	at org.apache.maven.surefire.booter.SurefireBooter.main(SurefireBooter.java:1009)
Caused by: org.codehaus.plexus.component.repository.exception.ComponentRepositoryException:
Component descriptor role: 'org.apache.maven.scm.manager.ScmManager', implementation: 'org.apache.maven.scm.manager.plexus.DefaultScmManager',
role hint: 'default' has a hint, but there are other implementations that don't
	at org.codehaus.plexus.component.repository.DefaultComponentRepository.addComponentDescriptor(DefaultComponentRepository.java:184)
	at org.codehaus.plexus.DefaultPlexusContainer.addComponentDescriptor(DefaultPlexusContainer.java:515)
	at org.codehaus.plexus.DefaultPlexusContainer.discoverComponents(DefaultPlexusContainer.java:738)
	at org.codehaus.plexus.DefaultPlexusContainer.start(DefaultPlexusContainer.java:779)
	... 22 more
Caused by: org.codehaus.plexus.component.repository.exception.ComponentRepositoryException:
Component descriptor role: 'org.apache.maven.scm.manager.ScmManager', implementation: 'org.apache.maven.scm.manager.plexus.DefaultScmManager',
role hint: 'default' has a hint, but there are other implementations that don't
	at org.codehaus.plexus.component.repository.DefaultComponentRepository.addComponentDescriptor(DefaultComponentRepository.java:184)
	at org.codehaus.plexus.DefaultPlexusContainer.addComponentDescriptor(DefaultPlexusContainer.java:515)
	at org.codehaus.plexus.DefaultPlexusContainer.discoverComponents(DefaultPlexusContainer.java:738)
	at org.codehaus.plexus.DefaultPlexusContainer.start(DefaultPlexusContainer.java:779)
	... 22 more

Running org.apache.maven.shared.release.versions.DefaultVersionInfoTest
Tests run: 21, Failures: 0, Errors: 0, Skipped: 0, Time elapsed: 0.856 sec
Running org.apache.maven.shared.release.util.ReleaseUtilTest
Tests run: 16, Failures: 0, Errors: 0, Skipped: 0, Time elapsed: 0.564 sec
Running org.apache.maven.shared.release.phase.CreateBackupPomsPhaseTest
Tests run: 2, Failures: 0, Errors: 0, Skipped: 0, Time elapsed: 0.061 sec
Running org.apache.maven.shared.release.exec.TeeOutputStreamTest
Tests run: 1, Failures: 0, Errors: 0, Skipped: 0, Time elapsed: 0 sec
Running org.apache.maven.shared.release.phase.EndReleasePhaseTest
Tests run: 2, Failures: 0, Errors: 0, Skipped: 0, Time elapsed: 0.105 sec

Results :

Tests in error: 
  testNoSuchScmProviderExceptionThrown(org.apache.maven.shared.release.DefaultReleaseManagerTest)
  testScmRepositoryExceptionThrown(org.apache.maven.shared.release.DefaultReleaseManagerTest)
  testScmExceptionThrown(org.apache.maven.shared.release.DefaultReleaseManagerTest)
  testScmResultFailure(org.apache.maven.shared.release.DefaultReleaseManagerTest)
  testPrepareNoCompletedPhase(org.apache.maven.shared.release.DefaultReleaseManagerTest)
  testPrepareCompletedPhase(org.apache.maven.shared.release.DefaultReleaseManagerTest)
  testPrepareCompletedPhaseNoResume(org.apache.maven.shared.release.DefaultReleaseManagerTest)
  testPrepareCompletedAllPhases(org.apache.maven.shared.release.DefaultReleaseManagerTest)
  testPrepareInvalidCompletedPhase(org.apache.maven.shared.release.DefaultReleaseManagerTest)
  testPrepareSimulateNoCompletedPhase(org.apache.maven.shared.release.DefaultReleaseManagerTest)
  testPrepareSimulateCompletedPhase(org.apache.maven.shared.release.DefaultReleaseManagerTest)
  testPrepareSimulateCompletedAllPhases(org.apache.maven.shared.release.DefaultReleaseManagerTest)
  testPrepareSimulateInvalidCompletedPhase(org.apache.maven.shared.release.DefaultReleaseManagerTest)
  testPrepareUnknownPhaseConfigured(org.apache.maven.shared.release.DefaultReleaseManagerTest)
  testReleaseConfigurationStoreReadFailure(org.apache.maven.shared.release.DefaultReleaseManagerTest)
  testReleaseConfigurationStoreWriteFailure(org.apache.maven.shared.release.DefaultReleaseManagerTest)
  testReleaseConfigurationStoreClean(org.apache.maven.shared.release.DefaultReleaseManagerTest)
  testReleasePerform(org.apache.maven.shared.release.DefaultReleaseManagerTest)
  testReleasePerformWithResult(org.apache.maven.shared.release.DefaultReleaseManagerTest)
  testReleasePerformNoReleaseProfile(org.apache.maven.shared.release.DefaultReleaseManagerTest)
  testReleasePerformWithArguments(org.apache.maven.shared.release.DefaultReleaseManagerTest)
  testReleasePerformWithArgumentsNoReleaseProfile(org.apache.maven.shared.release.DefaultReleaseManagerTest)
  testReleasePerformWithReleasePropertiesCompleted(org.apache.maven.shared.release.DefaultReleaseManagerTest)
  testReleaseConfigurationStoreReadFailureOnPerform(org.apache.maven.shared.release.DefaultReleaseManagerTest)
  testReleasePerformWithIncompletePrepare(org.apache.maven.shared.release.DefaultReleaseManagerTest)
  testNoScmUrlPerform(org.apache.maven.shared.release.DefaultReleaseManagerTest)
  testDetermineWorkingDirectory(org.apache.maven.shared.release.DefaultReleaseManagerTest)
  testExecuteStandard(org.apache.maven.shared.release.phase.CheckoutProjectFromScmTest)
  testExecuteMultiModuleWithDeepSubprojects(org.apache.maven.shared.release.phase.CheckoutProjectFromScmTest)
  testExecuteFlatMultiModule(org.apache.maven.shared.release.phase.CheckoutProjectFromScmTest)
  testExecuteBasicPom(org.apache.maven.shared.release.phase.RemoveReleasePomsPhaseTest)
  testExecutePomWithModules(org.apache.maven.shared.release.phase.RemoveReleasePomsPhaseTest)
  testSimulateBasicPom(org.apache.maven.shared.release.phase.RemoveReleasePomsPhaseTest)
  testCommitMultiModule(org.apache.maven.shared.release.phase.ScmCommitPhaseTest)
  testNoSuchScmProviderExceptionThrown(org.apache.maven.shared.release.phase.ScmCommitPhaseTest)
  testScmRepositoryExceptionThrown(org.apache.maven.shared.release.phase.ScmCommitPhaseTest)
  testScmExceptionThrown(org.apache.maven.shared.release.phase.ScmCommitPhaseTest)
  testScmResultFailure(org.apache.maven.shared.release.phase.ScmCommitPhaseTest)
  testCommit(org.apache.maven.shared.release.phase.ScmCommitPhaseTest)
  testCommitDevelopment(org.apache.maven.shared.release.phase.ScmCommitPhaseTest)
  testCommitNoReleaseLabel(org.apache.maven.shared.release.phase.ScmCommitPhaseTest)
  testCommitGenerateReleasePoms(org.apache.maven.shared.release.phase.ScmCommitPhaseTest)
  testSimulateCommit(org.apache.maven.shared.release.phase.ScmCommitPhaseTest)
  testSimulateCommitNoReleaseLabel(org.apache.maven.shared.release.phase.ScmCommitPhaseTest)
  testTag(org.apache.maven.shared.release.phase.ScmTagPhaseTest)
  testCommitMultiModuleDeepFolders(org.apache.maven.shared.release.phase.ScmTagPhaseTest)
  testCommitForFlatMultiModule(org.apache.maven.shared.release.phase.ScmTagPhaseTest)
  testCommitMultiModule(org.apache.maven.shared.release.phase.ScmTagPhaseTest)
  testTagNoReleaseLabel(org.apache.maven.shared.release.phase.ScmTagPhaseTest)
  testSimulateTag(org.apache.maven.shared.release.phase.ScmTagPhaseTest)
  testSimulateTagNoReleaseLabel(org.apache.maven.shared.release.phase.ScmTagPhaseTest)
  testNoSuchScmProviderExceptionThrown(org.apache.maven.shared.release.phase.ScmTagPhaseTest)
  testScmRepositoryExceptionThrown(org.apache.maven.shared.release.phase.ScmTagPhaseTest)
  testScmExceptionThrown(org.apache.maven.shared.release.phase.ScmTagPhaseTest)
  testScmResultFailure(org.apache.maven.shared.release.phase.ScmTagPhaseTest)
  testRewriteExternalRangeDependency(org.apache.maven.shared.release.phase.GenerateReleasePomsPhaseTest)
  testRewriteBasicPom(org.apache.maven.shared.release.phase.GenerateReleasePomsPhaseTest)
  testRewriteBasicPomEntities(org.apache.maven.shared.release.phase.GenerateReleasePomsPhaseTest)
  testRewriteBasicPomNamespace(org.apache.maven.shared.release.phase.GenerateReleasePomsPhaseTest)
  testRewriteBasicPomWithEncoding(org.apache.maven.shared.release.phase.GenerateReleasePomsPhaseTest)
  testRewritePomWithParent(org.apache.maven.shared.release.phase.GenerateReleasePomsPhaseTest)
  testRewritePomWithUnmappedParent(org.apache.maven.shared.release.phase.GenerateReleasePomsPhaseTest)
  testRewritePomWithReleasedParent(org.apache.maven.shared.release.phase.GenerateReleasePomsPhaseTest)
  testRewritePomWithInheritedVersion(org.apache.maven.shared.release.phase.GenerateReleasePomsPhaseTest)
  testRewritePomWithChangedInheritedVersion(org.apache.maven.shared.release.phase.GenerateReleasePomsPhaseTest)
  testRewritePomDependencies(org.apache.maven.shared.release.phase.GenerateReleasePomsPhaseTest)
  testRewritePomUnmappedDependencies(org.apache.maven.shared.release.phase.GenerateReleasePomsPhaseTest)
  testRewritePomDependenciesDifferentVersion(org.apache.maven.shared.release.phase.GenerateReleasePomsPhaseTest)
  testRewriteManagedPomDependencies(org.apache.maven.shared.release.phase.GenerateReleasePomsPhaseTest)
  testRewriteManagedPomUnmappedDependencies(org.apache.maven.shared.release.phase.GenerateReleasePomsPhaseTest)
  testRewritePomPlugins(org.apache.maven.shared.release.phase.GenerateReleasePomsPhaseTest)
  testRewritePomUnmappedPlugins(org.apache.maven.shared.release.phase.GenerateReleasePomsPhaseTest)
  testRewritePomPluginsDifferentVersion(org.apache.maven.shared.release.phase.GenerateReleasePomsPhaseTest)
  testRewriteManagedPomPlugins(org.apache.maven.shared.release.phase.GenerateReleasePomsPhaseTest)
  testRewriteManagedPomUnmappedPlugins(org.apache.maven.shared.release.phase.GenerateReleasePomsPhaseTest)
  testRewritePomReportPlugins(org.apache.maven.shared.release.phase.GenerateReleasePomsPhaseTest)
  testRewritePomUnmappedReportPlugins(org.apache.maven.shared.release.phase.GenerateReleasePomsPhaseTest)
  testRewritePomReportPluginsDifferentVersion(org.apache.maven.shared.release.phase.GenerateReleasePomsPhaseTest)
  testRewritePomExtension(org.apache.maven.shared.release.phase.GenerateReleasePomsPhaseTest)
  testRewritePomUnmappedExtension(org.apache.maven.shared.release.phase.GenerateReleasePomsPhaseTest)
  testRewritePomExtensionDifferentVersion(org.apache.maven.shared.release.phase.GenerateReleasePomsPhaseTest)
  testRewritePomExtensionUndefinedVersion(org.apache.maven.shared.release.phase.GenerateReleasePomsPhaseTest)
  testRewriteAddSchema(org.apache.maven.shared.release.phase.GenerateReleasePomsPhaseTest)
  testSimulateRewriteEditModeSkipped(org.apache.maven.shared.release.phase.GenerateReleasePomsPhaseTest)
  testRewriteUnmappedPom(org.apache.maven.shared.release.phase.GenerateReleasePomsPhaseTest)
  testRewriteBasicPomWithScmRepoException(org.apache.maven.shared.release.phase.GenerateReleasePomsPhaseTest)
  testRewriteBasicPomWithNoSuchProviderException(org.apache.maven.shared.release.phase.GenerateReleasePomsPhaseTest)
  testRewriteWhitespaceAroundValues(org.apache.maven.shared.release.phase.GenerateReleasePomsPhaseTest)
  testRewriteCommentsAroundValues(org.apache.maven.shared.release.phase.GenerateReleasePomsPhaseTest)
  testRewriteCDataAroundValues(org.apache.maven.shared.release.phase.GenerateReleasePomsPhaseTest)
  testCleanNoProjects(org.apache.maven.shared.release.phase.GenerateReleasePomsPhaseTest)
  testRewritePomDependenciesWithNamespace(org.apache.maven.shared.release.phase.GenerateReleasePomsPhaseTest)
  testNoSuchScmProviderExceptionThrown(org.apache.maven.shared.release.phase.ScmCheckModificationsPhaseTest)
  testScmRepositoryExceptionThrown(org.apache.maven.shared.release.phase.ScmCheckModificationsPhaseTest)
  testScmExceptionThrown(org.apache.maven.shared.release.phase.ScmCheckModificationsPhaseTest)
  testScmResultFailure(org.apache.maven.shared.release.phase.ScmCheckModificationsPhaseTest)
  testNoModifications(org.apache.maven.shared.release.phase.ScmCheckModificationsPhaseTest)
  testModificationsToExcludedFilesOnly(org.apache.maven.shared.release.phase.ScmCheckModificationsPhaseTest)
  testModificationsToPoms(org.apache.maven.shared.release.phase.ScmCheckModificationsPhaseTest)
  testModificationsToIncludedFilesOnly(org.apache.maven.shared.release.phase.ScmCheckModificationsPhaseTest)
  testModificationsToIncludedAndExcludedFiles(org.apache.maven.shared.release.phase.ScmCheckModificationsPhaseTest)

Tests run: 345, Failures: 0, Errors: 101, Skipped: 0

[INFO] ------------------------------------------------------------------------
[INFO] SKIPPING Maven Release Plugin
[INFO]    task-segment: [clean, install]
[INFO] This project has been banned from further executions due to previous failures.
[INFO] ------------------------------------------------------------------------
[INFO] 
[INFO] 
[INFO] ------------------------------------------------------------------------
[INFO] Reactor Summary:
[INFO] ------------------------------------------------------------------------
[INFO] Maven Release ......................................... SUCCESS [1:14.434s]
[INFO] Maven Release Manager ................................. FAILED [2:15.444s]
[INFO] Maven Release Plugin .................................. SKIPPED (dependency build failed
or was skipped)
[INFO] ------------------------------------------------------------------------
[INFO] Error for project: Maven Release Manager (during install)
[INFO] ------------------------------------------------------------------------
[INFO] There are test failures.

Please refer to <http://grid.sonatype.org/ci/job/maven-release/./jdk=1.5,label=ubuntu/ws/trunk/maven-release-manager/target/surefire-reports>
for the individual test results.
[INFO] ------------------------------------------------------------------------
[INFO] Trace
org.apache.maven.BuildFailureException: There are test failures.

Please refer to <http://grid.sonatype.org/ci/job/maven-release/./jdk=1.5,label=ubuntu/ws/trunk/maven-release-manager/target/surefire-reports>
for the individual test results.
	at org.apache.maven.lifecycle.DefaultLifecycleExecutor.executeGoals(DefaultLifecycleExecutor.java:715)
	at org.apache.maven.lifecycle.DefaultLifecycleExecutor.executeGoalWithLifecycle(DefaultLifecycleExecutor.java:556)
	at org.apache.maven.lifecycle.DefaultLifecycleExecutor.executeGoal(DefaultLifecycleExecutor.java:535)
	at org.apache.maven.lifecycle.DefaultLifecycleExecutor.executeGoalAndHandleFailures(DefaultLifecycleExecutor.java:387)
	at org.apache.maven.lifecycle.DefaultLifecycleExecutor.executeTaskSegments(DefaultLifecycleExecutor.java:348)
	at org.apache.maven.lifecycle.DefaultLifecycleExecutor.execute(DefaultLifecycleExecutor.java:180)
	at org.apache.maven.DefaultMaven.doExecute(DefaultMaven.java:328)
	at org.apache.maven.DefaultMaven.execute(DefaultMaven.java:138)
	at org.apache.maven.cli.MavenCli.main(MavenCli.java:362)
	at org.apache.maven.cli.compat.CompatibleMain.main(CompatibleMain.java:60)
	at sun.reflect.NativeMethodAccessorImpl.invoke0(Native Method)
	at sun.reflect.NativeMethodAccessorImpl.invoke(NativeMethodAccessorImpl.java:39)
	at sun.reflect.DelegatingMethodAccessorImpl.invoke(DelegatingMethodAccessorImpl.java:25)
	at java.lang.reflect.Method.invoke(Method.java:585)
	at org.codehaus.classworlds.Launcher.launchEnhanced(Launcher.java:315)
	at org.codehaus.classworlds.Launcher.launch(Launcher.java:255)
	at org.codehaus.classworlds.Launcher.mainWithExitCode(Launcher.java:430)
	at org.codehaus.classworlds.Launcher.main(Launcher.java:375)
Caused by: org.apache.maven.plugin.MojoFailureException: There are test failures.

Please refer to <http://grid.sonatype.org/ci/job/maven-release/./jdk=1.5,label=ubuntu/ws/trunk/maven-release-manager/target/surefire-reports>
for the individual test results.
	at org.apache.maven.plugin.surefire.SurefirePlugin.execute(SurefirePlugin.java:575)
	at org.apache.maven.plugin.DefaultPluginManager.executeMojo(DefaultPluginManager.java:490)
	at org.apache.maven.lifecycle.DefaultLifecycleExecutor.executeGoals(DefaultLifecycleExecutor.java:694)
	... 17 more
[INFO] ------------------------------------------------------------------------
[INFO] BUILD ERRORS
[INFO] ------------------------------------------------------------------------
[INFO] Total time: 3 minutes 36 seconds
[INFO] Finished at: Fri Jul 30 08:55:56 GMT-06:00 2010
[INFO] Final Memory: 34M/87M
[INFO] ------------------------------------------------------------------------


Mime
View raw message