maven-notifications mailing list archives

Site index · List index
Message view « Date » · « Thread »
Top « Date » · « Thread »
From Hudson <Hud...@sonatype.org>
Subject Build failed in Hudson: Maven-Assembly-Plugin-with-ITs » 1.5,windows #58
Date Mon, 03 May 2010 10:03:45 GMT
See <http://grid.sonatype.org/ci/job/Maven-Assembly-Plugin-with-ITs/./jdk=1.5,label=windows/58/>

------------------------------------------
[...truncated 2712 lines...]
[INFO] Downloading: http://repository.sonatype.org:8081/content/groups/sonatype-public-grid/org/apache/maven/doxia/doxia-site-renderer/1.0-alpha-11/doxia-site-renderer-1.0-alpha-11.jar
[INFO] Downloading: http://repository.sonatype.org:8081/content/groups/sonatype-public-grid/org/mortbay/jetty/servlet-api-2.5/6.1.5/servlet-api-2.5-6.1.5.jar
[INFO] 7K downloaded  (plexus-velocity-1.1.7.jar)
[INFO] 44K downloaded  (doxia-site-renderer-1.0-alpha-11.jar)
[INFO] Downloading: http://repository.sonatype.org:8081/content/groups/sonatype-public-grid/org/codehaus/plexus/plexus-archiver/1.0-alpha-7/plexus-archiver-1.0-alpha-7.jar
[INFO] 129K downloaded  (servlet-api-2.5-6.1.5.jar)
[INFO] Downloading: http://repository.sonatype.org:8081/content/groups/sonatype-public-grid/org/apache/maven/doxia/doxia-module-apt/1.0-alpha-11/doxia-module-apt-1.0-alpha-11.jar
[INFO] 138K downloaded  (plexus-archiver-1.0-alpha-7.jar)
[INFO] 45K downloaded  (doxia-module-apt-1.0-alpha-11.jar)
[INFO] Downloading: http://repository.sonatype.org:8081/content/groups/sonatype-public-grid/org/apache/maven/doxia/doxia-module-fml/1.0-alpha-11/doxia-module-fml-1.0-alpha-11.jar
[INFO] 17K downloaded  (doxia-module-fml-1.0-alpha-11.jar)
[INFO] Downloading: http://repository.sonatype.org:8081/content/groups/sonatype-public-grid/org/apache/maven/doxia/doxia-module-xdoc/1.0-alpha-11/doxia-module-xdoc-1.0-alpha-11.jar
[INFO] 26K downloaded  (doxia-module-xdoc-1.0-alpha-11.jar)
[INFO] [INFO] [site:attach-descriptor {execution: default-attach-descriptor}]
[INFO] Downloading: http://repository.sonatype.org:8081/content/groups/sonatype-public-grid/org/codehaus/plexus/plexus-digest/1.0/plexus-digest-1.0.pom
[INFO] 1K downloaded  (plexus-digest-1.0.pom)
[INFO] Downloading: http://repository.sonatype.org:8081/content/groups/sonatype-public-grid/org/codehaus/plexus/plexus-components/1.1.7/plexus-components-1.1.7.pom
[INFO] 4K downloaded  (plexus-components-1.1.7.pom)
[INFO] Downloading: http://repository.sonatype.org:8081/content/groups/sonatype-public-grid/org/codehaus/plexus/plexus-utils/1.1/plexus-utils-1.1.jar
[INFO] 164K downloaded  (plexus-utils-1.1.jar)
[INFO] Downloading: http://repository.sonatype.org:8081/content/groups/sonatype-public-grid/org/codehaus/plexus/plexus-digest/1.0/plexus-digest-1.0.jar
[INFO] 11K downloaded  (plexus-digest-1.0.jar)
[INFO] [INFO] [install:install {execution: default-install}]
[INFO] [INFO] Installing C:\tmp\assembly-ITs\it-project-parent\pom.xml to C:\home\hudson\workspace\Maven-Assembly-Plugin-with-ITs\jdk\1.5\label\windows\maven-assembly-plugin\target\local-repository\org\apache\maven\plugin\assembly\test\it-project-parent\1\it-project-parent-1.pom
[INFO] [INFO] ------------------------------------------------------------------------
[INFO] [INFO] BUILD SUCCESSFUL
[INFO] [INFO] ------------------------------------------------------------------------
[INFO] [INFO] Total time: 21 seconds
[INFO] [INFO] Finished at: Mon May 03 02:53:08 PDT 2010
[INFO] [INFO] Final Memory: 14M/25M
[INFO] [INFO] ------------------------------------------------------------------------
[INFO] [invoker:run {execution: integration-test}]
[INFO] Building: basic-features\classpath-descriptor\pom.xml
[INFO] ...SUCCESS.
[INFO] Building: basic-features\descriptorDirectoryScan\pom.xml
[INFO] ...SUCCESS.
[INFO] Building: basic-features\ExecutionRoot\pom.xml
[INFO] ...SUCCESS.
[INFO] Building: basic-features\file-copyIntoTopDir\pom.xml
[INFO] ...SUCCESS.
[INFO] Building: basic-features\file-sameName\pom.xml
[INFO] ...SUCCESS.
[INFO] Building: basic-features\massembly-256-pomPropertiesInterp\pom.xml
[INFO] ...SUCCESS.
[INFO] Building: basic-features\massembly-351-projectPrefixInterp\pom.xml
[INFO] ...SUCCESS.
[INFO] Building: basic-features\outputFileNameMapping-simple\pom.xml
[INFO] ...SUCCESS.
[INFO] Building: basic-features\outputFileNameMapping-withArtifactBaseVersion\pom.xml
[INFO] ...SUCCESS.
[INFO] Building: basic-features\relative-project-paths\pom.xml
[INFO] ...SUCCESS.
[INFO] Building: bugs\massembly-190\pom.xml
[INFO] ...SUCCESS.
[INFO] Building: bugs\massembly-285\pom.xml
[INFO] ...SUCCESS.
[INFO] Building: bugs\massembly-306\pom.xml
[INFO] ...FAILED. The build exited with code 1. See C:\tmp\assembly-ITs\projects\bugs\massembly-306\build.log
for details.
[INFO] Building: bugs\massembly-375\pom.xml
[INFO] ...SUCCESS.
[INFO] Building: container-descriptors\configured-handler\pom.xml
[INFO] ...SUCCESS.
[INFO] Building: container-descriptors\custom-containerDescriptorHandler\pom.xml
[INFO] ...SUCCESS.
[INFO] Building: container-descriptors\custom-handler-withFileEntries\pom.xml
[INFO] ...SUCCESS.
[INFO] Building: container-descriptors\custom-handler-withMixedEntries\pom.xml
[INFO] ...SUCCESS.
[INFO] Building: dependency-sets\dep-with-transitive-filter\pom.xml
[INFO] ...SUCCESS.
[INFO] Building: dependency-sets\dependencySet-matchScope\pom.xml
[INFO] ...SUCCESS.
[INFO] Building: dependency-sets\dependencySet-nonTransitive\pom.xml
[INFO] ...SUCCESS.
[INFO] Building: dependency-sets\dependencySet-notUnpacked\pom.xml
[INFO] ...SUCCESS.
[INFO] Building: dependency-sets\dependencySet-projectArtifactNotIncluded\pom.xml
[INFO] ...SUCCESS.
[INFO] Building: dependency-sets\dependencySet-unpacked\pom.xml
[INFO] ...SUCCESS.
[INFO] Building: dependency-sets\dependencySet-unpackedExcludingMetaInf\pom.xml
[INFO] ...SUCCESS.
[INFO] Building: dependency-sets\dependencySet-unpackedSubsetsTwice\pom.xml
[INFO] ...SUCCESS.
[INFO] Building: dependency-sets\dependencySet-withExecutedProject\pom.xml
[INFO] ...SUCCESS.
[INFO] Building: dependency-sets\include-project-artifact\pom.xml
[INFO] ...SUCCESS.
[INFO] Building: dependency-sets\include-project-attachments\pom.xml
[INFO] ...SUCCESS.
[INFO] Building: dependency-sets\include-provided\pom.xml
[INFO] ...SUCCESS.
[INFO] Building: dependency-sets\including-pom-dependency\pom.xml
[INFO] ...SUCCESS.
[INFO] Building: dependency-sets\including-sar-dependency\pom.xml
[INFO] ...SUCCESS.
[INFO] Building: dependency-sets\massembly-201\pom.xml
[INFO] ...SUCCESS.
[INFO] Building: dependency-sets\massembly-232\pom.xml
[INFO] ...SUCCESS.
[INFO] Building: dependency-sets\massembly-235\pom.xml
[INFO] ...SUCCESS.
[INFO] Building: dependency-sets\massembly-345\pom.xml
[INFO] ...SUCCESS.
[INFO] Building: dependency-sets\massembly-99\pom.xml
[INFO] ...SUCCESS.
[INFO] Building: dependency-sets\multiple-wildcard-includes\pom.xml
[INFO] ...SUCCESS.
[INFO] Building: dependency-sets\outputFileNameMappingWithUnpack\pom.xml
[INFO] ...SUCCESS.
[INFO] Building: dependency-sets\using-moduleSet-implied-depSet\pom.xml
[INFO] ...SUCCESS.
[INFO] Building: descriptor-refs\bin\jars-in-archive-root\pom.xml
[INFO] ...SUCCESS.
[INFO] Building: descriptor-refs\jar-with-dependencies\component-descriptors-merged\pom.xml
[INFO] ...SUCCESS.
[INFO] Building: descriptor-refs\jar-with-dependencies\deps-unpacked-to-root-dir\pom.xml
[INFO] ...SUCCESS.
[INFO] Building: descriptor-refs\jar-with-dependencies\no-target-dir\pom.xml
[INFO] ...SUCCESS.
[INFO] Building: descriptor-refs\project\multimodule-sources-copied\pom.xml
[INFO] ...SUCCESS.
[INFO] Building: descriptor-refs\project\no-target-dir\pom.xml
[INFO] ...SUCCESS.
[INFO] Building: descriptor-refs\project\no-target-dir-multimodule\pom.xml
[INFO] ...SUCCESS.
[INFO] Building: descriptor-refs\project\sources-copied\pom.xml
[INFO] ...SUCCESS.
[INFO] Building: descriptor-refs\src\no-target-dir\pom.xml
[INFO] ...SUCCESS.
[INFO] Building: descriptor-refs\src\src-dir-copied\pom.xml
[INFO] ...SUCCESS.
[INFO] Building: file-modes\file-set-fileMode\pom.xml
[INFO] ...SUCCESS.
[INFO] Building: file-modes\fileItem-fileMode\pom.xml
[INFO] ...SUCCESS.
[INFO] Building: file-sets\default-directory-unspecified\pom.xml
[INFO] ...SUCCESS.
[INFO] Building: file-sets\default-excludes-unspecified\pom.xml
[INFO] ...SUCCESS.
[INFO] Building: file-sets\dont-use-default-excludes\pom.xml
[INFO] ...SUCCESS.
[INFO] Building: file-sets\excludes-using-regex\pom.xml
[INFO] ...SUCCESS.
[INFO] Building: file-sets\excluding-svn-dirs\pom.xml
[INFO] ...SUCCESS.
[INFO] Building: file-sets\filtered-module-sources\pom.xml
[INFO] ...SUCCESS.
[INFO] Building: file-sets\filtered-multimodule\pom.xml
[INFO] ...SUCCESS.
[INFO] Building: file-sets\include-base-directory\pom.xml
[INFO] ...SUCCESS.
[INFO] Building: file-sets\include-parent-dir\pom.xml
[INFO] ...SUCCESS.
[INFO] Building: file-sets\multimodule-unix-lineEndings\pom.xml
[INFO] ...SUCCESS.
[INFO] Building: file-sets\multimodule-win-lineEndings\pom.xml
[INFO] ...SUCCESS.
[INFO] Building: file-sets\use-default-excludes\pom.xml
[INFO] ...SUCCESS.
[INFO] Building: filtering-feature\filtersDefinedInAssemblyPluginConfig\pom.xml
[INFO] ...SUCCESS.
[INFO] Building: forking-tests\assembly-assembly-with-module-binaries\pom.xml
[INFO] ...SUCCESS.
[INFO] Building: forking-tests\assembly-attached-with-module-binaries\pom.xml
[INFO] ...SUCCESS.
[INFO] Building: mojo-configuration\ignoreDirFormatExtensions\pom.xml
[INFO] ...SUCCESS.
[INFO] Building: mojo-configuration\manifest-with-customEntry\pom.xml
[INFO] ...SUCCESS.
[INFO] Building: mojo-configuration\manifest-with-mainClass\pom.xml
[INFO] ...SUCCESS.
[INFO] Building: mojo-configuration\massembly-291\pom.xml
[INFO] ...SUCCESS.
[INFO] Building: mojo-configuration\massembly-301\pom.xml
[INFO] ...SUCCESS.
[INFO] Building: mojo-configuration\no-appendAssemblyId-no-classifier\pom.xml
[INFO] ...SUCCESS.
[INFO] Building: mojo-configuration\skipAssemblyCLIPropertySet\pom.xml
[INFO] ...SUCCESS.
[INFO] Building: mojo-tests\single-in-one-project-hierarchy\pom.xml
[INFO] ...SUCCESS.
[INFO] Building: mojo-tests\single-twice-in-multimodule-hierarchy\pom.xml
[INFO] ...SUCCESS.
[INFO] Building: mojo-tests\single-twice-in-one-project-hierarchy\pom.xml
[INFO] ...SUCCESS.
[INFO] Building: multimodule\massembly-298\pom.xml
[INFO] ...SUCCESS.
[INFO] Building: multimodule\two-level-multimodule\pom.xml
[INFO] ...SUCCESS.
[INFO] Building: multimodule\two-level-multimodule-dontIncludeSubModules\pom.xml
[INFO] ...SUCCESS.
[INFO] Building: multimodule\two-levels-includeBaseDir-withBin\pom.xml
[INFO] ...SUCCESS.
[INFO] Building: multimodule\two-levels-includeBaseDir-withSrc\pom.xml
[INFO] ...SUCCESS.
[INFO] Building: multimodule\twoLevel-dontIncludeSubModules-artifactIdExprOutDir\pom.xml
[INFO] ...SUCCESS.
[INFO] Building: multimodule\twoLevel-includeSubModules-excludeSubModuleSourceDirs\pom.xml
[INFO] ...SUCCESS.
[INFO] Building: repositories\basic-repository\pom.xml
[INFO] ...SUCCESS.
[INFO] Building: repositories\massembly-196\pom.xml
[INFO] ...SUCCESS.
[INFO] ---------------------------------------
[INFO] Execution Summary:
[INFO]   Builds Passing: 85
[INFO]   Builds Failing: 1
[INFO] ---------------------------------------
[ERROR] The following builds failed:
[ERROR] *  bugs\massembly-306\pom.xml
[INFO] ---------------------------------------
[INFO] Error for project: Maven Assembly Plugin (during install)
[INFO] ------------------------------------------------------------------------
[INFO] : org.apache.maven.plugin.invoker.InvokerMojo@bfa709
1 build failed.
[INFO] ------------------------------------------------------------------------
[INFO] Trace
org.apache.maven.BuildFailureException: 1 build failed.
	at org.apache.maven.lifecycle.DefaultLifecycleExecutor.executeGoals(DefaultLifecycleExecutor.java:715)
	at org.apache.maven.lifecycle.DefaultLifecycleExecutor.executeGoalWithLifecycle(DefaultLifecycleExecutor.java:556)
	at org.apache.maven.lifecycle.DefaultLifecycleExecutor.executeGoal(DefaultLifecycleExecutor.java:535)
	at org.apache.maven.lifecycle.DefaultLifecycleExecutor.executeGoalAndHandleFailures(DefaultLifecycleExecutor.java:387)
	at org.apache.maven.lifecycle.DefaultLifecycleExecutor.executeTaskSegments(DefaultLifecycleExecutor.java:348)
	at org.apache.maven.lifecycle.DefaultLifecycleExecutor.execute(DefaultLifecycleExecutor.java:180)
	at org.apache.maven.DefaultMaven.doExecute(DefaultMaven.java:328)
	at org.apache.maven.DefaultMaven.execute(DefaultMaven.java:138)
	at org.apache.maven.cli.MavenCli.main(MavenCli.java:362)
	at org.apache.maven.cli.compat.CompatibleMain.main(CompatibleMain.java:60)
	at sun.reflect.NativeMethodAccessorImpl.invoke0(Native Method)
	at sun.reflect.NativeMethodAccessorImpl.invoke(NativeMethodAccessorImpl.java:39)
	at sun.reflect.DelegatingMethodAccessorImpl.invoke(DelegatingMethodAccessorImpl.java:25)
	at java.lang.reflect.Method.invoke(Method.java:585)
	at org.codehaus.classworlds.Launcher.launchEnhanced(Launcher.java:315)
	at org.codehaus.classworlds.Launcher.launch(Launcher.java:255)
	at org.codehaus.classworlds.Launcher.mainWithExitCode(Launcher.java:430)
	at org.codehaus.classworlds.Launcher.main(Launcher.java:375)
Caused by: org.apache.maven.plugin.MojoFailureException: 1 build failed.
	at org.apache.maven.plugin.invoker.InvokerMojo.execute(InvokerMojo.java:603)
	at org.apache.maven.plugin.DefaultPluginManager.executeMojo(DefaultPluginManager.java:490)
	at org.apache.maven.lifecycle.DefaultLifecycleExecutor.executeGoals(DefaultLifecycleExecutor.java:694)
	... 17 more
[INFO] ------------------------------------------------------------------------
[INFO] BUILD ERRORS
[INFO] ------------------------------------------------------------------------
[INFO] Total time: 11 minutes 34 seconds
[INFO] Finished at: Mon May 03 03:03:44 PDT 2010
[INFO] Final Memory: 34M/63M
[INFO] ------------------------------------------------------------------------


Mime
View raw message