maven-notifications mailing list archives

Site index · List index
Message view « Date » · « Thread »
Top « Date » · « Thread »
From Hudson <Hud...@sonatype.org>
Subject Build failed in Hudson: surefire » 1.5,windows #62
Date Mon, 17 May 2010 14:45:29 GMT
See <http://grid.sonatype.org/ci/job/surefire/./jdk=1.5,label=windows/62/changes>

Changes:

[stephenc] [SUREFIRE-592] More refactoring and hopefully fix build on sonatype grid

------------------------------------------
[...truncated 828 lines...]
[INFO] --- maven-compiler-plugin:2.0.2:testCompile (default-testCompile) @ surefire-integration-tests
---
[INFO] Compiling 53 source files to C:\home\hudson\workspace\surefire\jdk\1.5\label\windows\trunk\surefire-integration-tests\target\test-classes
[INFO] 
[INFO] --- maven-surefire-plugin:2.5:test (default-test) @ surefire-integration-tests ---
[INFO] Surefire report directory: C:\home\hudson\workspace\surefire\jdk\1.5\label\windows\trunk\surefire-integration-tests\target\surefire-reports

-------------------------------------------------------
 T E S T S
-------------------------------------------------------
Running org.apache.maven.surefire.its.SetUpForIntegrationTest
Tests run: 1, Failures: 0, Errors: 0, Skipped: 0, Time elapsed: 0.077 sec

Results :

Tests run: 1, Failures: 0, Errors: 0, Skipped: 0

[INFO] 
[INFO] --- maven-jar-plugin:2.2:jar (default-jar) @ surefire-integration-tests ---
[INFO] Building jar: C:\home\hudson\workspace\surefire\jdk\1.5\label\windows\trunk\surefire-integration-tests\target\surefire-integration-tests-2.6-SNAPSHOT.jar
[INFO] 
[INFO] --- maven-invoker-plugin:1.5:install (default) @ surefire-integration-tests ---
[INFO] Installing C:\home\hudson\workspace\surefire\jdk\1.5\label\windows\trunk\maven-surefire-report-plugin\pom.xml
to C:\opt\repos\surefire\jdk=1.5,label=windows\org\apache\maven\plugins\maven-surefire-report-plugin\2.6-SNAPSHOT\maven-surefire-report-plugin-2.6-SNAPSHOT.pom
[INFO] Installing C:\home\hudson\workspace\surefire\jdk\1.5\label\windows\trunk\maven-surefire-report-plugin\target\maven-surefire-report-plugin-2.6-SNAPSHOT.jar
to C:\opt\repos\surefire\jdk=1.5,label=windows\org\apache\maven\plugins\maven-surefire-report-plugin\2.6-SNAPSHOT\maven-surefire-report-plugin-2.6-20100517.143752-2.jar
[INFO] Installing C:\home\hudson\workspace\surefire\jdk\1.5\label\windows\trunk\pom.xml to
C:\opt\repos\surefire\jdk=1.5,label=windows\org\apache\maven\surefire\surefire\2.6-SNAPSHOT\surefire-2.6-SNAPSHOT.pom
[INFO] Installing C:\home\hudson\workspace\surefire\jdk\1.5\label\windows\trunk\maven-surefire-plugin\pom.xml
to C:\opt\repos\surefire\jdk=1.5,label=windows\org\apache\maven\plugins\maven-surefire-plugin\2.6-SNAPSHOT\maven-surefire-plugin-2.6-SNAPSHOT.pom
[INFO] Installing C:\home\hudson\workspace\surefire\jdk\1.5\label\windows\trunk\maven-surefire-plugin\target\maven-surefire-plugin-2.6-SNAPSHOT.jar
to C:\opt\repos\surefire\jdk=1.5,label=windows\org\apache\maven\plugins\maven-surefire-plugin\2.6-SNAPSHOT\maven-surefire-plugin-2.6-20100517.143752-2.jar
[INFO] Installing C:\home\hudson\workspace\surefire\jdk\1.5\label\windows\trunk\surefire-booter\target\dependency-reduced-pom.xml
to C:\opt\repos\surefire\jdk=1.5,label=windows\org\apache\maven\surefire\surefire-booter\2.6-SNAPSHOT\surefire-booter-2.6-SNAPSHOT.pom
[INFO] Installing C:\home\hudson\workspace\surefire\jdk\1.5\label\windows\trunk\surefire-booter\target\surefire-booter-2.6-SNAPSHOT.jar
to C:\opt\repos\surefire\jdk=1.5,label=windows\org\apache\maven\surefire\surefire-booter\2.6-SNAPSHOT\surefire-booter-2.6-20100517.143752-2.jar
[INFO] Installing C:\home\hudson\workspace\surefire\jdk\1.5\label\windows\trunk\surefire-api\target\dependency-reduced-pom.xml
to C:\opt\repos\surefire\jdk=1.5,label=windows\org\apache\maven\surefire\surefire-api\2.6-SNAPSHOT\surefire-api-2.6-SNAPSHOT.pom
[INFO] Installing C:\home\hudson\workspace\surefire\jdk\1.5\label\windows\trunk\surefire-api\target\surefire-api-2.6-SNAPSHOT.jar
to C:\opt\repos\surefire\jdk=1.5,label=windows\org\apache\maven\surefire\surefire-api\2.6-SNAPSHOT\surefire-api-2.6-20100517.143752-2.jar
[INFO] Installing C:\home\hudson\workspace\surefire\jdk\1.5\label\windows\trunk\maven-surefire-common\pom.xml
to C:\opt\repos\surefire\jdk=1.5,label=windows\org\apache\maven\surefire\maven-surefire-common\2.6-SNAPSHOT\maven-surefire-common-2.6-SNAPSHOT.pom
[INFO] Installing C:\home\hudson\workspace\surefire\jdk\1.5\label\windows\trunk\maven-surefire-common\target\maven-surefire-common-2.6-SNAPSHOT.jar
to C:\opt\repos\surefire\jdk=1.5,label=windows\org\apache\maven\surefire\maven-surefire-common\2.6-SNAPSHOT\maven-surefire-common-2.6-20100517.143752-2.jar
[INFO] Installing C:\home\hudson\workspace\surefire\jdk\1.5\label\windows\trunk\surefire-providers\surefire-testng\pom.xml
to C:\opt\repos\surefire\jdk=1.5,label=windows\org\apache\maven\surefire\surefire-testng\2.6-SNAPSHOT\surefire-testng-2.6-SNAPSHOT.pom
[INFO] Installing C:\home\hudson\workspace\surefire\jdk\1.5\label\windows\trunk\surefire-providers\surefire-testng\target\surefire-testng-2.6-SNAPSHOT.jar
to C:\opt\repos\surefire\jdk=1.5,label=windows\org\apache\maven\surefire\surefire-testng\2.6-SNAPSHOT\surefire-testng-2.6-20100517.143752-2.jar
[INFO] Installing C:\home\hudson\workspace\surefire\jdk\1.5\label\windows\trunk\surefire-providers\pom.xml
to C:\opt\repos\surefire\jdk=1.5,label=windows\org\apache\maven\surefire\surefire-providers\2.6-SNAPSHOT\surefire-providers-2.6-SNAPSHOT.pom
[INFO] Installing C:\home\hudson\workspace\surefire\jdk\1.5\label\windows\trunk\surefire-providers\surefire-junit\pom.xml
to C:\opt\repos\surefire\jdk=1.5,label=windows\org\apache\maven\surefire\surefire-junit\2.6-SNAPSHOT\surefire-junit-2.6-SNAPSHOT.pom
[INFO] Installing C:\home\hudson\workspace\surefire\jdk\1.5\label\windows\trunk\surefire-providers\surefire-junit\target\surefire-junit-2.6-SNAPSHOT.jar
to C:\opt\repos\surefire\jdk=1.5,label=windows\org\apache\maven\surefire\surefire-junit\2.6-SNAPSHOT\surefire-junit-2.6-20100517.143752-2.jar
[INFO] Installing C:\home\hudson\workspace\surefire\jdk\1.5\label\windows\trunk\surefire-providers\surefire-junit4\pom.xml
to C:\opt\repos\surefire\jdk=1.5,label=windows\org\apache\maven\surefire\surefire-junit4\2.6-SNAPSHOT\surefire-junit4-2.6-SNAPSHOT.pom
[INFO] Installing C:\home\hudson\workspace\surefire\jdk\1.5\label\windows\trunk\surefire-providers\surefire-junit4\target\surefire-junit4-2.6-SNAPSHOT.jar
to C:\opt\repos\surefire\jdk=1.5,label=windows\org\apache\maven\surefire\surefire-junit4\2.6-SNAPSHOT\surefire-junit4-2.6-20100517.143752-2.jar
[INFO] Installing C:\home\hudson\workspace\surefire\jdk\1.5\label\windows\trunk\surefire-providers\surefire-junit47\pom.xml
to C:\opt\repos\surefire\jdk=1.5,label=windows\org\apache\maven\surefire\surefire-junit47\2.6-SNAPSHOT\surefire-junit47-2.6-SNAPSHOT.pom
[INFO] Installing C:\home\hudson\workspace\surefire\jdk\1.5\label\windows\trunk\surefire-providers\surefire-junit47\target\surefire-junit47-2.6-SNAPSHOT.jar
to C:\opt\repos\surefire\jdk=1.5,label=windows\org\apache\maven\surefire\surefire-junit47\2.6-SNAPSHOT\surefire-junit47-2.6-20100517.143752-2.jar
[INFO] Installing C:\home\hudson\workspace\surefire\jdk\1.5\label\windows\trunk\surefire-integration-tests\pom.xml
to C:\opt\repos\surefire\jdk=1.5,label=windows\org\apache\maven\surefire\surefire-integration-tests\2.6-SNAPSHOT\surefire-integration-tests-2.6-SNAPSHOT.pom
[INFO] Installing C:\home\hudson\workspace\surefire\jdk\1.5\label\windows\trunk\surefire-integration-tests\target\surefire-integration-tests-2.6-SNAPSHOT.jar
to C:\opt\repos\surefire\jdk=1.5,label=windows\org\apache\maven\surefire\surefire-integration-tests\2.6-SNAPSHOT\surefire-integration-tests-2.6-SNAPSHOT.jar
[INFO] 
[INFO] --- maven-failsafe-plugin:2.5:integration-test (default) @ surefire-integration-tests
---
[INFO] Failsafe report directory: C:\home\hudson\workspace\surefire\jdk\1.5\label\windows\trunk\surefire-integration-tests\target\failsafe-reports

-------------------------------------------------------
 T E S T S
-------------------------------------------------------
Running org.apache.maven.surefire.its.UseIsolatedClassLoaderIT
Tests run: 1, Failures: 0, Errors: 0, Skipped: 0, Time elapsed: 7.733 sec
Running org.apache.maven.surefire.its.Surefire44InnerClassTestIT
Tests run: 1, Failures: 0, Errors: 1, Skipped: 0, Time elapsed: 2.903 sec <<< FAILURE!
Running org.apache.maven.surefire.its.Surefire377TestNgAndJUnitTogetherIT
Tests run: 1, Failures: 0, Errors: 1, Skipped: 0, Time elapsed: 2.96 sec <<< FAILURE!
Running org.apache.maven.surefire.its.ArgLineIT
Tests run: 1, Failures: 0, Errors: 1, Skipped: 0, Time elapsed: 2.746 sec <<< FAILURE!
Running org.apache.maven.surefire.its.ClassPathOrderIT
Tests run: 1, Failures: 0, Errors: 1, Skipped: 0, Time elapsed: 3.885 sec <<< FAILURE!
Running org.apache.maven.surefire.its.Surefire613TestCountInParallelIT
Tests run: 1, Failures: 1, Errors: 0, Skipped: 0, Time elapsed: 2.819 sec <<< FAILURE!
Running org.apache.maven.surefire.its.CheckTestNgSuiteXmlIT
Tests run: 2, Failures: 0, Errors: 0, Skipped: 0, Time elapsed: 17.504 sec
Running org.apache.maven.surefire.its.ForkModeIT
Tests run: 5, Failures: 0, Errors: 0, Skipped: 0, Time elapsed: 38.392 sec
Running org.apache.maven.surefire.its.IncludesExcludesIT
Tests run: 1, Failures: 0, Errors: 1, Skipped: 0, Time elapsed: 3.353 sec <<< FAILURE!
Running org.apache.maven.surefire.its.UmlautDirIT
Tests run: 2, Failures: 0, Errors: 1, Skipped: 0, Time elapsed: 9.451 sec <<< FAILURE!
Running org.apache.maven.surefire.its.PlexusConflictIT
Tests run: 2, Failures: 0, Errors: 1, Skipped: 0, Time elapsed: 10.664 sec <<< FAILURE!
Running org.apache.maven.surefire.its.CheckTestNgBeforeMethodIT
Tests run: 1, Failures: 0, Errors: 1, Skipped: 0, Time elapsed: 3.321 sec <<< FAILURE!
Running org.apache.maven.surefire.its.AbstractTestCaseIT
Tests run: 1, Failures: 0, Errors: 1, Skipped: 0, Time elapsed: 2.783 sec <<< FAILURE!
Running org.apache.maven.surefire.its.TwoTestCasesIT
Tests run: 4, Failures: 0, Errors: 4, Skipped: 0, Time elapsed: 11.38 sec <<< FAILURE!
Running org.apache.maven.surefire.its.CheckTestNgBeforeMethodFailureIT
Tests run: 1, Failures: 1, Errors: 0, Skipped: 0, Time elapsed: 2.774 sec <<< FAILURE!
Running org.apache.maven.surefire.its.Surefire146ForkPerTestNoSetupIT
Tests run: 1, Failures: 0, Errors: 1, Skipped: 0, Time elapsed: 2.728 sec <<< FAILURE!
Running org.apache.maven.surefire.its.PlainOldJavaClasspathIT
Tests run: 1, Failures: 0, Errors: 1, Skipped: 0, Time elapsed: 2.781 sec <<< FAILURE!
Running org.apache.maven.surefire.its.WorkingDirectoryMissingIT
Tests run: 1, Failures: 0, Errors: 1, Skipped: 0, Time elapsed: 2.726 sec <<< FAILURE!
Running org.apache.maven.surefire.its.Surefire162CharsetProviderIT
Tests run: 1, Failures: 0, Errors: 1, Skipped: 0, Time elapsed: 2.759 sec <<< FAILURE!
Running org.apache.maven.surefire.its.Junit4IgnoreIT
Tests run: 1, Failures: 0, Errors: 1, Skipped: 0, Time elapsed: 2.71 sec <<< FAILURE!
Running org.apache.maven.surefire.its.AdditionalClasspathIT
Tests run: 1, Failures: 0, Errors: 1, Skipped: 0, Time elapsed: 2.769 sec <<< FAILURE!
Running org.apache.maven.surefire.its.EnvironmentVariableIT
Tests run: 1, Failures: 0, Errors: 1, Skipped: 0, Time elapsed: 2.883 sec <<< FAILURE!
Running org.apache.maven.surefire.its.JUnit44HamcrestIT
Tests run: 1, Failures: 0, Errors: 1, Skipped: 0, Time elapsed: 2.87 sec <<< FAILURE!
Running org.apache.maven.surefire.its.CheckTestNgListenerReporterIT
Tests run: 1, Failures: 0, Errors: 1, Skipped: 0, Time elapsed: 3.449 sec <<< FAILURE!
Running org.apache.maven.surefire.its.SiblingAggregatorIT
Tests run: 1, Failures: 0, Errors: 0, Skipped: 0, Time elapsed: 4.135 sec
Running org.apache.maven.surefire.its.CheckTestNgJdk14IT
Tests run: 1, Failures: 0, Errors: 1, Skipped: 0, Time elapsed: 2.893 sec <<< FAILURE!
Running org.apache.maven.surefire.its.CheckTestFailIfNoTestsIT
Tests run: 2, Failures: 0, Errors: 1, Skipped: 0, Time elapsed: 6.664 sec <<< FAILURE!
Running org.apache.maven.surefire.its.CheckTestNgVersionsIT
Tests run: 6, Failures: 0, Errors: 0, Skipped: 0, Time elapsed: 40.5 sec
Running org.apache.maven.surefire.its.Surefire224WellFormedXmlFailuresIT
Tests run: 1, Failures: 0, Errors: 1, Skipped: 0, Time elapsed: 3.303 sec <<< FAILURE!
Running org.apache.maven.surefire.its.Surefire42NotExtendingTestCaseIT
Tests run: 1, Failures: 0, Errors: 1, Skipped: 0, Time elapsed: 2.781 sec <<< FAILURE!
Running org.apache.maven.surefire.its.Junit47concurrencyIT
Tests run: 1, Failures: 0, Errors: 0, Skipped: 0, Time elapsed: 7.333 sec
Running org.apache.maven.surefire.its.WorkingDirectoryIT
Tests run: 4, Failures: 0, Errors: 0, Skipped: 0, Time elapsed: 13.501 sec
Running org.apache.maven.surefire.its.AggregateReportIT
Tests run: 1, Failures: 0, Errors: 0, Skipped: 0, Time elapsed: 9.644 sec
Running org.apache.maven.surefire.its.DefaultConfigurationIT
Tests run: 1, Failures: 0, Errors: 1, Skipped: 0, Time elapsed: 3.431 sec <<< FAILURE!
Running org.apache.maven.surefire.its.Junit4VersionsIT
Tests run: 9, Failures: 0, Errors: 0, Skipped: 0, Time elapsed: 62.306 sec
Running org.apache.maven.surefire.its.CheckSingleTestIT
Tests run: 4, Failures: 0, Errors: 0, Skipped: 0, Time elapsed: 27.561 sec
Running org.apache.maven.surefire.its.CheckTestNgPathWithSpacesIT
Tests run: 1, Failures: 0, Errors: 1, Skipped: 0, Time elapsed: 3.399 sec <<< FAILURE!
Running org.apache.maven.surefire.its.CheckTestNgSuiteXmlSingleIT
Tests run: 1, Failures: 0, Errors: 0, Skipped: 0, Time elapsed: 8.164 sec
Running org.apache.maven.surefire.its.CheckTestNgExecuteErrorIT
Tests run: 1, Failures: 1, Errors: 0, Skipped: 0, Time elapsed: 3.318 sec <<< FAILURE!
Running org.apache.maven.surefire.its.CheckTestNgReportTestIT
Tests run: 1, Failures: 0, Errors: 1, Skipped: 0, Time elapsed: 3.45 sec <<< FAILURE!
Running org.apache.maven.surefire.its.JUnit4ForkAlwaysStaticInitPollutionIT
Tests run: 1, Failures: 0, Errors: 1, Skipped: 0, Time elapsed: 2.775 sec <<< FAILURE!
Running org.apache.maven.surefire.its.TimeoutForkedTestIT
Tests run: 1, Failures: 0, Errors: 0, Skipped: 0, Time elapsed: 2.77 sec
Running org.apache.maven.surefire.its.CheckTestFailIfNoTestsForkModeIT
Tests run: 6, Failures: 0, Errors: 0, Skipped: 0, Time elapsed: 38.947 sec
Running org.apache.maven.surefire.its.CheckTestNgGroupThreadParallelIT
Tests run: 1, Failures: 0, Errors: 1, Skipped: 0, Time elapsed: 3.943 sec <<< FAILURE!
Running org.apache.maven.surefire.its.PojoSimpleIT
Tests run: 1, Failures: 0, Errors: 1, Skipped: 0, Time elapsed: 3.1 sec <<< FAILURE!
Running org.apache.maven.surefire.its.SystemPropertiesTestIT
Tests run: 2, Failures: 0, Errors: 0, Skipped: 0, Time elapsed: 13.357 sec

Results :

Failed tests: 
  testPaallelBuildResultCount(org.apache.maven.surefire.its.Surefire613TestCountInParallelIT)
  testTestNgBeforeMethodFailure(org.apache.maven.surefire.its.CheckTestNgBeforeMethodFailureIT)
  testExecuteError(org.apache.maven.surefire.its.CheckTestNgExecuteErrorIT)

Tests in error: 
  testInnerClass(org.apache.maven.surefire.its.Surefire44InnerClassTestIT)
  testTestNgAndJUnitTogether(org.apache.maven.surefire.its.Surefire377TestNgAndJUnitTogetherIT)
  testArgLine(org.apache.maven.surefire.its.ArgLineIT)
  testClassPathOrder(org.apache.maven.surefire.its.ClassPathOrderIT)
  testIncludesExcludes(org.apache.maven.surefire.its.IncludesExcludesIT)
  testUmlaut(org.apache.maven.surefire.its.UmlautDirIT)
  testPlexusConflict(org.apache.maven.surefire.its.PlexusConflictIT)
  testTestNgBeforeMethod(org.apache.maven.surefire.its.CheckTestNgBeforeMethodIT)
  testAbstractTestCase(org.apache.maven.surefire.its.AbstractTestCaseIT)
  testTestNGSuite(org.apache.maven.surefire.its.TwoTestCasesIT)
  testTwoTestCases(org.apache.maven.surefire.its.TwoTestCasesIT)
  testTwoTestCaseSuite(org.apache.maven.surefire.its.TwoTestCasesIT)
  testJunit4Suite(org.apache.maven.surefire.its.TwoTestCasesIT)
  testForkPerTestNoSetup(org.apache.maven.surefire.its.Surefire146ForkPerTestNoSetupIT)
  testPlainOldJavaClasspath(org.apache.maven.surefire.its.PlainOldJavaClasspathIT)
  testWorkingDirectory(org.apache.maven.surefire.its.WorkingDirectoryMissingIT)
  testCharsetProvider(org.apache.maven.surefire.its.Surefire162CharsetProviderIT)
  testJunit4Ignore(org.apache.maven.surefire.its.Junit4IgnoreIT)
  testAdditionalClasspath(org.apache.maven.surefire.its.AdditionalClasspathIT)
  testEnvironmentVariable(org.apache.maven.surefire.its.EnvironmentVariableIT)
  testJUnit44Hamcrest(org.apache.maven.surefire.its.JUnit44HamcrestIT)
  testTestNgListenerReporter(org.apache.maven.surefire.its.CheckTestNgListenerReporterIT)
  testTestNgJdk14(org.apache.maven.surefire.its.CheckTestNgJdk14IT)
  testDontFailIfNoTests(org.apache.maven.surefire.its.CheckTestFailIfNoTestsIT)
  testWellFormedXmlFailures(org.apache.maven.surefire.its.Surefire224WellFormedXmlFailuresIT)
  testInnerClass(org.apache.maven.surefire.its.Surefire42NotExtendingTestCaseIT)
  testDefaultConfiguration(org.apache.maven.surefire.its.DefaultConfigurationIT)
  testTestNgTestWithSpaces(org.apache.maven.surefire.its.CheckTestNgPathWithSpacesIT)
  testTestNgReport(org.apache.maven.surefire.its.CheckTestNgReportTestIT)
  testJunit4Ignore(org.apache.maven.surefire.its.JUnit4ForkAlwaysStaticInitPollutionIT)
  testTestNgGroupThreadParallel(org.apache.maven.surefire.its.CheckTestNgGroupThreadParallelIT)
  testit(org.apache.maven.surefire.its.PojoSimpleIT)

Tests run: 82, Failures: 3, Errors: 32, Skipped: 0

[INFO] 
[INFO] --- maven-failsafe-plugin:2.5:verify (default) @ surefire-integration-tests ---
[INFO] Failsafe report directory: C:\home\hudson\workspace\surefire\jdk\1.5\label\windows\trunk\surefire-integration-tests\target\failsafe-reports
[INFO] ------------------------------------------------------------------------
[INFO] Reactor Summary:
[INFO] 
[INFO] SureFire .......................................... SUCCESS [4.619s]
[INFO] SureFire API ...................................... SUCCESS [5.860s]
[INFO] SureFire Booter ................................... SUCCESS [3.662s]
[INFO] SureFire Providers ................................ SUCCESS [0.135s]
[INFO] SureFire JUnit Runner ............................. SUCCESS [1.157s]
[INFO] SureFire JUnit4 Runner ............................ SUCCESS [1.230s]
[INFO] SureFire JUnitCore Runner ......................... SUCCESS [2.456s]
[INFO] SureFire TestNG Runner ............................ SUCCESS [2.710s]
[INFO] Maven Surefire Common ............................. SUCCESS [2.057s]
[INFO] Maven Surefire Plugin ............................. SUCCESS [3.269s]
[INFO] Maven Failsafe Plugin ............................. SUCCESS [2.702s]
[INFO] Maven Surefire Report Plugin ...................... SUCCESS [6.288s]
[INFO] Maven Surefire Integration Tests .................. FAILURE [7:04.623s]
[INFO] ------------------------------------------------------------------------
[INFO] BUILD FAILURE
[INFO] ------------------------------------------------------------------------
[INFO] Total time: 7:41.246s
[INFO] Finished at: Mon May 17 07:45:28 PDT 2010
[INFO] Final Memory: 13M/24M
[INFO] ------------------------------------------------------------------------
[ERROR] Failed to execute goal org.apache.maven.plugins:maven-failsafe-plugin:2.5:verify (default)
on project surefire-integration-tests: There are test failures.

Please refer to C:\home\hudson\workspace\surefire\jdk\1.5\label\windows\trunk\surefire-integration-tests\target\failsafe-reports
for the individual test results.
-> [Help 1]
org.apache.maven.lifecycle.LifecycleExecutionException: Failed to execute goal org.apache.maven.plugins:maven-failsafe-plugin:2.5:verify
(default) on project surefire-integration-tests: There are test failures.

Please refer to C:\home\hudson\workspace\surefire\jdk\1.5\label\windows\trunk\surefire-integration-tests\target\failsafe-reports
for the individual test results.
	at org.apache.maven.lifecycle.DefaultLifecycleExecutor.execute(DefaultLifecycleExecutor.java:566)
	at org.apache.maven.lifecycle.DefaultLifecycleExecutor.execute(DefaultLifecycleExecutor.java:317)
	at org.apache.maven.DefaultMaven.doExecute(DefaultMaven.java:247)
	at org.apache.maven.DefaultMaven.execute(DefaultMaven.java:104)
	at org.apache.maven.cli.MavenCli.execute(MavenCli.java:423)
	at org.apache.maven.cli.MavenCli.doMain(MavenCli.java:158)
	at org.apache.maven.cli.MavenCli.main(MavenCli.java:123)
	at sun.reflect.NativeMethodAccessorImpl.invoke0(Native Method)
	at sun.reflect.NativeMethodAccessorImpl.invoke(NativeMethodAccessorImpl.java:39)
	at sun.reflect.DelegatingMethodAccessorImpl.invoke(DelegatingMethodAccessorImpl.java:25)
	at java.lang.reflect.Method.invoke(Method.java:585)
	at org.codehaus.plexus.classworlds.launcher.Launcher.launchEnhanced(Launcher.java:290)
	at org.codehaus.plexus.classworlds.launcher.Launcher.launch(Launcher.java:230)
	at org.codehaus.plexus.classworlds.launcher.Launcher.mainWithExitCode(Launcher.java:409)
	at org.codehaus.plexus.classworlds.launcher.Launcher.main(Launcher.java:352)
Caused by: org.apache.maven.plugin.MojoFailureException: There are test failures.

Please refer to C:\home\hudson\workspace\surefire\jdk\1.5\label\windows\trunk\surefire-integration-tests\target\failsafe-reports
for the individual test results.
	at org.apache.maven.plugin.failsafe.VerifyMojo.execute(VerifyMojo.java:217)
	at org.apache.maven.plugin.DefaultBuildPluginManager.executeMojo(DefaultBuildPluginManager.java:105)
	at org.apache.maven.lifecycle.DefaultLifecycleExecutor.execute(DefaultLifecycleExecutor.java:562)
	... 14 more
[ERROR] 
[ERROR] Re-run Maven using the -X switch to enable full debug logging.
[ERROR] 
[ERROR] For more information about the errors and possible solutions, please read the following
articles:
[ERROR] [Help 1] http://cwiki.apache.org/confluence/display/MAVEN/MojoFailureException
[ERROR] 
[ERROR] After correcting the problems, you can resume the build with the command
[ERROR]   mvn <goals> -rf :surefire-integration-tests


Mime
View raw message