maven-notifications mailing list archives

Site index · List index
Message view « Date » · « Thread »
Top « Date » · « Thread »
From Hudson <Hud...@sonatype.org>
Subject Build failed in Hudson: maven-3.0.x » 1.5,ubuntu #546
Date Thu, 28 Jan 2010 18:25:07 GMT
See <http://grid.sonatype.org/ci/job/maven-3.0.x/./jdk=1.5,label=ubuntu/546/changes>

Changes:

[Benjamin Bentmann] [MNG-4536] Long build time - enforcer running too many times

------------------------------------------
[...truncated 1326 lines...]
	at java.lang.reflect.Method.invoke(Method.java:585)
	at org.apache.maven.surefire.junit.JUnitTestSet.execute(JUnitTestSet.java:213)
	at org.apache.maven.surefire.suite.AbstractDirectoryTestSuite.executeTestSet(AbstractDirectoryTestSuite.java:140)
	at org.apache.maven.surefire.suite.AbstractDirectoryTestSuite.execute(AbstractDirectoryTestSuite.java:127)
	at org.apache.maven.surefire.Surefire.run(Surefire.java:177)
	at sun.reflect.NativeMethodAccessorImpl.invoke0(Native Method)
	at sun.reflect.NativeMethodAccessorImpl.invoke(NativeMethodAccessorImpl.java:39)
	at sun.reflect.DelegatingMethodAccessorImpl.invoke(DelegatingMethodAccessorImpl.java:25)
	at java.lang.reflect.Method.invoke(Method.java:585)
	at org.apache.maven.surefire.booter.SurefireBooter.runSuitesInProcess(SurefireBooter.java:345)
	at org.apache.maven.surefire.booter.SurefireBooter.main(SurefireBooter.java:1009)
Tests run: 10, Failures: 0, Errors: 0, Skipped: 0, Time elapsed: 15.088 sec
Running org.apache.maven.MavenLifecycleParticipantTest
java.io.FileNotFoundException: /home/hudson/workspace/maven-3.0.x/jdk/1.5/label/ubuntu/trunk/maven-core/target/local-repo/org/apache/maven/its/plugins/maven-it-plugin/0.1/maven-it-plugin-0.1.pom
(No such file or directory)
	at java.io.FileInputStream.open(Native Method)
	at java.io.FileInputStream.<init>(FileInputStream.java:106)
	at org.codehaus.plexus.util.xml.XmlReader.<init>(XmlReader.java:124)
	at org.codehaus.plexus.util.xml.XmlStreamReader.<init>(XmlStreamReader.java:67)
	at org.codehaus.plexus.util.ReaderFactory.newXmlReader(ReaderFactory.java:118)
	at org.apache.maven.model.io.DefaultModelReader.read(DefaultModelReader.java:53)
	at org.apache.maven.repository.TestRepositorySystem.resolve(TestRepositorySystem.java:220)
	at org.apache.maven.plugin.internal.DefaultMavenPluginManager.resolvePluginArtifacts(DefaultMavenPluginManager.java:446)
	at org.apache.maven.plugin.internal.DefaultMavenPluginManager.createPluginRealm(DefaultMavenPluginManager.java:360)
	at org.apache.maven.plugin.internal.DefaultMavenPluginManager.setupPluginRealm(DefaultMavenPluginManager.java:311)
	at org.apache.maven.plugin.DefaultBuildPluginManager.getPluginRealm(DefaultBuildPluginManager.java:184)
	at org.apache.maven.plugin.DefaultBuildPluginManager.executeMojo(DefaultBuildPluginManager.java:80)
	at org.apache.maven.lifecycle.DefaultLifecycleExecutor.execute(DefaultLifecycleExecutor.java:562)
	at org.apache.maven.lifecycle.DefaultLifecycleExecutor.execute(DefaultLifecycleExecutor.java:317)
	at org.apache.maven.DefaultMaven.doExecute(DefaultMaven.java:247)
	at org.apache.maven.DefaultMaven.execute(DefaultMaven.java:104)
	at org.apache.maven.MavenLifecycleParticipantTest.testDependencyInjection(MavenLifecycleParticipantTest.java:100)
	at sun.reflect.NativeMethodAccessorImpl.invoke0(Native Method)
	at sun.reflect.NativeMethodAccessorImpl.invoke(NativeMethodAccessorImpl.java:39)
	at sun.reflect.DelegatingMethodAccessorImpl.invoke(DelegatingMethodAccessorImpl.java:25)
	at java.lang.reflect.Method.invoke(Method.java:585)
	at junit.framework.TestCase.runTest(TestCase.java:164)
	at junit.framework.TestCase.runBare(TestCase.java:130)
	at junit.framework.TestResult$1.protect(TestResult.java:106)
	at junit.framework.TestResult.runProtected(TestResult.java:124)
	at junit.framework.TestResult.run(TestResult.java:109)
	at junit.framework.TestCase.run(TestCase.java:120)
	at junit.framework.TestSuite.runTest(TestSuite.java:230)
	at junit.framework.TestSuite.run(TestSuite.java:225)
	at sun.reflect.NativeMethodAccessorImpl.invoke0(Native Method)
	at sun.reflect.NativeMethodAccessorImpl.invoke(NativeMethodAccessorImpl.java:39)
	at sun.reflect.DelegatingMethodAccessorImpl.invoke(DelegatingMethodAccessorImpl.java:25)
	at java.lang.reflect.Method.invoke(Method.java:585)
	at org.apache.maven.surefire.junit.JUnitTestSet.execute(JUnitTestSet.java:213)
	at org.apache.maven.surefire.suite.AbstractDirectoryTestSuite.executeTestSet(AbstractDirectoryTestSuite.java:140)
	at org.apache.maven.surefire.suite.AbstractDirectoryTestSuite.execute(AbstractDirectoryTestSuite.java:127)
	at org.apache.maven.surefire.Surefire.run(Surefire.java:177)
	at sun.reflect.NativeMethodAccessorImpl.invoke0(Native Method)
	at sun.reflect.NativeMethodAccessorImpl.invoke(NativeMethodAccessorImpl.java:39)
	at sun.reflect.DelegatingMethodAccessorImpl.invoke(DelegatingMethodAccessorImpl.java:25)
	at java.lang.reflect.Method.invoke(Method.java:585)
	at org.apache.maven.surefire.booter.SurefireBooter.runSuitesInProcess(SurefireBooter.java:345)
	at org.apache.maven.surefire.booter.SurefireBooter.main(SurefireBooter.java:1009)
Tests run: 1, Failures: 0, Errors: 0, Skipped: 0, Time elapsed: 0.431 sec
Running org.apache.maven.project.artifact.DefaultMavenMetadataCacheTest
Tests run: 1, Failures: 0, Errors: 0, Skipped: 0, Time elapsed: 0.078 sec
Running org.apache.maven.project.artifact.MavenMetadataSourceTest
Tests run: 1, Failures: 0, Errors: 0, Skipped: 0, Time elapsed: 0.072 sec
Running org.apache.maven.project.MavenProjectTest
org/apache/maven/project/AbstractMavenProjectTestCase.xml
org/apache/maven/project/AbstractMavenProjectTestCase.xml
org/apache/maven/project/AbstractMavenProjectTestCase.xml
org/apache/maven/project/AbstractMavenProjectTestCase.xml
org/apache/maven/project/AbstractMavenProjectTestCase.xml
org/apache/maven/project/AbstractMavenProjectTestCase.xml
org/apache/maven/project/AbstractMavenProjectTestCase.xml
Tests run: 7, Failures: 0, Errors: 0, Skipped: 0, Time elapsed: 0.918 sec
Running org.apache.maven.project.canonical.CanonicalProjectBuilderTest
org/apache/maven/project/AbstractMavenProjectTestCase.xml
Tests run: 1, Failures: 0, Errors: 0, Skipped: 0, Time elapsed: 0.162 sec
Running org.apache.maven.ProjectDependenciesResolverTest
Tests run: 2, Failures: 0, Errors: 0, Skipped: 0, Time elapsed: 0.584 sec
Running org.apache.maven.execution.ProjectSorterTest
[MavenProject: groupId:parent-declarer:1.0 @ , MavenProject: groupId:plugin:1.0 @ , MavenProject:
groupId:plugin-level-dep:1.0 @ ]
Tests run: 12, Failures: 0, Errors: 0, Skipped: 0, Time elapsed: 0.01 sec
Running org.apache.maven.project.ProjectBuilderTest
Tests run: 1, Failures: 0, Errors: 0, Skipped: 0, Time elapsed: 0.36 sec
Running org.apache.maven.settings.SettingsUtilsTest
Tests run: 1, Failures: 0, Errors: 0, Skipped: 0, Time elapsed: 0.003 sec
Running org.apache.maven.settings.validation.DefaultSettingsValidatorTest
Tests run: 1, Failures: 0, Errors: 0, Skipped: 0, Time elapsed: 0.007 sec
Running org.apache.maven.plugin.PluginParameterExpressionEvaluatorTest
Result: Component Descriptor: role: 'org.apache.maven.plugin.Mojo', implementation: 'null',
role hint: 'org.myco.plugins:my-plugin:1:null'
---
Result: [group:artifact:jar:1:compile]
Result: {group:artifact=group:artifact:jar:1:compile}
Result: my-plugin
Tests run: 16, Failures: 0, Errors: 0, Skipped: 0, Time elapsed: 2.423 sec
Running org.apache.maven.MavenTest
Tests run: 1, Failures: 0, Errors: 0, Skipped: 0, Time elapsed: 0.299 sec
Running org.apache.maven.repository.TestRepositorySystem
Tests run: 0, Failures: 0, Errors: 0, Skipped: 0, Time elapsed: 0.032 sec
Running org.apache.maven.toolchain.RequirementMatcherFactoryTest
Tests run: 2, Failures: 0, Errors: 0, Skipped: 0, Time elapsed: 0.03 sec
Running org.apache.maven.project.PomConstructionTest
Tests run: 125, Failures: 0, Errors: 0, Skipped: 0, Time elapsed: 11.395 sec
Running org.apache.maven.project.DefaultMavenProjectBuilderTest
org/apache/maven/project/AbstractMavenProjectTestCase.xml
org/apache/maven/project/AbstractMavenProjectTestCase.xml
org/apache/maven/project/AbstractMavenProjectTestCase.xml
Tests run: 3, Failures: 0, Errors: 0, Skipped: 0, Time elapsed: 0.119 sec
Running org.apache.maven.settings.PomConstructionWithSettingsTest
Tests run: 3, Failures: 0, Errors: 0, Skipped: 0, Time elapsed: 0.158 sec
Running org.apache.maven.project.TestMetadataSource
Tests run: 0, Failures: 0, Errors: 0, Skipped: 0, Time elapsed: 0.002 sec
Running org.apache.maven.project.ExtensionDescriptorBuilderTest
Tests run: 2, Failures: 0, Errors: 0, Skipped: 0, Time elapsed: 0.003 sec
Running org.apache.maven.lifecycle.LifecycleExecutorTest
<?xml version="1.0" encoding="UTF-8"?>
<configuration>
  <version default-value="1.0">${version}</version>
</configuration>
Tests run: 10, Failures: 0, Errors: 0, Skipped: 0, Time elapsed: 2.904 sec

Results :

Tests run: 201, Failures: 0, Errors: 0, Skipped: 0

[INFO] 
[INFO] --- maven-jar-plugin:2.2:jar (default-jar) @ maven-core ---
[INFO] Building jar: /home/hudson/workspace/maven-3.0.x/jdk/1.5/label/ubuntu/trunk/maven-core/target/maven-core-3.0-SNAPSHOT.jar
[INFO] 
[INFO] --- maven-install-plugin:2.2:install (default-install) @ maven-core ---
[INFO] Installing /home/hudson/workspace/maven-3.0.x/jdk/1.5/label/ubuntu/trunk/maven-core/target/maven-core-3.0-SNAPSHOT.jar
to /opt/repos/bootstrap-maven-3.x/org/apache/maven/maven-core/3.0-SNAPSHOT/maven-core-3.0-SNAPSHOT.jar
[INFO] 
[INFO] --- maven-deploy-plugin:2.4:deploy (default-deploy) @ maven-core ---
[INFO] Retrieving previous build number from apache.snapshots.https
Uploading: http://repository.sonatype.org:8081/content/repositories/maven.snapshots/org/apache/maven/maven-core/3.0-SNAPSHOT/maven-core-3.0-20100128.181140-434.jar
444 KB uploaded at 1698.8 KB/sec
[INFO] Uploading project information for maven-core 3.0-20100128.181140-434
[INFO] Retrieving previous metadata from apache.snapshots.https
[INFO] Uploading repository metadata for: 'artifact org.apache.maven:maven-core'
[INFO] Retrieving previous metadata from apache.snapshots.https
[INFO] Uploading repository metadata for: 'snapshot org.apache.maven:maven-core:3.0-SNAPSHOT'
[INFO]                                                                         
[INFO] ------------------------------------------------------------------------
[INFO] Building Maven Compat 3.0-SNAPSHOT
[INFO] ------------------------------------------------------------------------
Downloading: http://repository.sonatype.org:8081/content/groups/sonatype-public-grid/org/apache/maven/wagon/wagon-provider-api/1.0-beta-6/wagon-provider-api-1.0-beta-6.pom
2 KB downloaded at 47.7 KB/sec
Downloading: http://repository.sonatype.org:8081/content/groups/sonatype-public-grid/org/apache/maven/wagon/wagon/1.0-beta-6/wagon-1.0-beta-6.pom
13 KB downloaded at 77.0 KB/sec
Downloading: http://repository.sonatype.org:8081/content/groups/sonatype-public-grid/org/apache/maven/wagon/wagon-file/1.0-beta-6/wagon-file-1.0-beta-6.pom
2 KB downloaded at 23.2 KB/sec
Downloading: http://repository.sonatype.org:8081/content/groups/sonatype-public-grid/org/apache/maven/wagon/wagon-providers/1.0-beta-6/wagon-providers-1.0-beta-6.pom
3 KB downloaded at 12.1 KB/sec
Downloading: http://repository.sonatype.org:8081/content/groups/sonatype-public-grid/easymock/easymock/1.2_Java1.3/easymock-1.2_Java1.3.pom
192 B downloaded at 2.5 KB/sec
Downloading: http://repository.sonatype.org:8081/content/groups/sonatype-public-grid/org/apache/maven/wagon/wagon-provider-api/1.0-beta-6/wagon-provider-api-1.0-beta-6.jar
52 KB downloaded at 123.7 KB/sec
Downloading: http://repository.sonatype.org:8081/content/groups/sonatype-public-grid/org/apache/maven/wagon/wagon-file/1.0-beta-6/wagon-file-1.0-beta-6.jar
11 KB downloaded at 119.8 KB/sec
Downloading: http://repository.sonatype.org:8081/content/groups/sonatype-public-grid/easymock/easymock/1.2_Java1.3/easymock-1.2_Java1.3.jar
36 KB downloaded at 382.2 KB/sec
[INFO] 
[INFO] --- maven-clean-plugin:2.4:clean (default-clean) @ maven-compat ---
[INFO] Deleting /home/hudson/workspace/maven-3.0.x/jdk/1.5/label/ubuntu/trunk/maven-compat/target
[INFO] 
[INFO] --- modello-maven-plugin:1.2:java (standard) @ maven-compat ---
[INFO] outputDirectory: /home/hudson/workspace/maven-3.0.x/jdk/1.5/label/ubuntu/trunk/maven-compat/target/generated-sources/modello
[INFO] Working on model: src/main/mdo/profiles.mdo
[INFO] Generating current version: 1.0.0
[INFO] Working on model: src/main/mdo/paramdoc.mdo
[INFO] Generating current version: 1.0.0
[INFO] 
[INFO] --- modello-maven-plugin:1.2:xpp3-reader (standard) @ maven-compat ---
[INFO] outputDirectory: /home/hudson/workspace/maven-3.0.x/jdk/1.5/label/ubuntu/trunk/maven-compat/target/generated-sources/modello
[INFO] Working on model: src/main/mdo/profiles.mdo
[INFO] Generating current version: 1.0.0
[INFO] Working on model: src/main/mdo/paramdoc.mdo
[INFO] Generating current version: 1.0.0
[INFO] 
[INFO] --- modello-maven-plugin:1.2:xpp3-writer (standard) @ maven-compat ---
[INFO] outputDirectory: /home/hudson/workspace/maven-3.0.x/jdk/1.5/label/ubuntu/trunk/maven-compat/target/generated-sources/modello
[INFO] Working on model: src/main/mdo/profiles.mdo
[INFO] Generating current version: 1.0.0
[INFO] Working on model: src/main/mdo/paramdoc.mdo
[INFO] Generating current version: 1.0.0
[INFO] 
[INFO] --- maven-remote-resources-plugin:1.1:process (default) @ maven-compat ---
[INFO] 
[INFO] --- maven-resources-plugin:2.4:resources (default-resources) @ maven-compat ---
[INFO] Using 'UTF-8' encoding to copy filtered resources.
[INFO] Copying 4 resources
[INFO] Copying 3 resources
[INFO] 
[INFO] --- maven-compiler-plugin:2.0.2:compile (default-compile) @ maven-compat ---
[INFO] Compiling 143 source files to /home/hudson/workspace/maven-3.0.x/jdk/1.5/label/ubuntu/trunk/maven-compat/target/classes
[INFO] ------------------------------------------------------------------------
[INFO] Reactor Summary:
[INFO] 
[INFO] Apache Maven 3.x .................................. SUCCESS [2:22.021s]
[INFO] Maven Model ....................................... SUCCESS [1:58.321s]
[INFO] Maven Settings .................................... SUCCESS [27.941s]
[INFO] Maven Artifact .................................... SUCCESS [1:08.972s]
[INFO] Maven Plugin API .................................. SUCCESS [43.095s]
[INFO] Maven Model Builder ............................... SUCCESS [1:18.410s]
[INFO] Maven Core ........................................ SUCCESS [2:34.876s]
[INFO] Maven Compat ...................................... FAILURE [11.629s]
[INFO] Maven Embedder .................................... SKIPPED
[INFO] Maven Distribution ................................ SKIPPED
[INFO] ------------------------------------------------------------------------
[INFO] BUILD FAILURE
[INFO] ------------------------------------------------------------------------
[INFO] Total time: 11:10.864s
[INFO] Finished at: Thu Jan 28 12:20:05 GMT-06:00 2010
[INFO] Final Memory: 19M/153M
[INFO] ------------------------------------------------------------------------
[ERROR] Failed to execute goal org.apache.maven.plugins:maven-compiler-plugin:2.0.2:compile
(default-compile) on project maven-compat: Compilation failure
error: cannot read: /home/hudson/workspace/maven-3.0.x/jdk/1.5/label/ubuntu/trunk/maven-compat/target/generated-sources/modello/org/apache/maven/profiles/Activation.java
-> [Help 1]
org.apache.maven.lifecycle.LifecycleExecutionException: Failed to execute goal org.apache.maven.plugins:maven-compiler-plugin:2.0.2:compile
(default-compile) on project maven-compat: Compilation failure
error: cannot read: /home/hudson/workspace/maven-3.0.x/jdk/1.5/label/ubuntu/trunk/maven-compat/target/generated-sources/modello/org/apache/maven/profiles/Activation.java

	at org.apache.maven.lifecycle.DefaultLifecycleExecutor.execute(DefaultLifecycleExecutor.java:566)
	at org.apache.maven.lifecycle.DefaultLifecycleExecutor.execute(DefaultLifecycleExecutor.java:317)
	at org.apache.maven.DefaultMaven.doExecute(DefaultMaven.java:247)
	at org.apache.maven.DefaultMaven.execute(DefaultMaven.java:104)
	at org.apache.maven.cli.MavenCli.execute(MavenCli.java:423)
	at org.apache.maven.cli.MavenCli.doMain(MavenCli.java:158)
	at org.apache.maven.cli.MavenCli.main(MavenCli.java:123)
	at sun.reflect.NativeMethodAccessorImpl.invoke0(Native Method)
	at sun.reflect.NativeMethodAccessorImpl.invoke(NativeMethodAccessorImpl.java:39)
	at sun.reflect.DelegatingMethodAccessorImpl.invoke(DelegatingMethodAccessorImpl.java:25)
	at java.lang.reflect.Method.invoke(Method.java:585)
	at org.codehaus.plexus.classworlds.launcher.Launcher.launchEnhanced(Launcher.java:290)
	at org.codehaus.plexus.classworlds.launcher.Launcher.launch(Launcher.java:230)
	at org.codehaus.plexus.classworlds.launcher.Launcher.mainWithExitCode(Launcher.java:409)
	at org.codehaus.plexus.classworlds.launcher.Launcher.main(Launcher.java:352)
Caused by: org.apache.maven.plugin.CompilationFailureException: Compilation failure
error: cannot read: /home/hudson/workspace/maven-3.0.x/jdk/1.5/label/ubuntu/trunk/maven-compat/target/generated-sources/modello/org/apache/maven/profiles/Activation.java

	at org.apache.maven.plugin.AbstractCompilerMojo.execute(AbstractCompilerMojo.java:516)
	at org.apache.maven.plugin.CompilerMojo.execute(CompilerMojo.java:114)
	at org.apache.maven.plugin.DefaultBuildPluginManager.executeMojo(DefaultBuildPluginManager.java:105)
	at org.apache.maven.lifecycle.DefaultLifecycleExecutor.execute(DefaultLifecycleExecutor.java:562)
	... 14 more
[ERROR] 
[ERROR] Re-run Maven using the -X switch to enable full debug logging.
[ERROR] 
[ERROR] For more information about the errors and possible solutions, please read the following
articles:
[ERROR] [Help 1] http://cwiki.apache.org/confluence/display/MAVEN/MojoFailureException
[ERROR] 
[ERROR] After correcting the problems, you can resume the build with the command
[ERROR]   mvn <goals> -rf :maven-compat


Mime
View raw message