maven-notifications mailing list archives

Site index · List index
Message view « Date » · « Thread »
Top « Date » · « Thread »
From Hudson <Hud...@sonatype.org>
Subject Build failed in Hudson: maven-core-integration-testing » ubuntu #548
Date Wed, 06 Jan 2010 14:15:20 GMT
See <http://grid.sonatype.org/ci/job/maven-core-integration-testing/./label=ubuntu/548/changes>

Changes:

[Benjamin Bentmann] [MNG-2135] multi-project build that creates it's own plugins needs bootstrapping

o Added IT

------------------------------------------
[...truncated 10199 lines...]
[INFO] 
[INFO] --- maven-deploy-plugin:2.4:deploy (default-deploy) @ core-it-support-artifacts ---
[INFO] Retrieving previous build number from apache.snapshots.https
Uploading: http://repository.sonatype.org:8081/content/repositories/maven.snapshots/org/apache/maven/its/core-it-support-artifacts/2.1-SNAPSHOT/core-it-support-artifacts-2.1-20100106.140633-552.pom
2 KB uploaded at 1820.3 KB/sec
[INFO] Retrieving previous metadata from apache.snapshots.https
[INFO] Uploading repository metadata for: 'snapshot org.apache.maven.its:core-it-support-artifacts:2.1-SNAPSHOT'
[INFO] Retrieving previous metadata from apache.snapshots.https
[INFO] Uploading repository metadata for: 'artifact org.apache.maven.its:core-it-support-artifacts'
[INFO] Retrieving previous build number from apache.snapshots.https
Uploading: http://repository.sonatype.org:8081/content/repositories/maven.snapshots/org/apache/maven/its/core-it-support-artifacts/2.1-SNAPSHOT/core-it-support-artifacts-2.1-20100106.140633-552-repo.zip
16 KB uploaded at 15463.9 KB/sec
[INFO]                                                                         
[INFO] ------------------------------------------------------------------------
[INFO] Building Maven Integration Test Extension 2.1-SNAPSHOT
[INFO] ------------------------------------------------------------------------
[INFO] 
[INFO] --- maven-clean-plugin:2.3:clean (default-clean) @ core-it-extension ---
[INFO] 
[INFO] --- maven-remote-resources-plugin:1.0:process (default) @ core-it-extension ---
[INFO] 
[INFO] --- maven-resources-plugin:2.3:resources (default-resources) @ core-it-extension ---
[INFO] Using 'UTF-8' encoding to copy filtered resources.
[INFO] Copying 1 resource
[INFO] Copying 3 resources
[INFO] 
[INFO] --- maven-compiler-plugin:2.0.2:compile (default-compile) @ core-it-extension ---
[INFO] No sources to compile
[INFO] 
[INFO] --- maven-resources-plugin:2.3:testResources (default-testResources) @ core-it-extension
---
[INFO] Using 'UTF-8' encoding to copy filtered resources.
[INFO] skip non existing resourceDirectory /home/hudson/workspace/maven-core-integration-testing/label/ubuntu/maven-its/core-it-support/core-it-extension/src/test/resources
[INFO] Copying 3 resources
[INFO] 
[INFO] --- maven-compiler-plugin:2.0.2:testCompile (default-testCompile) @ core-it-extension
---
[INFO] No sources to compile
[INFO] 
[INFO] --- maven-surefire-plugin:2.5-SNAPSHOT:test (default-test) @ core-it-extension ---
[INFO] snapshot org.apache.maven.surefire:surefire-api:2.5-SNAPSHOT: checking for updates
from Nexus
[INFO] snapshot org.apache.maven.surefire:surefire-junit:2.5-SNAPSHOT: checking for updates
from Nexus
[INFO] snapshot org.apache.maven.surefire:surefire-api:2.5-SNAPSHOT: checking for updates
from Nexus
[INFO] Surefire report directory: /home/hudson/workspace/maven-core-integration-testing/label/ubuntu/maven-its/core-it-support/core-it-extension/target/surefire-reports

-------------------------------------------------------
 T E S T S
-------------------------------------------------------
There are no tests to run.

Results :

Tests run: 0, Failures: 0, Errors: 0, Skipped: 0

[INFO] 
[INFO] --- maven-jar-plugin:2.2:jar (default-jar) @ core-it-extension ---
[INFO] Building jar: /home/hudson/workspace/maven-core-integration-testing/label/ubuntu/maven-its/core-it-support/core-it-extension/target/core-it-extension-2.1-SNAPSHOT.jar
[INFO] 
[INFO] --- maven-install-plugin:2.2:install (default-install) @ core-it-extension ---
[INFO] Installing /home/hudson/workspace/maven-core-integration-testing/label/ubuntu/maven-its/core-it-support/core-it-extension/target/core-it-extension-2.1-SNAPSHOT.jar
to /opt/repos/local-repository/org/apache/maven/its/core-it-extension/2.1-SNAPSHOT/core-it-extension-2.1-SNAPSHOT.jar
[INFO] 
[INFO] --- maven-deploy-plugin:2.4:deploy (default-deploy) @ core-it-extension ---
[INFO] Retrieving previous build number from apache.snapshots.https
Uploading: http://repository.sonatype.org:8081/content/repositories/maven.snapshots/org/apache/maven/its/core-it-extension/2.1-SNAPSHOT/core-it-extension-2.1-20100106.140633-200.jar
8 KB uploaded at 7934.6 KB/sec
[INFO] Retrieving previous metadata from apache.snapshots.https
[INFO] Uploading repository metadata for: 'artifact org.apache.maven.its:core-it-extension'
[INFO] Uploading project information for core-it-extension 2.1-20100106.140633-200
[INFO] Retrieving previous metadata from apache.snapshots.https
[INFO] Uploading repository metadata for: 'snapshot org.apache.maven.its:core-it-extension:2.1-SNAPSHOT'
[INFO]                                                                         
[INFO] ------------------------------------------------------------------------
[INFO] Building Maven Integration Tests 2.1-SNAPSHOT
[INFO] ------------------------------------------------------------------------
[INFO] snapshot org.apache.maven.shared:maven-verifier:1.3-SNAPSHOT: checking for updates
from Nexus
Downloading: http://repository.sonatype.org:8081/content/groups/sonatype-public-grid/org/apache/maven/shared/maven-verifier/1.3-SNAPSHOT/maven-verifier-1.3-20100102.120734-30.pom
2 KB downloaded at 21.9 KB/sec
Downloading: http://repository.sonatype.org:8081/content/groups/sonatype-public-grid/org/mortbay/jetty/jetty/6.1.14/jetty-6.1.14.pom
5 KB downloaded at 84.9 KB/sec
Downloading: http://repository.sonatype.org:8081/content/groups/sonatype-public-grid/org/mortbay/jetty/project/6.1.14/project-6.1.14.pom
9 KB downloaded at 143.0 KB/sec
Downloading: http://repository.sonatype.org:8081/content/groups/sonatype-public-grid/org/mortbay/jetty/jetty-util/6.1.14/jetty-util-6.1.14.pom
4 KB downloaded at 57.7 KB/sec
Downloading: http://repository.sonatype.org:8081/content/groups/sonatype-public-grid/org/mortbay/jetty/servlet-api-2.5/6.1.14/servlet-api-2.5-6.1.14.pom
4 KB downloaded at 55.0 KB/sec
Downloading: http://repository.sonatype.org:8081/content/groups/sonatype-public-grid/org/apache/maven/shared/maven-verifier/1.3-SNAPSHOT/maven-verifier-1.3-20100102.120734-30.jar
87 KB downloaded at 1096.7 KB/sec
Downloading: http://repository.sonatype.org:8081/content/groups/sonatype-public-grid/org/mortbay/jetty/jetty/6.1.14/jetty-6.1.14.jar
505 KB downloaded at 7004.5 KB/sec
Downloading: http://repository.sonatype.org:8081/content/groups/sonatype-public-grid/org/mortbay/jetty/jetty-util/6.1.14/jetty-util-6.1.14.jar
160 KB downloaded at 2152.7 KB/sec
Downloading: http://repository.sonatype.org:8081/content/groups/sonatype-public-grid/org/mortbay/jetty/servlet-api-2.5/6.1.14/servlet-api-2.5-6.1.14.jar
130 KB downloaded at 2485.9 KB/sec
[INFO] 
[INFO] --- maven-clean-plugin:2.3:clean (default-clean) @ core-it-suite ---
[INFO] 
[INFO] --- maven-remote-resources-plugin:1.0:process (default) @ core-it-suite ---
[INFO] snapshot org.apache.maven.shared:maven-verifier:1.3-SNAPSHOT: checking for updates
from Nexus
[INFO] 
[INFO] --- maven-resources-plugin:2.3:resources (default-resources) @ core-it-suite ---
[INFO] Using 'UTF-8' encoding to copy filtered resources.
[INFO] skip non existing resourceDirectory /home/hudson/workspace/maven-core-integration-testing/label/ubuntu/maven-its/core-it-suite/src/main/resources
[INFO] Copying 3 resources
[INFO] 
[INFO] --- maven-compiler-plugin:2.0.2:compile (default-compile) @ core-it-suite ---
[INFO] No sources to compile
[INFO] 
[INFO] --- maven-resources-plugin:2.3:testResources (default-testResources) @ core-it-suite
---
[INFO] Using 'UTF-8' encoding to copy filtered resources.
[INFO] Copying 2083 resources
[INFO] Copying 3 resources
[INFO] 
[INFO] --- maven-compiler-plugin:2.0.2:testCompile (default-testCompile) @ core-it-suite ---
[INFO] Compiling 437 source files to /home/hudson/workspace/maven-core-integration-testing/label/ubuntu/maven-its/core-it-suite/target/test-classes
[INFO] 
[INFO] --- maven-surefire-plugin:2.5-SNAPSHOT:test (default-test) @ core-it-suite ---
[INFO] Tests are skipped.
[INFO] 
[INFO] --- maven-jar-plugin:2.2:jar (default-jar) @ core-it-suite ---
[INFO] Building jar: /home/hudson/workspace/maven-core-integration-testing/label/ubuntu/maven-its/core-it-suite/target/core-it-suite-2.1-SNAPSHOT.jar
[INFO] 
[INFO] --- maven-jar-plugin:2.2:test-jar (default) @ core-it-suite ---
[INFO] Building jar: /home/hudson/workspace/maven-core-integration-testing/label/ubuntu/maven-its/core-it-suite/target/core-it-suite-2.1-SNAPSHOT-tests.jar
[INFO] 
[INFO] --- maven-install-plugin:2.2:install (default-install) @ core-it-suite ---
[INFO] Installing /home/hudson/workspace/maven-core-integration-testing/label/ubuntu/maven-its/core-it-suite/target/core-it-suite-2.1-SNAPSHOT.jar
to /opt/repos/local-repository/org/apache/maven/its/core-it-suite/2.1-SNAPSHOT/core-it-suite-2.1-SNAPSHOT.jar
[INFO] Installing /home/hudson/workspace/maven-core-integration-testing/label/ubuntu/maven-its/core-it-suite/target/core-it-suite-2.1-SNAPSHOT-tests.jar
to /opt/repos/local-repository/org/apache/maven/its/core-it-suite/2.1-SNAPSHOT/core-it-suite-2.1-SNAPSHOT-tests.jar
[INFO] 
[INFO] --- maven-deploy-plugin:2.4:deploy (default-deploy) @ core-it-suite ---
[INFO] Retrieving previous build number from apache.snapshots.https
Uploading: http://repository.sonatype.org:8081/content/repositories/maven.snapshots/org/apache/maven/its/core-it-suite/2.1-SNAPSHOT/core-it-suite-2.1-20100106.140633-546.jar
9 KB uploaded
[INFO] Retrieving previous metadata from apache.snapshots.https
[INFO] Uploading repository metadata for: 'snapshot org.apache.maven.its:core-it-suite:2.1-SNAPSHOT'
[INFO] Retrieving previous metadata from apache.snapshots.https
[INFO] Uploading repository metadata for: 'artifact org.apache.maven.its:core-it-suite'
[INFO] Uploading project information for core-it-suite 2.1-20100106.140633-546
[INFO] Retrieving previous build number from apache.snapshots.https
Uploading: http://repository.sonatype.org:8081/content/repositories/maven.snapshots/org/apache/maven/its/core-it-suite/2.1-SNAPSHOT/core-it-suite-2.1-20100106.140633-546-tests.jar
3004 KB uploaded at 53625.5 KB/sec
[INFO] ------------------------------------------------------------------------
[INFO] Reactor Summary:
[INFO] 
[INFO] Maven Integration Tests Parent .................... SUCCESS [23.225s]
[INFO] Maven Integration Testing Support ................. SUCCESS [6.217s]
[INFO] Maven Integration Tests :: Plugins ................ SUCCESS [5.429s]
[INFO] Maven Integration Test Plugin :: Active Collection  SUCCESS [13.921s]
[INFO] Maven Integration Test Plugin :: Ant-Based ........ SUCCESS [28.595s]
[INFO] Maven Integration Test Plugin :: Artifact ......... SUCCESS [5.879s]
[INFO] Maven Integration Test Plugin :: Class Loader :: Aggregator  SUCCESS [3.582s]
[INFO] Maven Integration Test Plugin :: Class Loader :: Dependency A  SUCCESS [7.740s]
[INFO] Maven Integration Test Plugin :: Class Loader :: Dependency B  SUCCESS [4.662s]
[INFO] Maven Integration Test Plugin :: Class Loader ..... SUCCESS [13.971s]
[INFO] Maven Integration Test Plugin :: Configuration .... SUCCESS [5.912s]
[INFO] Maven Integration Test Plugin :: Context Passing .. SUCCESS [10.076s]
[INFO] Maven Integration Tests :: Core Plugin Stubs ...... SUCCESS [3.878s]
[INFO] Maven Integration Test Plugin :: Maven Clean Plugin Stub  SUCCESS [7.079s]
[INFO] Maven Integration Test Plugin :: Maven Compiler Plugin Stub  SUCCESS [5.985s]
[INFO] Maven Integration Test Plugin :: Maven Deploy Plugin Stub  SUCCESS [5.677s]
[INFO] Maven Integration Test Plugin :: Maven EAR Plugin Stub  SUCCESS [5.442s]
[INFO] Maven Integration Test Plugin :: Maven EJB Plugin Stub  SUCCESS [20.862s]
[INFO] Maven Integration Test Plugin :: Maven Install Plugin Stub  SUCCESS [5.657s]
[INFO] Maven Integration Test Plugin :: Maven JAR Plugin Stub  SUCCESS [4.865s]
[INFO] Maven Integration Test Plugin :: Maven Javadoc Plugin Stub  SUCCESS [5.717s]
[INFO] Maven Integration Test Plugin :: Maven Plugin Plugin Stub  SUCCESS [7.873s]
[INFO] Maven Integration Test Plugin :: Maven RAR Plugin Stub  SUCCESS [5.621s]
[INFO] Maven Integration Test Plugin :: Maven Resources Plugin Stub  SUCCESS [10.011s]
[INFO] Maven Integration Test Plugin :: Maven Site Plugin Stub  SUCCESS [4.952s]
[INFO] Maven Integration Test Plugin :: Maven Source Plugin Stub  SUCCESS [7.124s]
[INFO] Maven Integration Test Plugin :: Maven Surefire Plugin Stub  SUCCESS [7.310s]
[INFO] Maven Integration Test Plugin :: Maven WAR Plugin Stub  SUCCESS [11.601s]
[INFO] Maven Integration Test Plugin :: Dependency Collection  SUCCESS [5.779s]
[INFO] Maven Integration Test Plugin :: Dependency Resolution  SUCCESS [4.916s]
[INFO] Maven Integration Test Plugin :: Expression ....... SUCCESS [9.450s]
[INFO] Maven Integration Test Plugin :: Error Mojos ...... SUCCESS [7.072s]
[INFO] Maven Integration Test Component .................. FAILURE [0.556s]
[INFO] Maven Integration Test Plugin :: Extension Consumer  SKIPPED
[INFO] Maven Integration Test Plugin :: Extension Provider  SKIPPED
[INFO] Maven Integration Test Plugin :: Fork ............. SUCCESS [13.080s]
[INFO] Maven Integration Test Plugin :: Invalid Descriptor  SUCCESS [7.412s]
[INFO] Maven Integration Test Plugin :: Log File ......... SUCCESS [8.365s]
[INFO] Maven Integration Test Plugin :: No Default Component  SUCCESS [5.152s]
[INFO] Maven Integration Test Plugin :: No Project ....... SUCCESS [5.153s]
[INFO] Maven Integration Test Plugin :: Online ........... SUCCESS [7.171s]
[INFO] Maven Integration Test Plugin :: Optional Mojos ... SUCCESS [6.034s]
[INFO] Maven Integration Test Plugin :: Packaging ........ SUCCESS [13.505s]
[INFO] Maven Integration Test Plugin :: Parameter Implementation  SUCCESS [9.619s]
[INFO] Maven Integration Test Plugin :: Plugin Dependency  SUCCESS [6.516s]
[INFO] Maven Integration Test Helper Library ............. SUCCESS [6.361s]
[INFO] Maven Integration Test Plugin :: Project Interpolation  SUCCESS [7.118s]
[INFO] Maven Integration Test Plugin :: Setter ........... SUCCESS [6.153s]
[INFO] Maven Integration Test Plugin :: Singleton Component  SUCCESS [9.857s]
[INFO] Maven Integration Test Plugin :: Site ............. SUCCESS [5.490s]
[INFO] Maven Integration Test Plugin :: Toolchain ........ SUCCESS [11.146s]
[INFO] Maven Integration Test Plugin :: Touch ............ SUCCESS [14.878s]
[INFO] Maven Integration Test Plugin :: Uses Properties Plugin  SUCCESS [5.303s]
[INFO] Maven Integration Test Plugin :: Uses Wagon Plugin  SUCCESS [6.848s]
[INFO] Maven Integration Test Plugin :: This plugin should contain the mojos needed by all
tests.  SUCCESS [5.351s]
[INFO] Maven Integration Test Plugin :: Plexus Utils 1.1 . SUCCESS [14.639s]
[INFO] Maven Integration Test Plugin :: Plexus Utils New . SUCCESS [6.315s]
[INFO] Maven Integration Test Plugin :: Plexus Component API  SUCCESS [8.291s]
[INFO] Maven Integration Test Plugin :: Log4J Client ..... SUCCESS [4.694s]
[INFO] Unnamed - org.apache.maven.its.plugins:maven-it-plugin-extension1:maven-plugin:2.1-SNAPSHOT
 SUCCESS [5.023s]
[INFO] Unnamed - org.apache.maven.its.plugins:maven-it-plugin-extension2:maven-plugin:2.1-SNAPSHOT
 SUCCESS [12.441s]
[INFO] Maven Integration Test Wagon ...................... SUCCESS [8.781s]
[INFO] Maven Integration Test Support Artifacts .......... SUCCESS [9.244s]
[INFO] Maven Integration Test Extension .................. SUCCESS [4.715s]
[INFO] Maven Integration Tests ........................... SUCCESS [18.625s]
[INFO] ------------------------------------------------------------------------
[INFO] BUILD FAILURE
[INFO] ------------------------------------------------------------------------
[INFO] Total time: 8:51.027s
[INFO] Finished at: Wed Jan 06 08:15:20 CST 2010
[INFO] Final Memory: 81M/183M
[INFO] ------------------------------------------------------------------------
[ERROR] Failed to execute goal org.apache.maven.plugins:maven-surefire-plugin:2.5-SNAPSHOT:test
(default-test) on project core-it-component: Execution default-test of goal org.apache.maven.plugins:maven-surefire-plugin:2.5-SNAPSHOT:test
failed. NullPointerException -> [Help 1]
org.apache.maven.lifecycle.LifecycleExecutionException: Failed to execute goal org.apache.maven.plugins:maven-surefire-plugin:2.5-SNAPSHOT:test
(default-test) on project core-it-component: Execution default-test of goal org.apache.maven.plugins:maven-surefire-plugin:2.5-SNAPSHOT:test
failed.
	at org.apache.maven.lifecycle.DefaultLifecycleExecutor.execute(DefaultLifecycleExecutor.java:578)
	at org.apache.maven.lifecycle.DefaultLifecycleExecutor.execute(DefaultLifecycleExecutor.java:317)
	at org.apache.maven.DefaultMaven.doExecute(DefaultMaven.java:247)
	at org.apache.maven.DefaultMaven.execute(DefaultMaven.java:104)
	at org.apache.maven.cli.MavenCli.execute(MavenCli.java:423)
	at org.apache.maven.cli.MavenCli.doMain(MavenCli.java:158)
	at org.apache.maven.cli.MavenCli.main(MavenCli.java:123)
	at sun.reflect.NativeMethodAccessorImpl.invoke0(Native Method)
	at sun.reflect.NativeMethodAccessorImpl.invoke(NativeMethodAccessorImpl.java:39)
	at sun.reflect.DelegatingMethodAccessorImpl.invoke(DelegatingMethodAccessorImpl.java:25)
	at java.lang.reflect.Method.invoke(Method.java:597)
	at org.codehaus.plexus.classworlds.launcher.Launcher.launchEnhanced(Launcher.java:290)
	at org.codehaus.plexus.classworlds.launcher.Launcher.launch(Launcher.java:230)
	at org.codehaus.plexus.classworlds.launcher.Launcher.mainWithExitCode(Launcher.java:409)
	at org.codehaus.plexus.classworlds.launcher.Launcher.main(Launcher.java:352)
Caused by: org.apache.maven.plugin.PluginExecutionException: Execution default-test of goal
org.apache.maven.plugins:maven-surefire-plugin:2.5-SNAPSHOT:test failed.
	at org.apache.maven.plugin.DefaultBuildPluginManager.executeMojo(DefaultBuildPluginManager.java:114)
	at org.apache.maven.lifecycle.DefaultLifecycleExecutor.execute(DefaultLifecycleExecutor.java:562)
	... 14 more
Caused by: java.lang.NullPointerException
	at org.apache.maven.plugin.surefire.SurefirePlugin.isWithinVersionSpec(SurefirePlugin.java:727)
	at org.apache.maven.plugin.surefire.SurefirePlugin.isJunit47Compatible(SurefirePlugin.java:717)
	at org.apache.maven.plugin.surefire.SurefirePlugin.constructSurefireBooter(SurefirePlugin.java:788)
	at org.apache.maven.plugin.surefire.SurefirePlugin.execute(SurefirePlugin.java:573)
	at org.apache.maven.plugin.DefaultBuildPluginManager.executeMojo(DefaultBuildPluginManager.java:105)
	... 15 more
[ERROR] 
[ERROR] Re-run Maven using the -X switch to enable full debug logging.
[ERROR] 
[ERROR] For more information about the errors and possible solutions, please read the following
articles:
[ERROR] [Help 1] http://cwiki.apache.org/confluence/display/MAVEN/PluginExecutionException
[ERROR] 
[ERROR] After correcting the problems, you can resume the build with the command
[ERROR]   mvn <goals> -rf :core-it-component


Mime
View raw message