maven-notifications mailing list archives

Site index · List index
Message view « Date » · « Thread »
Top « Date » · « Thread »
From Hudson <Hud...@sonatype.org>
Subject Build failed in Hudson: wagon » ubuntu #61
Date Fri, 08 Jan 2010 21:13:05 GMT
See <http://grid.sonatype.org/ci/job/wagon/./label=ubuntu/61/>

------------------------------------------
[...truncated 7916 lines...]
#
Transfer finished. 19 bytes copied in 0.0 seconds
https://localhost:10007/newfolder/folder2/directory-copy-existing/a/test-resource-2.txt -
Status code: 200
last-modified = Fri, 08 Jan 2010 21:13:01 GMT (1262985181000)
attempting to create parent directories for destination: test-resource-2.txt
Downloading: directory-copy-existing/a/test-resource-2.txt from https://localhost:10007/newfolder/folder2

#
Transfer finished. 21 bytes copied in 0.0 seconds
https://localhost:10007/newfolder/folder2/directory-copy-existing/a/b/test-resource-3.txt
- Status code: 200
last-modified = Fri, 08 Jan 2010 21:13:01 GMT (1262985181000)
attempting to create parent directories for destination: test-resource-3.txt
Downloading: directory-copy-existing/a/b/test-resource-3.txt from https://localhost:10007/newfolder/folder2

#
Transfer finished. 23 bytes copied in 0.0 seconds
https://localhost:10007/newfolder/folder2/directory-copy-existing/c/test-resource-4.txt -
Status code: 200
last-modified = Fri, 08 Jan 2010 21:13:01 GMT (1262985181000)
attempting to create parent directories for destination: test-resource-4.txt
Downloading: directory-copy-existing/c/test-resource-4.txt from https://localhost:10007/newfolder/folder2

#
Transfer finished. 21 bytes copied in 0.0 seconds
https://localhost:10007/newfolder/folder2 - Session: Disconnecting  
https://localhost:10007/newfolder/folder2 - Session: Disconnected
Local repository: Repository[file:///home/hudson/workspace/wagon/label/ubuntu/trunk/wagon-providers/wagon-webdav-jackrabbit/target/test-output/local-repository]
https://localhost:10007/newfolder/folder2 - Session: Opened  
Uploading: ./a/test-resource-2.txt to https://localhost:10007/newfolder/folder2

#https://localhost:10007/newfolder/folder2/./a/test-resource-2.txt - Status code: 201

Transfer finished. 21 bytes copied in 0.0050 seconds
Uploading: ./a/b/test-resource-3.txt to https://localhost:10007/newfolder/folder2

#https://localhost:10007/newfolder/folder2/./a/b/test-resource-3.txt - Status code: 201

Transfer finished. 23 bytes copied in 0.0050 seconds
Uploading: ./test-resource-1.txt to https://localhost:10007/newfolder/folder2

#https://localhost:10007/newfolder/folder2/./test-resource-1.txt - Status code: 201

Transfer finished. 19 bytes copied in 0.0050 seconds
Uploading: ./c/test-resource-4.txt to https://localhost:10007/newfolder/folder2

#https://localhost:10007/newfolder/folder2/./c/test-resource-4.txt - Status code: 201

Transfer finished. 21 bytes copied in 0.0040 seconds
https://localhost:10007/newfolder/folder2/test-resource-1.txt - Status code: 200
last-modified = Fri, 08 Jan 2010 21:13:01 GMT (1262985181000)
attempting to create parent directories for destination: test-resource-1.txt
Downloading: test-resource-1.txt from https://localhost:10007/newfolder/folder2

#
Transfer finished. 19 bytes copied in 0.0010 seconds
https://localhost:10007/newfolder/folder2/a/test-resource-2.txt - Status code: 200
last-modified = Fri, 08 Jan 2010 21:13:01 GMT (1262985181000)
attempting to create parent directories for destination: test-resource-2.txt
Downloading: a/test-resource-2.txt from https://localhost:10007/newfolder/folder2

#
Transfer finished. 21 bytes copied in 0.0010 seconds
https://localhost:10007/newfolder/folder2/a/b/test-resource-3.txt - Status code: 200
last-modified = Fri, 08 Jan 2010 21:13:01 GMT (1262985181000)
attempting to create parent directories for destination: test-resource-3.txt
Downloading: a/b/test-resource-3.txt from https://localhost:10007/newfolder/folder2

#
Transfer finished. 23 bytes copied in 0.0 seconds
https://localhost:10007/newfolder/folder2/c/test-resource-4.txt - Status code: 200
last-modified = Fri, 08 Jan 2010 21:13:01 GMT (1262985181000)
attempting to create parent directories for destination: test-resource-4.txt
Downloading: c/test-resource-4.txt from https://localhost:10007/newfolder/folder2

#
Transfer finished. 21 bytes copied in 0.0 seconds
https://localhost:10007/newfolder/folder2 - Session: Disconnecting  
https://localhost:10007/newfolder/folder2 - Session: Disconnected
Local repository: Repository[file:///home/hudson/workspace/wagon/label/ubuntu/trunk/wagon-providers/wagon-webdav-jackrabbit/target/test-output/local-repository]
Getting test artifact from test repository Repository[davs://localhost:10007/newfolder/folder2]
https://localhost:10007/newfolder/folder2 - Session: Opened  
https://localhost:10007/newfolder/folder2/fubar.txt - Status code: 404
 Transfer error: org.apache.maven.wagon.ResourceDoesNotExistException: File: https://localhost:10007/newfolder/folder2/fubar.txt
does not exist
https://localhost:10007/newfolder/folder2 - Session: Disconnecting  
https://localhost:10007/newfolder/folder2 - Session: Disconnected
Local repository: Repository[file:///home/hudson/workspace/wagon/label/ubuntu/trunk/wagon-providers/wagon-webdav-jackrabbit/target/test-output/local-repository]
Getting test artifact from test repository Repository[davs://localhost:10007/newfolder/folder2]
https://localhost:10007/newfolder/folder2 - Session: Opened  
https://localhost:10007/newfolder/folder2/fubar.txt - Status code: 404
 Transfer error: org.apache.maven.wagon.ResourceDoesNotExistException: File: https://localhost:10007/newfolder/folder2/fubar.txt
does not exist
https://localhost:10007/newfolder/folder2 - Session: Disconnecting  
https://localhost:10007/newfolder/folder2 - Session: Disconnected
Local repository: Repository[file:///home/hudson/workspace/wagon/label/ubuntu/trunk/wagon-providers/wagon-webdav-jackrabbit/target/test-output/local-repository]
https://localhost:10007/newfolder/folder2 - Session: Opened  
https://localhost:10007/newfolder/folder2 - Session: Disconnecting  
https://localhost:10007/newfolder/folder2 - Session: Disconnected
Local repository: Repository[file:///home/hudson/workspace/wagon/label/ubuntu/trunk/wagon-providers/wagon-webdav-jackrabbit/target/test-output/local-repository]
Putting test artifact: test-resource into test repository Repository[davs://localhost:10007/newfolder/folder2]
https://localhost:10007/newfolder/folder2 - Session: Opened  
Uploading: test-resource to https://localhost:10007/newfolder/folder2

#https://localhost:10007/newfolder/folder2/test-resource - Status code: 201

Transfer finished. 18 bytes copied in 0.0080 seconds
https://localhost:10007/newfolder/folder2 - Session: Disconnecting  
https://localhost:10007/newfolder/folder2 - Session: Disconnected
https://localhost:10007/newfolder/folder2 - Session: Opened  
https://localhost:10007/newfolder/folder2 - Session: Disconnecting  
https://localhost:10007/newfolder/folder2 - Session: Disconnected
Local repository: Repository[file:///home/hudson/workspace/wagon/label/ubuntu/trunk/wagon-providers/wagon-webdav-jackrabbit/target/test-output/local-repository]
https://localhost:10007/newfolder/folder2 - Session: Opened  
https://localhost:10007/newfolder/folder2 - Session: Disconnecting  
https://localhost:10007/newfolder/folder2 - Session: Disconnected
Tests run: 51, Failures: 0, Errors: 0, Skipped: 0, Time elapsed: 5.82 sec

Results :

Tests run: 103, Failures: 0, Errors: 0, Skipped: 0

[INFO] 
[INFO] --- maven-jar-plugin:2.2:jar (default-jar) @ wagon-webdav-jackrabbit ---
[INFO] Building jar: /home/hudson/workspace/wagon/label/ubuntu/trunk/wagon-providers/wagon-webdav-jackrabbit/target/wagon-webdav-jackrabbit-1.0-beta-7-SNAPSHOT.jar
[INFO] 
[INFO] --- maven-install-plugin:2.2:install (default-install) @ wagon-webdav-jackrabbit ---
[INFO] Installing /home/hudson/workspace/wagon/label/ubuntu/trunk/wagon-providers/wagon-webdav-jackrabbit/target/wagon-webdav-jackrabbit-1.0-beta-7-SNAPSHOT.jar
to /opt/repos/wagon/org/apache/maven/wagon/wagon-webdav-jackrabbit/1.0-beta-7-SNAPSHOT/wagon-webdav-jackrabbit-1.0-beta-7-SNAPSHOT.jar
[INFO]                                                                         
[INFO] ------------------------------------------------------------------------
[INFO] Building Maven Test Compatibility Kits 1.0-beta-7-SNAPSHOT
[INFO] ------------------------------------------------------------------------
[INFO] 
[INFO] --- maven-clean-plugin:2.3:clean (default-clean) @ wagon-tcks ---
[INFO] Deleting file set: /home/hudson/workspace/wagon/label/ubuntu/trunk/wagon-tcks/target
(included: [**], excluded: [])
[INFO] 
[INFO] --- plexus-maven-plugin:1.3.5:descriptor (generate) @ wagon-tcks ---
[INFO] 
[INFO] --- maven-remote-resources-plugin:1.0:process (default) @ wagon-tcks ---
[INFO] 
[INFO] --- maven-install-plugin:2.2:install (default-install) @ wagon-tcks ---
[INFO] Installing /home/hudson/workspace/wagon/label/ubuntu/trunk/wagon-tcks/pom.xml to /opt/repos/wagon/org/apache/maven/wagon/wagon-tcks/1.0-beta-7-SNAPSHOT/wagon-tcks-1.0-beta-7-SNAPSHOT.pom
[INFO]                                                                         
[INFO] ------------------------------------------------------------------------
[INFO] Building Wagon HTTP Test Compatibility Kit 1.0-beta-7-SNAPSHOT
[INFO] ------------------------------------------------------------------------
[INFO] 
[INFO] --- maven-clean-plugin:2.3:clean (default-clean) @ wagon-tck-http ---
[INFO] Deleting file set: /home/hudson/workspace/wagon/label/ubuntu/trunk/wagon-tcks/wagon-tck-http/target
(included: [**], excluded: [])
[INFO] 
[INFO] --- plexus-maven-plugin:1.3.5:descriptor (generate) @ wagon-tck-http ---
[INFO] 
[INFO] --- maven-remote-resources-plugin:1.0:process (default) @ wagon-tck-http ---
[INFO] 
[INFO] --- maven-resources-plugin:2.3:resources (default-resources) @ wagon-tck-http ---
[INFO] Using 'UTF-8' encoding to copy filtered resources.
[INFO] Copying 4 resources
[INFO] skip non existing resourceDirectory /home/hudson/workspace/wagon/label/ubuntu/trunk/wagon-tcks/wagon-tck-http/target/generated-resources/plexus
[INFO] Copying 3 resources
[INFO] 
[INFO] --- maven-compiler-plugin:2.0.2:compile (default-compile) @ wagon-tck-http ---
[INFO] Compiling 15 source files to /home/hudson/workspace/wagon/label/ubuntu/trunk/wagon-tcks/wagon-tck-http/target/classes
[INFO] 
[INFO] --- maven-resources-plugin:2.3:testResources (default-testResources) @ wagon-tck-http
---
[INFO] Using 'UTF-8' encoding to copy filtered resources.
[INFO] skip non existing resourceDirectory /home/hudson/workspace/wagon/label/ubuntu/trunk/wagon-tcks/wagon-tck-http/src/test/resources
[INFO] Copying 3 resources
[INFO] 
[INFO] --- maven-compiler-plugin:2.0.2:testCompile (default-testCompile) @ wagon-tck-http
---
[INFO] No sources to compile
[INFO] 
[INFO] --- maven-surefire-plugin:2.5:test (default-test) @ wagon-tck-http ---
[INFO] Surefire report directory: /home/hudson/workspace/wagon/label/ubuntu/trunk/wagon-tcks/wagon-tck-http/target/surefire-reports

-------------------------------------------------------
 T E S T S
-------------------------------------------------------
There are no tests to run.

Results :

Tests run: 0, Failures: 0, Errors: 0, Skipped: 0

[INFO] 
[INFO] --- maven-jar-plugin:2.2:jar (default-jar) @ wagon-tck-http ---
[INFO] Building jar: /home/hudson/workspace/wagon/label/ubuntu/trunk/wagon-tcks/wagon-tck-http/target/wagon-tck-http-1.0-beta-7-SNAPSHOT.jar
[INFO] 
[INFO] --- maven-install-plugin:2.2:install (default-install) @ wagon-tck-http ---
[INFO] Installing /home/hudson/workspace/wagon/label/ubuntu/trunk/wagon-tcks/wagon-tck-http/target/wagon-tck-http-1.0-beta-7-SNAPSHOT.jar
to /opt/repos/wagon/org/apache/maven/wagon/wagon-tck-http/1.0-beta-7-SNAPSHOT/wagon-tck-http-1.0-beta-7-SNAPSHOT.jar
[INFO] ------------------------------------------------------------------------
[INFO] Reactor Summary:
[INFO] 
[INFO] Maven Wagon ....................................... SUCCESS [1.584s]
[INFO] Maven Wagon API ................................... SUCCESS [3.760s]
[INFO] Maven Wagon Provider Test ......................... SUCCESS [1.159s]
[INFO] Maven Wagon Providers ............................. SUCCESS [0.164s]
[INFO] Maven Wagon File Provider ......................... SUCCESS [2.028s]
[INFO] Maven Wagon FTP Provider .......................... SUCCESS [15.862s]
[INFO] Maven Wagon HTTP Shared Library ................... SUCCESS [1.930s]
[INFO] Maven Wagon Lightweight HTTP Provider ............. FAILURE [6.236s]
[INFO] Maven Wagon HTTP Provider ......................... SUCCESS [2:16.758s]
[INFO] Maven Wagon SCM Provider .......................... SUCCESS [55.249s]
[INFO] Maven Wagon SSH Common Library .................... SUCCESS [1.713s]
[INFO] Maven Wagon SSH Common Tests ...................... SUCCESS [1.061s]
[INFO] Maven Wagon SSH External Provider ................. SUCCESS [2.038s]
[INFO] Maven Wagon SSH Provider .......................... SUCCESS [2.079s]
[INFO] Maven Wagon WebDav Provider ....................... SUCCESS [12.897s]
[INFO] Maven Test Compatibility Kits ..................... SUCCESS [0.109s]
[INFO] Wagon HTTP Test Compatibility Kit ................. SUCCESS [1.397s]
[INFO] ------------------------------------------------------------------------
[INFO] BUILD FAILURE
[INFO] ------------------------------------------------------------------------
[INFO] Total time: 4:06.465s
[INFO] Finished at: Fri Jan 08 15:13:04 CST 2010
[INFO] Final Memory: 44M/94M
[INFO] ------------------------------------------------------------------------
[ERROR] Failed to execute goal org.apache.maven.plugins:maven-surefire-plugin:2.5:test (default-test)
on project wagon-http-lightweight: There are test failures.

Please refer to /home/hudson/workspace/wagon/label/ubuntu/trunk/wagon-providers/wagon-http-lightweight/target/surefire-reports
for the individual test results.
-> [Help 1]
org.apache.maven.lifecycle.LifecycleExecutionException: Failed to execute goal org.apache.maven.plugins:maven-surefire-plugin:2.5:test
(default-test) on project wagon-http-lightweight: There are test failures.

Please refer to /home/hudson/workspace/wagon/label/ubuntu/trunk/wagon-providers/wagon-http-lightweight/target/surefire-reports
for the individual test results.
	at org.apache.maven.lifecycle.DefaultLifecycleExecutor.execute(DefaultLifecycleExecutor.java:566)
	at org.apache.maven.lifecycle.DefaultLifecycleExecutor.execute(DefaultLifecycleExecutor.java:317)
	at org.apache.maven.DefaultMaven.doExecute(DefaultMaven.java:247)
	at org.apache.maven.DefaultMaven.execute(DefaultMaven.java:104)
	at org.apache.maven.cli.MavenCli.execute(MavenCli.java:423)
	at org.apache.maven.cli.MavenCli.doMain(MavenCli.java:158)
	at org.apache.maven.cli.MavenCli.main(MavenCli.java:123)
	at sun.reflect.NativeMethodAccessorImpl.invoke0(Native Method)
	at sun.reflect.NativeMethodAccessorImpl.invoke(NativeMethodAccessorImpl.java:39)
	at sun.reflect.DelegatingMethodAccessorImpl.invoke(DelegatingMethodAccessorImpl.java:25)
	at java.lang.reflect.Method.invoke(Method.java:597)
	at org.codehaus.plexus.classworlds.launcher.Launcher.launchEnhanced(Launcher.java:290)
	at org.codehaus.plexus.classworlds.launcher.Launcher.launch(Launcher.java:230)
	at org.codehaus.plexus.classworlds.launcher.Launcher.mainWithExitCode(Launcher.java:409)
	at org.codehaus.plexus.classworlds.launcher.Launcher.main(Launcher.java:352)
Caused by: org.apache.maven.plugin.MojoFailureException: There are test failures.

Please refer to /home/hudson/workspace/wagon/label/ubuntu/trunk/wagon-providers/wagon-http-lightweight/target/surefire-reports
for the individual test results.
	at org.apache.maven.plugin.surefire.SurefirePlugin.execute(SurefirePlugin.java:619)
	at org.apache.maven.plugin.DefaultBuildPluginManager.executeMojo(DefaultBuildPluginManager.java:105)
	at org.apache.maven.lifecycle.DefaultLifecycleExecutor.execute(DefaultLifecycleExecutor.java:562)
	... 14 more
[ERROR] 
[ERROR] Re-run Maven using the -X switch to enable full debug logging.
[ERROR] 
[ERROR] For more information about the errors and possible solutions, please read the following
articles:
[ERROR] [Help 1] http://cwiki.apache.org/confluence/display/MAVEN/MojoFailureException
[ERROR] 
[ERROR] After correcting the problems, you can resume the build with the command
[ERROR]   mvn <goals> -rf :wagon-http-lightweight


Mime
View raw message