maven-notifications mailing list archives

Site index · List index
Message view « Date » · « Thread »
Top « Date » · « Thread »
From Hudson <Hud...@sonatype.org>
Subject Build failed in Hudson: maven-shared » 1.5,windows #173
Date Wed, 09 Dec 2009 07:39:40 GMT
See <http://grid.sonatype.org/ci/job/maven-shared/./jdk=1.5,label=windows/173/changes>

Changes:

[Dennis Lundberg] [maven-release-plugin] prepare for next development iteration

[Dennis Lundberg] [maven-release-plugin] prepare release maven-doxia-tools-1.2

[Dennis Lundberg] [MSHARED-138] Update to doxia 1.1.2

------------------------------------------
[...truncated 2993 lines...]
3 KB downloaded at 229.8 KB/sec
Downloading: http://repository.sonatype.org:8081/content/groups/sonatype-public-grid/org/apache/maven/doxia/doxia-decoration-model/1.0-alpha-11/doxia-decoration-model-1.0-alpha-11.pom
3 KB downloaded at 226.3 KB/sec
Downloading: http://repository.sonatype.org:8081/content/groups/sonatype-public-grid/org/apache/maven/doxia/doxia-module-apt/1.0-alpha-11/doxia-module-apt-1.0-alpha-11.pom
3 KB downloaded at 196.5 KB/sec
Downloading: http://repository.sonatype.org:8081/content/groups/sonatype-public-grid/org/apache/maven/doxia/doxia-modules/1.0-alpha-11/doxia-modules-1.0-alpha-11.pom
3 KB downloaded at 230.0 KB/sec
Downloading: http://repository.sonatype.org:8081/content/groups/sonatype-public-grid/org/apache/maven/doxia/doxia-module-fml/1.0-alpha-11/doxia-module-fml-1.0-alpha-11.pom
3 KB downloaded at 235.3 KB/sec
Downloading: http://repository.sonatype.org:8081/content/groups/sonatype-public-grid/org/apache/maven/doxia/doxia-module-xdoc/1.0-alpha-11/doxia-module-xdoc-1.0-alpha-11.pom
3 KB downloaded at 215.0 KB/sec
Downloading: http://repository.sonatype.org:8081/content/groups/sonatype-public-grid/org/apache/maven/doxia/doxia-module-xhtml/1.0-alpha-11/doxia-module-xhtml-1.0-alpha-11.pom
2 KB downloaded at 151.7 KB/sec
Downloading: http://repository.sonatype.org:8081/content/groups/sonatype-public-grid/org/beanshell/bsh/2.0b4/bsh-2.0b4.pom
2 KB downloaded at 48.6 KB/sec
Downloading: http://repository.sonatype.org:8081/content/groups/sonatype-public-grid/org/beanshell/beanshell/2.0b4/beanshell-2.0b4.pom
2 KB downloaded at 137.9 KB/sec
Downloading: http://repository.sonatype.org:8081/content/groups/sonatype-public-grid/org/codehaus/groovy/groovy/1.5.6/groovy-1.5.6.pom
25 KB downloaded at 1660.8 KB/sec
Downloading: http://repository.sonatype.org:8081/content/groups/sonatype-public-grid/antlr/antlr/2.7.6/antlr-2.7.6.pom
230 B downloaded at 22.5 KB/sec
Downloading: http://repository.sonatype.org:8081/content/groups/sonatype-public-grid/asm/asm/2.2/asm-2.2.pom
807 B downloaded at 78.8 KB/sec
Downloading: http://repository.sonatype.org:8081/content/groups/sonatype-public-grid/org/apache/ant/ant/1.7.0/ant-1.7.0.pom
10 KB downloaded at 794.1 KB/sec
Downloading: http://repository.sonatype.org:8081/content/groups/sonatype-public-grid/org/apache/ant/ant-parent/1.7.0/ant-parent-1.7.0.pom
5 KB downloaded at 388.7 KB/sec
Downloading: http://repository.sonatype.org:8081/content/groups/sonatype-public-grid/org/apache/ant/ant-launcher/1.7.0/ant-launcher-1.7.0.pom
3 KB downloaded at 179.0 KB/sec
Downloading: http://repository.sonatype.org:8081/content/groups/sonatype-public-grid/asm/asm-util/2.2/asm-util-2.2.pom
817 B downloaded at 66.5 KB/sec
Downloading: http://repository.sonatype.org:8081/content/groups/sonatype-public-grid/asm/asm-analysis/2.2/asm-analysis-2.2.pom
825 B downloaded at 73.2 KB/sec
Downloading: http://repository.sonatype.org:8081/content/groups/sonatype-public-grid/asm/asm-tree/2.2/asm-tree-2.2.pom
817 B downloaded at 79.8 KB/sec
Downloading: http://repository.sonatype.org:8081/content/groups/sonatype-public-grid/jline/jline/0.9.94/jline-0.9.94.pom
7 KB downloaded at 477.7 KB/sec
Downloading: http://repository.sonatype.org:8081/content/groups/sonatype-public-grid/org/apache/ant/ant/1.7.1/ant-1.7.1.pom
10 KB downloaded at 317.6 KB/sec
Downloading: http://repository.sonatype.org:8081/content/groups/sonatype-public-grid/org/apache/ant/ant-parent/1.7.1/ant-parent-1.7.1.pom
5 KB downloaded at 356.3 KB/sec
Downloading: http://repository.sonatype.org:8081/content/groups/sonatype-public-grid/org/codehaus/plexus/plexus-interpolation/1.2/plexus-interpolation-1.2.pom
3 KB downloaded at 218.4 KB/sec
Downloading: http://repository.sonatype.org:8081/content/groups/sonatype-public-grid/org/apache/maven/shared/maven-invoker/2.0.11/maven-invoker-2.0.11.jar
29 KB downloaded at 2171.6 KB/sec
Downloading: http://repository.sonatype.org:8081/content/groups/sonatype-public-grid/org/apache/maven/doxia/doxia-sink-api/1.0-alpha-11/doxia-sink-api-1.0-alpha-11.jar
10 KB downloaded at 875.3 KB/sec
Downloading: http://repository.sonatype.org:8081/content/groups/sonatype-public-grid/org/apache/maven/reporting/maven-reporting-impl/2.0.4.1/maven-reporting-impl-2.0.4.1.jar
19 KB downloaded at 1652.8 KB/sec
Downloading: http://repository.sonatype.org:8081/content/groups/sonatype-public-grid/commons-collections/commons-collections/3.2/commons-collections-3.2.jar
558 KB downloaded at 17995.8 KB/sec
Downloading: http://repository.sonatype.org:8081/content/groups/sonatype-public-grid/org/apache/maven/doxia/doxia-core/1.0-alpha-10/doxia-core-1.0-alpha-10.jar
54 KB downloaded at 3811.0 KB/sec
Downloading: http://repository.sonatype.org:8081/content/groups/sonatype-public-grid/org/apache/maven/doxia/doxia-site-renderer/1.0-alpha-11/doxia-site-renderer-1.0-alpha-11.jar
45 KB downloaded at 1951.4 KB/sec
Downloading: http://repository.sonatype.org:8081/content/groups/sonatype-public-grid/org/codehaus/plexus/plexus-velocity/1.1.7/plexus-velocity-1.1.7.jar
8 KB downloaded at 680.8 KB/sec
Downloading: http://repository.sonatype.org:8081/content/groups/sonatype-public-grid/org/apache/velocity/velocity/1.5/velocity-1.5.jar
383 KB downloaded at 15317.3 KB/sec
Downloading: http://repository.sonatype.org:8081/content/groups/sonatype-public-grid/org/apache/maven/doxia/doxia-decoration-model/1.0-alpha-11/doxia-decoration-model-1.0-alpha-11.jar
49 KB downloaded at 3038.9 KB/sec
Downloading: http://repository.sonatype.org:8081/content/groups/sonatype-public-grid/org/apache/maven/doxia/doxia-module-apt/1.0-alpha-11/doxia-module-apt-1.0-alpha-11.jar
46 KB downloaded at 3044.2 KB/sec
Downloading: http://repository.sonatype.org:8081/content/groups/sonatype-public-grid/org/apache/maven/doxia/doxia-module-fml/1.0-alpha-11/doxia-module-fml-1.0-alpha-11.jar
18 KB downloaded at 1483.3 KB/sec
Downloading: http://repository.sonatype.org:8081/content/groups/sonatype-public-grid/org/apache/maven/doxia/doxia-module-xdoc/1.0-alpha-11/doxia-module-xdoc-1.0-alpha-11.jar
27 KB downloaded at 2064.2 KB/sec
Downloading: http://repository.sonatype.org:8081/content/groups/sonatype-public-grid/org/apache/maven/doxia/doxia-module-xhtml/1.0-alpha-11/doxia-module-xhtml-1.0-alpha-11.jar
21 KB downloaded at 1906.8 KB/sec
Downloading: http://repository.sonatype.org:8081/content/groups/sonatype-public-grid/org/beanshell/bsh/2.0b4/bsh-2.0b4.jar
276 KB downloaded at 13099.6 KB/sec
Downloading: http://repository.sonatype.org:8081/content/groups/sonatype-public-grid/org/codehaus/groovy/groovy/1.5.6/groovy-1.5.6.jar
2252 KB downloaded at 26486.7 KB/sec
Downloading: http://repository.sonatype.org:8081/content/groups/sonatype-public-grid/antlr/antlr/2.7.6/antlr-2.7.6.jar
434 KB downloaded at 17321.6 KB/sec
Downloading: http://repository.sonatype.org:8081/content/groups/sonatype-public-grid/asm/asm/2.2/asm-2.2.jar
34 KB downloaded at 3087.5 KB/sec
Downloading: http://repository.sonatype.org:8081/content/groups/sonatype-public-grid/org/apache/ant/ant/1.7.1/ant-1.7.1.jar
1292 KB downloaded at 24377.3 KB/sec
Downloading: http://repository.sonatype.org:8081/content/groups/sonatype-public-grid/org/apache/ant/ant-launcher/1.7.0/ant-launcher-1.7.0.jar
12 KB downloaded at 1145.9 KB/sec
Downloading: http://repository.sonatype.org:8081/content/groups/sonatype-public-grid/asm/asm-util/2.2/asm-util-2.2.jar
33 KB downloaded at 401.1 KB/sec
Downloading: http://repository.sonatype.org:8081/content/groups/sonatype-public-grid/asm/asm-analysis/2.2/asm-analysis-2.2.jar
18 KB downloaded at 1337.6 KB/sec
Downloading: http://repository.sonatype.org:8081/content/groups/sonatype-public-grid/asm/asm-tree/2.2/asm-tree-2.2.jar
16 KB downloaded at 1443.7 KB/sec
Downloading: http://repository.sonatype.org:8081/content/groups/sonatype-public-grid/jline/jline/0.9.94/jline-0.9.94.jar
86 KB downloaded at 6091.3 KB/sec
Downloading: http://repository.sonatype.org:8081/content/groups/sonatype-public-grid/org/codehaus/plexus/plexus-interpolation/1.2/plexus-interpolation-1.2.jar
36 KB downloaded at 1250.4 KB/sec
[INFO] Installing C:\home\hudson\workspace\maven-shared\jdk\1.5\label\windows\trunk\maven-artifact-resolver\pom.xml
to C:\home\hudson\workspace\maven-shared\jdk\1.5\label\windows\trunk\maven-artifact-resolver\target\local-repo\org\apache\maven\shared\maven-artifact-resolver\1.1-SNAPSHOT\maven-artifact-resolver-1.1-SNAPSHOT.pom
[INFO] Installing C:\home\hudson\workspace\maven-shared\jdk\1.5\label\windows\trunk\maven-artifact-resolver\target\maven-artifact-resolver-1.1-SNAPSHOT.jar
to C:\home\hudson\workspace\maven-shared\jdk\1.5\label\windows\trunk\maven-artifact-resolver\target\local-repo\org\apache\maven\shared\maven-artifact-resolver\1.1-SNAPSHOT\maven-artifact-resolver-1.1-SNAPSHOT.jar
[INFO] 
[INFO] --- maven-invoker-plugin:1.4:run (integration-test) @ maven-artifact-resolver ---
[INFO] Building: minimal-dependencies\pom.xml
[INFO] ..SUCCESS (48.9 s)
[INFO] ---------------------------------------
[INFO] Execution Summary:
[INFO]   Builds Passing: 1
[INFO]   Builds Failing: 0
[INFO]   Builds Skipped: 0
[INFO] ---------------------------------------
[INFO] 
[INFO] --- maven-install-plugin:2.2:install (default-install) @ maven-artifact-resolver ---
[INFO] Installing C:\home\hudson\workspace\maven-shared\jdk\1.5\label\windows\trunk\maven-artifact-resolver\target\maven-artifact-resolver-1.1-SNAPSHOT.jar
to C:\opt\repos\maven-shared\org\apache\maven\shared\maven-artifact-resolver\1.1-SNAPSHOT\maven-artifact-resolver-1.1-SNAPSHOT.jar
[INFO] 
[INFO] --- maven-deploy-plugin:2.4:deploy (default-deploy) @ maven-artifact-resolver ---
[INFO] Retrieving previous build number from apache.snapshots.https
[INFO] repository metadata for: 'snapshot org.apache.maven.shared:maven-artifact-resolver:1.1-SNAPSHOT'
could not be found on repository: apache.snapshots.https, so will be created
[INFO] Uploading project information for maven-artifact-resolver 1.1-20091209.073008-1
[INFO] Retrieving previous metadata from apache.snapshots.https
[INFO] repository metadata for: 'snapshot org.apache.maven.shared:maven-artifact-resolver:1.1-SNAPSHOT'
could not be found on repository: apache.snapshots.https, so will be created
[INFO] Uploading repository metadata for: 'snapshot org.apache.maven.shared:maven-artifact-resolver:1.1-SNAPSHOT'
[INFO] Retrieving previous metadata from apache.snapshots.https
[INFO] repository metadata for: 'artifact org.apache.maven.shared:maven-artifact-resolver'
could not be found on repository: apache.snapshots.https, so will be created
[INFO] Uploading repository metadata for: 'artifact org.apache.maven.shared:maven-artifact-resolver'
[INFO] ------------------------------------------------------------------------
[INFO] Reactor Summary:
[INFO] 
[INFO] Maven Shared Components ........................... SUCCESS [15.566s]
[INFO] Maven File Management API ......................... SUCCESS [16.158s]
[INFO] Maven Ant ......................................... SUCCESS [7.397s]
[INFO] Maven Archiver .................................... SUCCESS [15.584s]
[INFO] Maven Common Artifact Filters ..................... SUCCESS [13.831s]
[INFO] Maven Dependency Analyzer ......................... SUCCESS [1:18.342s]
[INFO] Maven Dependency Tree ............................. SUCCESS [8.337s]
[INFO] Maven Downloader .................................. SUCCESS [2.207s]
[INFO] Maven Doxia Integration Tools ..................... SUCCESS [13.583s]
[INFO] Maven Filtering ................................... SUCCESS [11.323s]
[INFO] Maven Invoker ..................................... SUCCESS [49.224s]
[INFO] Maven Model Converter ............................. SUCCESS [6.549s]
[INFO] Maven OSGi integration ............................ SUCCESS [3.729s]
[INFO] Maven Reporting Implementation .................... FAILURE [2.227s]
[INFO] Maven Repository Builder .......................... SUCCESS [9.645s]
[INFO] Maven Runtime ..................................... SUCCESS [41.665s]
[INFO] Maven Shared I/O API .............................. SUCCESS [9.315s]
[INFO] Maven JAR Utilities ............................... SUCCESS [11.979s]
[INFO] Maven Shared Monitor API .......................... SUCCESS [2.099s]
[INFO] Maven Verifier Component .......................... SUCCESS [3.616s]
[INFO] Maven Artifact Resolution API ..................... SUCCESS [2:09.384s]
[INFO] ------------------------------------------------------------------------
[INFO] BUILD FAILURE
[INFO] ------------------------------------------------------------------------
[INFO] Total time: 7:33.199s
[INFO] Finished at: Tue Dec 08 23:37:32 PST 2009
[INFO] Final Memory: 36M/75M
[INFO] ------------------------------------------------------------------------
[ERROR] Missing:
----------
1) org.apache.maven.doxia:doxia-sink-api:jar:1.1.2-SNAPSHOT

  Try downloading the file manually from the project website.

  Then, install it using the command: 
      mvn install:install-file -DgroupId=org.apache.maven.doxia -DartifactId=doxia-sink-api
-Dversion=1.1.2-SNAPSHOT -Dpackaging=jar -Dfile=/path/to/file

  Alternatively, if you host your own repository you can deploy the file there: 
      mvn deploy:deploy-file -DgroupId=org.apache.maven.doxia -DartifactId=doxia-sink-api
-Dversion=1.1.2-SNAPSHOT -Dpackaging=jar -Dfile=/path/to/file -Durl=[url] -DrepositoryId=[id]

  Path to dependency: 
  	1) org.apache.maven.reporting:maven-reporting-impl:pom:pom:2.1-SNAPSHOT
  	2) org.apache.maven.doxia:doxia-sink-api:jar:1.1.2-SNAPSHOT

2) org.apache.maven.doxia:doxia-site-renderer:jar:1.1.2-SNAPSHOT

  Try downloading the file manually from the project website.

  Then, install it using the command: 
      mvn install:install-file -DgroupId=org.apache.maven.doxia -DartifactId=doxia-site-renderer
-Dversion=1.1.2-SNAPSHOT -Dpackaging=jar -Dfile=/path/to/file

  Alternatively, if you host your own repository you can deploy the file there: 
      mvn deploy:deploy-file -DgroupId=org.apache.maven.doxia -DartifactId=doxia-site-renderer
-Dversion=1.1.2-SNAPSHOT -Dpackaging=jar -Dfile=/path/to/file -Durl=[url] -DrepositoryId=[id]

  Path to dependency: 
  	1) org.apache.maven.reporting:maven-reporting-impl:pom:pom:2.1-SNAPSHOT
  	2) org.apache.maven.doxia:doxia-site-renderer:jar:1.1.2-SNAPSHOT

----------
2 required artifacts are missing.

for artifact: 
  org.apache.maven.reporting:maven-reporting-impl:pom:2.1-SNAPSHOT

from the specified remote repositories:
  Nexus (http://repository.sonatype.org:8081/content/groups/sonatype-public-grid, releases=true,
snapshots=true)
-> [Help 1]
org.apache.maven.artifact.resolver.MultipleArtifactsNotFoundException: Missing:
----------
1) org.apache.maven.doxia:doxia-sink-api:jar:1.1.2-SNAPSHOT

  Try downloading the file manually from the project website.

  Then, install it using the command: 
      mvn install:install-file -DgroupId=org.apache.maven.doxia -DartifactId=doxia-sink-api
-Dversion=1.1.2-SNAPSHOT -Dpackaging=jar -Dfile=/path/to/file

  Alternatively, if you host your own repository you can deploy the file there: 
      mvn deploy:deploy-file -DgroupId=org.apache.maven.doxia -DartifactId=doxia-sink-api
-Dversion=1.1.2-SNAPSHOT -Dpackaging=jar -Dfile=/path/to/file -Durl=[url] -DrepositoryId=[id]

  Path to dependency: 
  	1) org.apache.maven.reporting:maven-reporting-impl:pom:pom:2.1-SNAPSHOT
  	2) org.apache.maven.doxia:doxia-sink-api:jar:1.1.2-SNAPSHOT

2) org.apache.maven.doxia:doxia-site-renderer:jar:1.1.2-SNAPSHOT

  Try downloading the file manually from the project website.

  Then, install it using the command: 
      mvn install:install-file -DgroupId=org.apache.maven.doxia -DartifactId=doxia-site-renderer
-Dversion=1.1.2-SNAPSHOT -Dpackaging=jar -Dfile=/path/to/file

  Alternatively, if you host your own repository you can deploy the file there: 
      mvn deploy:deploy-file -DgroupId=org.apache.maven.doxia -DartifactId=doxia-site-renderer
-Dversion=1.1.2-SNAPSHOT -Dpackaging=jar -Dfile=/path/to/file -Durl=[url] -DrepositoryId=[id]

  Path to dependency: 
  	1) org.apache.maven.reporting:maven-reporting-impl:pom:pom:2.1-SNAPSHOT
  	2) org.apache.maven.doxia:doxia-site-renderer:jar:1.1.2-SNAPSHOT

----------
2 required artifacts are missing.

for artifact: 
  org.apache.maven.reporting:maven-reporting-impl:pom:2.1-SNAPSHOT

from the specified remote repositories:
  Nexus (http://repository.sonatype.org:8081/content/groups/sonatype-public-grid, releases=true,
snapshots=true)

	at org.apache.maven.artifact.resolver.DefaultResolutionErrorHandler.throwErrors(DefaultResolutionErrorHandler.java:71)
	at org.apache.maven.DefaultProjectDependenciesResolver.resolve(DefaultProjectDependenciesResolver.java:156)
	at org.apache.maven.DefaultProjectDependenciesResolver.resolve(DefaultProjectDependenciesResolver.java:66)
	at org.apache.maven.lifecycle.DefaultLifecycleExecutor.resolveProjectDependencies(DefaultLifecycleExecutor.java:376)
	at org.apache.maven.lifecycle.DefaultLifecycleExecutor.execute(DefaultLifecycleExecutor.java:307)
	at org.apache.maven.DefaultMaven.doExecute(DefaultMaven.java:233)
	at org.apache.maven.DefaultMaven.execute(DefaultMaven.java:102)
	at org.apache.maven.cli.MavenCli.execute(MavenCli.java:421)
	at org.apache.maven.cli.MavenCli.doMain(MavenCli.java:156)
	at org.apache.maven.cli.MavenCli.main(MavenCli.java:121)
	at sun.reflect.NativeMethodAccessorImpl.invoke0(Native Method)
	at sun.reflect.NativeMethodAccessorImpl.invoke(NativeMethodAccessorImpl.java:39)
	at sun.reflect.DelegatingMethodAccessorImpl.invoke(DelegatingMethodAccessorImpl.java:25)
	at java.lang.reflect.Method.invoke(Method.java:597)
	at org.codehaus.plexus.classworlds.launcher.Launcher.launchEnhanced(Launcher.java:290)
	at org.codehaus.plexus.classworlds.launcher.Launcher.launch(Launcher.java:230)
	at org.codehaus.plexus.classworlds.launcher.Launcher.mainWithExitCode(Launcher.java:409)
	at org.codehaus.plexus.classworlds.launcher.Launcher.main(Launcher.java:352)
[ERROR] 
[ERROR] Re-run Maven using the -X switch to enable full debug logging.
[ERROR] 
[ERROR] For more information about the errors and possible solutions, please read the following
articles:
[ERROR] [Help 1] http://cwiki.apache.org/confluence/display/MAVEN/MultipleArtifactsNotFoundException


Mime
View raw message