maven-notifications mailing list archives: October 2009

Site index · List index
Message listThread · Author · Date
Hudson Build failed in Hudson: maven-plugin-tools » 1.5,windows #46 Mon, 05 Oct, 06:40
Hudson   Hudson build is back to normal: maven-plugin-tools » 1.5,windows #47 Mon, 05 Oct, 08:32
Hudson Build failed in Hudson: maven-core-integration-testing » windows #478 Thu, 08 Oct, 21:05
Hudson   Hudson build is back to normal: maven-core-integration-testing » windows #479 Thu, 08 Oct, 21:23
Build failed in Hudson: Maven-Assembly-Plugin-with-ITs » 1.5,ubuntu #48
Hudson   Build failed in Hudson: Maven-Assembly-Plugin-with-ITs » 1.5,ubuntu #48 Sun, 18 Oct, 23:25
Hudson     Build failed in Hudson: Maven-Assembly-Plugin-with-ITs » 1.5,ubuntu #49 Tue, 20 Oct, 23:25
Build failed in Hudson: Maven-Assembly-Plugin-with-ITs » 1.5,windows #48
Hudson   Build failed in Hudson: Maven-Assembly-Plugin-with-ITs » 1.5,windows #48 Sun, 18 Oct, 23:35
Hudson     Build failed in Hudson: Maven-Assembly-Plugin-with-ITs » 1.5,windows #49 Tue, 20 Oct, 23:33
[continuum] BUILD FAILURE: Maven 2.0.x Branch - Integration Test Executor - default maven2 buildDefinition
Contin...@vmbuild.apache.org   [continuum] BUILD FAILURE: Maven 2.0.x Branch - Integration Test Executor - default maven2 buildDefinition Mon, 19 Oct, 14:42
Contin...@vmbuild.apache.org   [continuum] BUILD FAILURE: Maven 2.0.x Branch - Integration Test Executor - default maven2 buildDefinition Wed, 21 Oct, 23:16
Contin...@vmbuild.apache.org   [continuum] BUILD FAILURE: Maven 2.0.x Branch - Integration Test Executor - default maven2 buildDefinition Fri, 23 Oct, 14:41
Contin...@vmbuild.apache.org   [continuum] BUILD FAILURE: Maven 2.0.x Branch - Integration Test Executor - default maven2 buildDefinition Fri, 23 Oct, 21:14
Contin...@vmbuild.apache.org   [continuum] BUILD FAILURE: Maven 2.0.x Branch - Integration Test Executor - default maven2 buildDefinition Sat, 24 Oct, 15:38
Contin...@vmbuild.apache.org   [continuum] BUILD FAILURE: Maven 2.0.x Branch - Integration Test Executor - default maven2 buildDefinition Sat, 24 Oct, 17:28
Contin...@vmbuild.apache.org   [continuum] BUILD FAILURE: Maven 2.0.x Branch - Integration Test Executor - default maven2 buildDefinition Sat, 24 Oct, 19:33
Contin...@vmbuild.apache.org   [continuum] BUILD FAILURE: Maven 2.0.x Branch - Integration Test Executor - default maven2 buildDefinition Mon, 26 Oct, 15:39
Contin...@vmbuild.apache.org   [continuum] BUILD FAILURE: Maven 2.0.x Branch - Integration Test Executor - default maven2 buildDefinition Tue, 27 Oct, 14:20
Contin...@vmbuild.apache.org   [continuum] BUILD FAILURE: Maven 2.0.x Branch - Integration Test Executor - default maven2 buildDefinition Tue, 27 Oct, 15:45
Contin...@vmbuild.apache.org   [continuum] BUILD FAILURE: Maven 2.0.x Branch - Integration Test Executor - default maven2 buildDefinition Tue, 27 Oct, 17:23
Contin...@vmbuild.apache.org   [continuum] BUILD FAILURE: Maven 2.0.x Branch - Integration Test Executor - default maven2 buildDefinition Tue, 27 Oct, 22:04
Contin...@vmbuild.apache.org   [continuum] BUILD FAILURE: Maven 2.0.x Branch - Integration Test Executor - default maven2 buildDefinition Wed, 28 Oct, 00:47
Contin...@vmbuild.apache.org   [continuum] BUILD FAILURE: Maven 2.0.x Branch - Integration Test Executor - default maven2 buildDefinition Thu, 29 Oct, 02:30
.COM Hudson Build failed in Hudson: m2e-user-issue-votes #257 Thu, 22 Oct, 05:00
.COM Hudson   Build failed in Hudson: m2e-user-issue-votes #258 Fri, 23 Oct, 05:00
.COM Hudson     Build failed in Hudson: m2e-user-issue-votes #259 Sat, 24 Oct, 05:00
.COM Hudson       Build failed in Hudson: m2e-user-issue-votes #260 Sun, 25 Oct, 05:00
.COM Hudson         Build failed in Hudson: m2e-user-issue-votes #261 Mon, 26 Oct, 05:00
.COM Hudson           Build failed in Hudson: m2e-user-issue-votes #262 Tue, 27 Oct, 05:00
Contin...@vmbuild.apache.org [continuum] BUILD SUCCESSFUL: Maven Integration Testing - Maven Integration Test Plugin :: Configuration - default maven2 buildDefinition Tue, 27 Oct, 19:49
Hudson Build failed in Hudson: maven-shared » 1.5,windows #159 Thu, 29 Oct, 06:31
Hudson   Hudson build is back to normal: maven-shared » 1.5,windows #160 Thu, 29 Oct, 09:57
Message listThread · Author · Date
Box list
Aug 2014130
Jul 2014317
Jun 2014341
May 2014161
Apr 2014146
Mar 2014336
Feb 2014308
Jan 2014189
Dec 2013319
Nov 2013274
Oct 2013167
Sep 2013486
Aug 2013263
Jul 2013726
Jun 2013722
May 2013378
Apr 2013313
Mar 2013467
Feb 2013520
Jan 20131437
Dec 20121778
Nov 2012775
Oct 20121224
Sep 2012791
Aug 2012362
Jul 2012232
Jun 2012149
May 2012189
Apr 2012115
Mar 201257
Feb 2012155
Jan 2012170
Dec 2011244
Nov 2011187
Oct 2011139
Sep 2011190
Aug 2011276
Jul 201194
Jun 20114
Apr 201162
Mar 201176
Feb 201154
Jan 201185
Dec 201079
Nov 201061
Oct 201058
Sep 20101
Aug 201057
Jul 201037
Jun 201020
May 201075
Apr 201053
Mar 201012
Feb 201030
Jan 201071
Dec 2009104
Nov 200919
Oct 200931
Sep 2009193
Aug 2009268
Jul 2009193
Jun 2009147
May 200975
Apr 200979
Mar 2009134
Feb 2009657
Jan 200983
Dec 2008349
Nov 2008288
Oct 2008986
Sep 2008842
Aug 2008707
Jul 2008887
Jun 2008167
May 200821
Apr 2008231
Mar 2008438
Feb 2008317
Jan 2008205
Dec 2007185
Nov 2007532
Oct 2007439
Sep 2007699
Aug 20071294
Jul 2007351
Jun 20072211
May 2007273
Apr 2007262
Mar 2007534
Feb 20071648
Jan 20072359
Dec 2006575
Nov 2006357
Oct 2006642
Sep 2006660
Aug 20061662
Jul 20061320
Jun 2006473
May 20064700
Apr 20061113
Mar 20061048