maven-notifications mailing list archives: September 2009

Site index · List index
Message list1 · 2 · Next »Thread · Author · Date
Contin...@vmbuild.apache.org [continuum] BUILD SUCCESSFUL: Maven Integration Testing - Maven Integration Test Plugin :: Site - default maven2 buildDefinition Mon, 31 Aug, 23:56
Contin...@vmbuild.apache.org [continuum] BUILD ERROR: Maven Integration Testing - Maven Integration Test Plugin :: Class Loader :: Dependency A - default maven2 buildDefinition Wed, 02 Sep, 01:41
Contin...@vmbuild.apache.org [continuum] BUILD SUCCESSFUL: Maven Integration Testing - Maven Integration Test Plugin :: Class Loader :: Dependency A - default maven2 buildDefinition Wed, 02 Sep, 03:44
Contin...@vmbuild.apache.org [continuum] BUILD FAILURE: Maven 2.0.x Branch - Integration Test Executor - default maven2 buildDefinition Mon, 07 Sep, 22:39
Contin...@vmbuild.apache.org [continuum] BUILD SUCCESSFUL: Maven 2.0.x Branch - Integration Test Executor - default maven2 buildDefinition Tue, 08 Sep, 11:58
Contin...@vmbuild.apache.org [continuum] BUILD SUCCESSFUL: Maven 2.0.x Branch - Integration Test Executor - default maven2 buildDefinition Tue, 08 Sep, 16:20
Contin...@vmbuild.apache.org [continuum] BUILD SUCCESSFUL: Maven 2.0.x Branch - Integration Test Executor - default maven2 buildDefinition Wed, 09 Sep, 17:05
Contin...@vmbuild.apache.org [continuum] BUILD SUCCESSFUL: Maven 2.0.x Branch - Integration Test Executor - default maven2 buildDefinition Thu, 10 Sep, 17:59
Contin...@vmbuild.apache.org [continuum] BUILD FAILURE: Maven Enforcer - Maven Enforcer Plugin - default maven2 buildDefinition Mon, 14 Sep, 18:31
Contin...@vmbuild.apache.org [continuum] BUILD ERROR: Maven Integration Testing - Maven Verifier Component - default maven2 buildDefinition Tue, 15 Sep, 00:54
Contin...@vmbuild.apache.org [continuum] BUILD FAILURE: Maven Integration Testing - Maven Verifier Component - default maven2 buildDefinition Tue, 15 Sep, 02:48
Contin...@vmbuild.apache.org [continuum] BUILD ERROR: Maven Integration Testing - Maven Verifier Component - default maven2 buildDefinition Tue, 15 Sep, 04:50
Contin...@vmbuild.apache.org [continuum] BUILD FAILURE: Maven Integration Testing - Maven Verifier Component - default maven2 buildDefinition Tue, 15 Sep, 06:43
Contin...@vmbuild.apache.org [continuum] BUILD ERROR: Maven Integration Testing - Maven Verifier Component - default maven2 buildDefinition Tue, 15 Sep, 08:47
Contin...@vmbuild.apache.org [continuum] BUILD FAILURE: Maven Integration Testing - Maven Verifier Component - default maven2 buildDefinition Tue, 15 Sep, 10:51
Contin...@vmbuild.apache.org [continuum] BUILD ERROR: Maven Integration Testing - Maven Verifier Component - default maven2 buildDefinition Tue, 15 Sep, 12:44
Contin...@vmbuild.apache.org [continuum] BUILD SUCCESSFUL: Maven Integration Testing - Maven Verifier Component - default maven2 buildDefinition Tue, 15 Sep, 15:21
Contin...@vmbuild.apache.org [continuum] BUILD SUCCESSFUL: Maven 2.0.x Branch - Integration Test Executor - default maven2 buildDefinition Fri, 18 Sep, 18:42
Contin...@vmbuild.apache.org [continuum] BUILD FAILURE: Maven Enforcer - Maven Enforcer Plugin - default maven2 buildDefinition Fri, 25 Sep, 09:07
Hudson Build failed in Hudson: maven-core-integration-testing » 1.5,windows #417 Tue, 01 Sep, 01:04
Hudson Hudson build is back to normal: maven-core-integration-testing » 1.5,windows #418 Tue, 01 Sep, 09:38
Hudson Build failed in Hudson: maven-core-integration-testing » 1.5,windows #420 Tue, 01 Sep, 19:50
Hudson Build failed in Hudson: maven-core-integration-testing » 1.5,windows #421 Tue, 01 Sep, 19:57
Hudson Build failed in Hudson: Maven-2.0.x-bootstrap » 1.4,windows #112 Wed, 02 Sep, 23:47
Hudson Build failed in Hudson: Maven-2.0.x » 1.4,windows #87 Wed, 02 Sep, 23:47
Hudson Build failed in Hudson: Maven-2.0.x-bootstrap » 1.4,ubuntu #112 Thu, 03 Sep, 00:26
Hudson Build failed in Hudson: Maven-2.0.x » 1.4,ubuntu #87 Thu, 03 Sep, 00:27
Hudson Build failed in Hudson: Maven-Assembly-Plugin-with-ITs » 1.5,ubuntu #36 Thu, 03 Sep, 00:58
Hudson Build failed in Hudson: Maven-Assembly-Plugin-with-ITs » 1.5,windows #36 Thu, 03 Sep, 01:28
Hudson Build failed in Hudson: wagon » 1.5,windows #33 Thu, 03 Sep, 05:28
Hudson Build failed in Hudson: ant-tasks » 1.5,windows #37 Thu, 03 Sep, 05:30
Hudson Build failed in Hudson: Maven-2.0.x-bootstrap » 1.4,windows #113 Thu, 03 Sep, 05:32
Hudson Build failed in Hudson: Maven-2.0.x » 1.4,windows #88 Thu, 03 Sep, 05:32
Hudson Build failed in Hudson: Maven-2.2.x » 1.5,windows #43 Thu, 03 Sep, 05:32
Hudson Build failed in Hudson: Maven-Assembly-Plugin-with-ITs » 1.5,windows #37 Thu, 03 Sep, 05:32
Hudson Build failed in Hudson: maven-core-integration-testing » windows #424 Thu, 03 Sep, 05:41
Hudson Build failed in Hudson: maven-plugin-tools » 1.5,windows #28 Thu, 03 Sep, 05:55
Hudson Build failed in Hudson: maven-shared » 1.5,windows #134 Thu, 03 Sep, 06:06
Hudson Build failed in Hudson: Maven-2.0.x-bootstrap » 1.4,ubuntu #113 Thu, 03 Sep, 06:07
Hudson Build failed in Hudson: Maven-2.0.x » 1.4,ubuntu #88 Thu, 03 Sep, 06:07
Hudson Build failed in Hudson: Maven-Assembly-Plugin-with-ITs » 1.5,ubuntu #37 Thu, 03 Sep, 06:31
Hudson Build failed in Hudson: ant-tasks » 1.5,windows #38 Thu, 03 Sep, 08:01
Hudson Build failed in Hudson: Maven-2.0.x » 1.4,windows #89 Thu, 03 Sep, 08:14
Hudson Build failed in Hudson: Maven-2.0.x-bootstrap » 1.4,windows #114 Thu, 03 Sep, 08:14
Hudson Build failed in Hudson: Maven-2.2.x » 1.5,windows #44 Thu, 03 Sep, 08:17
Hudson Build failed in Hudson: Maven-Assembly-Plugin-with-ITs » 1.5,windows #38 Thu, 03 Sep, 08:19
Hudson Build failed in Hudson: maven-core-integration-testing » windows #425 Thu, 03 Sep, 08:25
Hudson Build failed in Hudson: maven-plugin-tools » 1.5,windows #29 Thu, 03 Sep, 08:27
Hudson Build failed in Hudson: Maven-2.0.x » 1.4,ubuntu #89 Thu, 03 Sep, 08:27
Hudson Build failed in Hudson: Maven-2.0.x-bootstrap » 1.4,ubuntu #114 Thu, 03 Sep, 08:27
Hudson Build failed in Hudson: maven-shared » 1.5,windows #135 Thu, 03 Sep, 08:30
Hudson Build failed in Hudson: Maven-Assembly-Plugin-with-ITs » 1.5,ubuntu #38 Thu, 03 Sep, 09:00
Hudson Build failed in Hudson: surefire » 1.5,windows #19 Thu, 03 Sep, 09:10
Hudson Build failed in Hudson: wagon » 1.5,windows #34 Thu, 03 Sep, 09:10
Hudson Hudson build is back to normal: ant-tasks » 1.5,windows #39 Thu, 03 Sep, 11:03
Hudson Hudson build is back to normal: Maven-2.2.x-bootstrap » 1.5,windows #68 Thu, 03 Sep, 11:43
Hudson Build failed in Hudson: Maven-2.0.x » 1.4,ubuntu #90 Thu, 03 Sep, 11:57
Hudson Build failed in Hudson: Maven-2.0.x-bootstrap » 1.4,ubuntu #115 Thu, 03 Sep, 11:58
Hudson Build failed in Hudson: Maven-Assembly-Plugin-with-ITs » 1.5,ubuntu #39 Thu, 03 Sep, 12:26
Hudson Build failed in Hudson: Maven-2.0.x » 1.4,windows #90 Thu, 03 Sep, 12:33
Hudson Build failed in Hudson: Maven-2.0.x-bootstrap » 1.4,windows #115 Thu, 03 Sep, 12:34
Hudson Hudson build is back to normal: Maven-2.2.x » 1.5,windows #45 Thu, 03 Sep, 12:41
Hudson Hudson build is back to normal: maven-plugin-tools » 1.5,windows #30 Thu, 03 Sep, 13:00
Hudson Hudson build is back to normal: maven-core-integration-testing » windows #426 Thu, 03 Sep, 13:03
Hudson Hudson build is back to normal: maven-shared » 1.5,windows #136 Thu, 03 Sep, 13:29
Hudson Build failed in Hudson: Maven-Assembly-Plugin-with-ITs » 1.5,windows #39 Thu, 03 Sep, 13:40
Hudson Hudson build is back to normal: wagon » 1.5,windows #35 Thu, 03 Sep, 15:43
Hudson Hudson build is back to normal: surefire » 1.5,windows #20 Thu, 03 Sep, 16:09
Hudson Build failed in Hudson: ant-tasks » 1.5,windows #41 Fri, 04 Sep, 06:01
Hudson Build failed in Hudson: Maven-2.2.x-bootstrap » 1.5,windows #70 Fri, 04 Sep, 06:02
Hudson Build failed in Hudson: Maven-2.0.x » 1.4,windows #91 Fri, 04 Sep, 06:02
Hudson Build failed in Hudson: Maven-2.0.x-bootstrap » 1.4,windows #116 Fri, 04 Sep, 06:05
Hudson Build failed in Hudson: Maven-2.0.x » 1.4,ubuntu #91 Fri, 04 Sep, 06:20
Hudson Build failed in Hudson: Maven-2.0.x-bootstrap » 1.4,ubuntu #116 Fri, 04 Sep, 06:25
Hudson Build failed in Hudson: Maven-Assembly-Plugin-with-ITs » 1.5,windows #40 Fri, 04 Sep, 07:10
Hudson Build failed in Hudson: Maven-Assembly-Plugin-with-ITs » 1.5,ubuntu #40 Fri, 04 Sep, 07:14
Hudson Build failed in Hudson: wagon » 1.5,windows #36 Fri, 04 Sep, 07:56
Hudson Build failed in Hudson: maven-core-integration-testing » windows #428 Fri, 04 Sep, 14:06
Hudson Hudson build is back to normal: maven-core-integration-testing » windows #429 Fri, 04 Sep, 23:10
Hudson Build failed in Hudson: Maven-2.0.x » 1.4,ubuntu #92 Sat, 05 Sep, 04:59
Hudson Build failed in Hudson: Maven-2.0.x » 1.4,windows #92 Sat, 05 Sep, 05:59
Hudson Hudson build is back to normal: Maven-2.2.x » 1.5,windows #47 Sat, 05 Sep, 06:11
Hudson Hudson build is back to normal: ant-tasks » 1.5,windows #42 Sat, 05 Sep, 06:35
Hudson Hudson build is back to normal: wagon » 1.5,windows #37 Sat, 05 Sep, 07:30
Hudson Hudson build is back to normal: Maven-2.2.x-bootstrap » 1.5,windows #71 Sat, 05 Sep, 07:56
Hudson Build failed in Hudson: Maven-2.2.x-bootstrap » 1.5,windows #72 Sun, 06 Sep, 03:03
Hudson Build failed in Hudson: Maven-2.0.x » 1.4,windows #93 Sun, 06 Sep, 03:03
Hudson Build failed in Hudson: Maven-2.2.x » 1.5,windows #48 Sun, 06 Sep, 03:03
Hudson Build failed in Hudson: maven-core-integration-testing » windows #431 Sun, 06 Sep, 03:03
Hudson Build failed in Hudson: Maven-2.0.x » 1.4,ubuntu #93 Sun, 06 Sep, 03:05
Hudson Build failed in Hudson: surefire » 1.5,windows #23 Sun, 06 Sep, 03:06
Hudson Build failed in Hudson: ant-tasks » 1.5,windows #43 Sun, 06 Sep, 04:01
Hudson Build failed in Hudson: maven-plugin-tools » 1.5,windows #33 Sun, 06 Sep, 04:01
Hudson Build failed in Hudson: maven-shared » 1.5,windows #139 Sun, 06 Sep, 04:01
Hudson Build failed in Hudson: wagon » 1.5,windows #38 Sun, 06 Sep, 04:04
Hudson Build failed in Hudson: Maven-2.0.x-bootstrap » 1.4,windows #117 Sun, 06 Sep, 06:03
Hudson Build failed in Hudson: Maven-Assembly-Plugin-with-ITs » 1.5,windows #41 Sun, 06 Sep, 06:03
Hudson Build failed in Hudson: Maven-2.0.x-bootstrap » 1.4,ubuntu #117 Sun, 06 Sep, 06:11
Hudson Build failed in Hudson: Maven-Assembly-Plugin-with-ITs » 1.5,ubuntu #41 Sun, 06 Sep, 06:53
Hudson Hudson build is back to normal: ant-tasks » 1.5,windows #44 Sun, 06 Sep, 12:08
Message list1 · 2 · Next »Thread · Author · Date
Box list
Apr 201478
Mar 2014336
Feb 2014308
Jan 2014189
Dec 2013319
Nov 2013274
Oct 2013167
Sep 2013486
Aug 2013263
Jul 2013726
Jun 2013722
May 2013378
Apr 2013313
Mar 2013467
Feb 2013520
Jan 20131437
Dec 20121778
Nov 2012775
Oct 20121224
Sep 2012791
Aug 2012362
Jul 2012232
Jun 2012149
May 2012189
Apr 2012115
Mar 201257
Feb 2012155
Jan 2012170
Dec 2011244
Nov 2011187
Oct 2011139
Sep 2011190
Aug 2011276
Jul 201194
Jun 20114
Apr 201162
Mar 201176
Feb 201154
Jan 201185
Dec 201079
Nov 201061
Oct 201058
Sep 20101
Aug 201057
Jul 201037
Jun 201020
May 201075
Apr 201053
Mar 201012
Feb 201030
Jan 201071
Dec 2009104
Nov 200919
Oct 200931
Sep 2009193
Aug 2009268
Jul 2009193
Jun 2009147
May 200975
Apr 200979
Mar 2009134
Feb 2009657
Jan 200983
Dec 2008349
Nov 2008288
Oct 2008986
Sep 2008842
Aug 2008707
Jul 2008887
Jun 2008167
May 200821
Apr 2008231
Mar 2008438
Feb 2008317
Jan 2008205
Dec 2007185
Nov 2007532
Oct 2007439
Sep 2007699
Aug 20071294
Jul 2007351
Jun 20072211
May 2007273
Apr 2007262
Mar 2007534
Feb 20071648
Jan 20072359
Dec 2006575
Nov 2006357
Oct 2006642
Sep 2006660
Aug 20061662
Jul 20061320
Jun 2006473
May 20064700
Apr 20061113
Mar 20061048