maven-notifications mailing list archives

Site index · List index
Message view « Date » · « Thread »
Top « Date » · « Thread »
From Hudson <Hud...@sonatype.org>
Subject Build failed in Hudson: maven-shared » 1.5,windows #109
Date Fri, 21 Aug 2009 08:28:45 GMT
See <http://grid.sonatype.org/ci/job/maven-shared/./jdk=1.5,label=windows/109/>

------------------------------------------
[...truncated 1233 lines...]
	at junit.framework.TestResult.run(TestResult.java:109)
	at junit.framework.TestCase.run(TestCase.java:118)
	at junit.framework.TestSuite.runTest(TestSuite.java:208)
	at junit.framework.TestSuite.run(TestSuite.java:203)
	at sun.reflect.NativeMethodAccessorImpl.invoke0(Native Method)
	at sun.reflect.NativeMethodAccessorImpl.invoke(NativeMethodAccessorImpl.java:39)
	at sun.reflect.DelegatingMethodAccessorImpl.invoke(DelegatingMethodAccessorImpl.java:25)
	at java.lang.reflect.Method.invoke(Method.java:585)
	at org.apache.maven.surefire.junit.JUnitTestSet.execute(JUnitTestSet.java:213)
	at org.apache.maven.surefire.suite.AbstractDirectoryTestSuite.executeTestSet(AbstractDirectoryTestSuite.java:140)
	at org.apache.maven.surefire.suite.AbstractDirectoryTestSuite.execute(AbstractDirectoryTestSuite.java:127)
	at org.apache.maven.surefire.Surefire.run(Surefire.java:177)
	at sun.reflect.NativeMethodAccessorImpl.invoke0(Native Method)
	at sun.reflect.NativeMethodAccessorImpl.invoke(NativeMethodAccessorImpl.java:39)
	at sun.reflect.DelegatingMethodAccessorImpl.invoke(DelegatingMethodAccessorImpl.java:25)
	at java.lang.reflect.Method.invoke(Method.java:585)
	at org.apache.maven.surefire.booter.SurefireBooter.runSuitesInProcess(SurefireBooter.java:345)
	at org.apache.maven.surefire.booter.SurefireBooter.main(SurefireBooter.java:1009)
Tests run: 11, Failures: 0, Errors: 0, Skipped: 0, Time elapsed: 2.148 sec
Running org.apache.maven.shared.jar.classes.ImportVisitorTest
Tests run: 2, Failures: 0, Errors: 0, Skipped: 0, Time elapsed: 0.053 sec
Running org.apache.maven.shared.jar.JarAnalyzerTest
Tests run: 5, Failures: 0, Errors: 0, Skipped: 0, Time elapsed: 0.09 sec
Running org.apache.maven.shared.jar.identification.JarIdentificationAnalyzerTest
Tests run: 3, Failures: 0, Errors: 0, Skipped: 0, Time elapsed: 1.802 sec
Running org.apache.maven.shared.jar.identification.exposers.EmbeddedMavenModelExposerTest
Tests run: 2, Failures: 0, Errors: 0, Skipped: 0, Time elapsed: 0.063 sec

Results :

Tests run: 23, Failures: 0, Errors: 0, Skipped: 0

[INFO] [jar:jar {execution: default-jar}]
[INFO] Building jar: C:\home\hudson\workspace\maven-shared\jdk\1.5\label\windows\trunk\maven-shared-jar\target\maven-shared-jar-1.1-SNAPSHOT.jar
[INFO] [install:install {execution: default-install}]
[INFO] Installing C:\home\hudson\workspace\maven-shared\jdk\1.5\label\windows\trunk\maven-shared-jar\target\maven-shared-jar-1.1-SNAPSHOT.jar
to C:\opt\repos\maven-shared\org\apache\maven\shared\maven-shared-jar\1.1-SNAPSHOT\maven-shared-jar-1.1-SNAPSHOT.jar
[INFO] [deploy:deploy {execution: default-deploy}]
[INFO] Retrieving previous build number from apache.snapshots.https
Uploading: file:/opt/repos/deploy-junk/org/apache/maven/shared/maven-shared-jar/1.1-SNAPSHOT/maven-shared-jar-1.1-20090821.082256-2.jar
36K uploaded  (maven-shared-jar-1.1-20090821.082256-2.jar)
[INFO] Retrieving previous metadata from apache.snapshots.https
[INFO] Uploading repository metadata for: 'snapshot org.apache.maven.shared:maven-shared-jar:1.1-SNAPSHOT'
[INFO] Retrieving previous metadata from apache.snapshots.https
[INFO] Uploading repository metadata for: 'artifact org.apache.maven.shared:maven-shared-jar'
[INFO] Uploading project information for maven-shared-jar 1.1-20090821.082256-2
[INFO] ------------------------------------------------------------------------
[INFO] Building Maven Shared Monitor API
[INFO]    task-segment: [clean, deploy]
[INFO] ------------------------------------------------------------------------
[INFO] [clean:clean {execution: default-clean}]
[INFO] Deleting file set: C:\home\hudson\workspace\maven-shared\jdk\1.5\label\windows\trunk\maven-shared-monitor\target
(included: [**], excluded: [])
[INFO] [remote-resources:process {execution: default}]
[INFO] [resources:resources {execution: default-resources}]
[INFO] Using 'UTF-8' encoding to copy filtered resources.
[INFO] skip non existing resourceDirectory C:\home\hudson\workspace\maven-shared\jdk\1.5\label\windows\trunk\maven-shared-monitor\src\main\resources
[INFO] Copying 3 resources
[INFO] [compiler:compile {execution: default-compile}]
[INFO] Compiling 5 source files to C:\home\hudson\workspace\maven-shared\jdk\1.5\label\windows\trunk\maven-shared-monitor\target\classes
[INFO] [resources:testResources {execution: default-testResources}]
[INFO] Using 'UTF-8' encoding to copy filtered resources.
[INFO] skip non existing resourceDirectory C:\home\hudson\workspace\maven-shared\jdk\1.5\label\windows\trunk\maven-shared-monitor\src\test\resources
[INFO] Copying 3 resources
[INFO] [compiler:testCompile {execution: default-testCompile}]
[INFO] No sources to compile
[INFO] [surefire:test {execution: default-test}]
[INFO] Surefire report directory: C:\home\hudson\workspace\maven-shared\jdk\1.5\label\windows\trunk\maven-shared-monitor\target\surefire-reports

-------------------------------------------------------
 T E S T S
-------------------------------------------------------
There are no tests to run.

Results :

Tests run: 0, Failures: 0, Errors: 0, Skipped: 0

[INFO] [jar:jar {execution: default-jar}]
[INFO] Building jar: C:\home\hudson\workspace\maven-shared\jdk\1.5\label\windows\trunk\maven-shared-monitor\target\maven-shared-monitor-1.0-SNAPSHOT.jar
[INFO] [install:install {execution: default-install}]
[INFO] Installing C:\home\hudson\workspace\maven-shared\jdk\1.5\label\windows\trunk\maven-shared-monitor\target\maven-shared-monitor-1.0-SNAPSHOT.jar
to C:\opt\repos\maven-shared\org\apache\maven\shared\maven-shared-monitor\1.0-SNAPSHOT\maven-shared-monitor-1.0-SNAPSHOT.jar
[INFO] [deploy:deploy {execution: default-deploy}]
[INFO] Retrieving previous build number from apache.snapshots.https
Uploading: file:/opt/repos/deploy-junk/org/apache/maven/shared/maven-shared-monitor/1.0-SNAPSHOT/maven-shared-monitor-1.0-20090821.082256-2.jar
12K uploaded  (maven-shared-monitor-1.0-20090821.082256-2.jar)
[INFO] Retrieving previous metadata from apache.snapshots.https
[INFO] Uploading repository metadata for: 'artifact org.apache.maven.shared:maven-shared-monitor'
[INFO] Uploading project information for maven-shared-monitor 1.0-20090821.082256-2
[INFO] Retrieving previous metadata from apache.snapshots.https
[INFO] Uploading repository metadata for: 'snapshot org.apache.maven.shared:maven-shared-monitor:1.0-SNAPSHOT'
[INFO] ------------------------------------------------------------------------
[INFO] Building Maven Verifier Component
[INFO]    task-segment: [clean, deploy]
[INFO] ------------------------------------------------------------------------
[INFO] [clean:clean {execution: default-clean}]
[INFO] Deleting file set: C:\home\hudson\workspace\maven-shared\jdk\1.5\label\windows\trunk\maven-verifier\target
(included: [**], excluded: [])
[INFO] [remote-resources:process {execution: default}]
[INFO] [resources:resources {execution: default-resources}]
[INFO] Using 'UTF-8' encoding to copy filtered resources.
[INFO] skip non existing resourceDirectory C:\home\hudson\workspace\maven-shared\jdk\1.5\label\windows\trunk\maven-verifier\src\main\resources
[INFO] Copying 3 resources
[INFO] [compiler:compile {execution: default-compile}]
[INFO] Compiling 22 source files to C:\home\hudson\workspace\maven-shared\jdk\1.5\label\windows\trunk\maven-verifier\target\classes
[INFO] [resources:testResources {execution: default-testResources}]
[INFO] Using 'UTF-8' encoding to copy filtered resources.
[INFO] skip non existing resourceDirectory C:\home\hudson\workspace\maven-shared\jdk\1.5\label\windows\trunk\maven-verifier\src\test\resources
[INFO] Copying 3 resources
[INFO] [compiler:testCompile {execution: default-testCompile}]
[INFO] No sources to compile
[INFO] [surefire:test {execution: default-test}]
[INFO] Surefire report directory: C:\home\hudson\workspace\maven-shared\jdk\1.5\label\windows\trunk\maven-verifier\target\surefire-reports

-------------------------------------------------------
 T E S T S
-------------------------------------------------------
There are no tests to run.

Results :

Tests run: 0, Failures: 0, Errors: 0, Skipped: 0

[INFO] [jar:jar {execution: default-jar}]
[INFO] Building jar: C:\home\hudson\workspace\maven-shared\jdk\1.5\label\windows\trunk\maven-verifier\target\maven-verifier-1.2-SNAPSHOT.jar
[INFO] [install:install {execution: default-install}]
[INFO] Installing C:\home\hudson\workspace\maven-shared\jdk\1.5\label\windows\trunk\maven-verifier\target\maven-verifier-1.2-SNAPSHOT.jar
to C:\opt\repos\maven-shared\org\apache\maven\shared\maven-verifier\1.2-SNAPSHOT\maven-verifier-1.2-SNAPSHOT.jar
[INFO] [deploy:deploy {execution: default-deploy}]
[INFO] Retrieving previous build number from apache.snapshots.https
Uploading: file:/opt/repos/deploy-junk/org/apache/maven/shared/maven-verifier/1.2-SNAPSHOT/maven-verifier-1.2-20090821.082256-2.jar
81K uploaded  (maven-verifier-1.2-20090821.082256-2.jar)
[INFO] Uploading project information for maven-verifier 1.2-20090821.082256-2
[INFO] Retrieving previous metadata from apache.snapshots.https
[INFO] Uploading repository metadata for: 'artifact org.apache.maven.shared:maven-verifier'
[INFO] Retrieving previous metadata from apache.snapshots.https
[INFO] Uploading repository metadata for: 'snapshot org.apache.maven.shared:maven-verifier:1.2-SNAPSHOT'
[INFO] ------------------------------------------------------------------------
[INFO] Building Maven Shared Web UI tests
[INFO]    task-segment: [clean, deploy]
[INFO] ------------------------------------------------------------------------
[INFO] [clean:clean {execution: default-clean}]
[INFO] Deleting file set: C:\home\hudson\workspace\maven-shared\jdk\1.5\label\windows\trunk\maven-web-ui-tests\target
(included: [**], excluded: [])
[INFO] [remote-resources:process {execution: default}]
[INFO] [resources:resources {execution: default-resources}]
[INFO] Using 'UTF-8' encoding to copy filtered resources.
[INFO] skip non existing resourceDirectory C:\home\hudson\workspace\maven-shared\jdk\1.5\label\windows\trunk\maven-web-ui-tests\src\main\resources
[INFO] Copying 3 resources
[INFO] [compiler:compile {execution: default-compile}]
[INFO] Compiling 2 source files to C:\home\hudson\workspace\maven-shared\jdk\1.5\label\windows\trunk\maven-web-ui-tests\target\classes
[INFO] [resources:testResources {execution: default-testResources}]
[INFO] Using 'UTF-8' encoding to copy filtered resources.
[INFO] skip non existing resourceDirectory C:\home\hudson\workspace\maven-shared\jdk\1.5\label\windows\trunk\maven-web-ui-tests\src\test\resources
[INFO] Copying 3 resources
[INFO] [compiler:testCompile {execution: default-testCompile}]
[INFO] No sources to compile
[INFO] [surefire:test {execution: default-test}]
[INFO] Surefire report directory: C:\home\hudson\workspace\maven-shared\jdk\1.5\label\windows\trunk\maven-web-ui-tests\target\surefire-reports

-------------------------------------------------------
 T E S T S
-------------------------------------------------------
There are no tests to run.

Results :

Tests run: 0, Failures: 0, Errors: 0, Skipped: 0

[INFO] [jar:jar {execution: default-jar}]
[INFO] Building jar: C:\home\hudson\workspace\maven-shared\jdk\1.5\label\windows\trunk\maven-web-ui-tests\target\maven-web-ui-tests-1.0-SNAPSHOT.jar
[INFO] [install:install {execution: default-install}]
[INFO] Installing C:\home\hudson\workspace\maven-shared\jdk\1.5\label\windows\trunk\maven-web-ui-tests\target\maven-web-ui-tests-1.0-SNAPSHOT.jar
to C:\opt\repos\maven-shared\org\apache\maven\shared\maven-web-ui-tests\1.0-SNAPSHOT\maven-web-ui-tests-1.0-SNAPSHOT.jar
[INFO] [deploy:deploy {execution: default-deploy}]
[INFO] Retrieving previous build number from apache.snapshots.https
Uploading: file:/opt/repos/deploy-junk/org/apache/maven/shared/maven-web-ui-tests/1.0-SNAPSHOT/maven-web-ui-tests-1.0-20090821.082256-2.jar
15K uploaded  (maven-web-ui-tests-1.0-20090821.082256-2.jar)
[INFO] Uploading project information for maven-web-ui-tests 1.0-20090821.082256-2
[INFO] Retrieving previous metadata from apache.snapshots.https
[INFO] Uploading repository metadata for: 'snapshot org.apache.maven.shared:maven-web-ui-tests:1.0-SNAPSHOT'
[INFO] Retrieving previous metadata from apache.snapshots.https
[INFO] Uploading repository metadata for: 'artifact org.apache.maven.shared:maven-web-ui-tests'
[INFO] 
[INFO] 
[INFO] ------------------------------------------------------------------------
[INFO] Reactor Summary:
[INFO] ------------------------------------------------------------------------
[INFO] Maven Shared Components ............................... SUCCESS [14.925s]
[INFO] Maven Shared I/O API .................................. SUCCESS [15.532s]
[INFO] Maven File Management API ............................. SUCCESS [9.914s]
[INFO] Maven Ant ............................................. SUCCESS [4.372s]
[INFO] Maven Applications Shared Configuration ............... SUCCESS [3.111s]
[INFO] Maven Shared Application Configuration Model .......... SUCCESS [2.864s]
[INFO] Maven Shared Application Configuration Web Components . SUCCESS [9.612s]
[INFO] Maven Archiver ........................................ SUCCESS [9.443s]
[INFO] Maven Common Artifact Filters ......................... SUCCESS [9.667s]
[INFO] Maven Dependency Analyzer ............................. SUCCESS [1:02.024s]
[INFO] Maven Dependency Tree ................................. SUCCESS [5.478s]
[INFO] Maven Downloader ...................................... SUCCESS [1.581s]
[INFO] Maven Doxia Integration Tools ......................... SUCCESS [8.658s]
[INFO] Maven Filtering ....................................... FAILED [7.616s]
[INFO] Maven Invoker ......................................... SUCCESS [22.954s]
[INFO] Maven Model Converter ................................. SUCCESS [8.863s]
[INFO] Maven OSGi integration ................................ SUCCESS [5.037s]
[INFO] Maven Reporting Implementation ........................ SUCCESS [6.624s]
[INFO] Maven Repository Builder .............................. SUCCESS [9.267s]
[INFO] Maven Runtime ......................................... SUCCESS [58.398s]
[INFO] Maven JAR Utilities ................................... SUCCESS [17.395s]
[INFO] Maven Shared Monitor API .............................. SUCCESS [3.937s]
[INFO] Maven Verifier Component .............................. SUCCESS [6.789s]
[INFO] Maven Shared Web UI tests ............................. SUCCESS [4.265s]
[INFO] ------------------------------------------------------------------------
[INFO] Error for project: Maven Filtering (during deploy)
[INFO] ------------------------------------------------------------------------
[INFO] There are test failures.

Please refer to C:\home\hudson\workspace\maven-shared\jdk\1.5\label\windows\trunk\maven-filtering\target\surefire-reports
for the individual test results.
[INFO] ------------------------------------------------------------------------
[INFO] Trace
org.apache.maven.BuildFailureException: There are test failures.

Please refer to C:\home\hudson\workspace\maven-shared\jdk\1.5\label\windows\trunk\maven-filtering\target\surefire-reports
for the individual test results.
	at org.apache.maven.lifecycle.DefaultLifecycleExecutor.executeGoals(DefaultLifecycleExecutor.java:715)
	at org.apache.maven.lifecycle.DefaultLifecycleExecutor.executeGoalWithLifecycle(DefaultLifecycleExecutor.java:556)
	at org.apache.maven.lifecycle.DefaultLifecycleExecutor.executeGoal(DefaultLifecycleExecutor.java:535)
	at org.apache.maven.lifecycle.DefaultLifecycleExecutor.executeGoalAndHandleFailures(DefaultLifecycleExecutor.java:387)
	at org.apache.maven.lifecycle.DefaultLifecycleExecutor.executeTaskSegments(DefaultLifecycleExecutor.java:348)
	at org.apache.maven.lifecycle.DefaultLifecycleExecutor.execute(DefaultLifecycleExecutor.java:180)
	at org.apache.maven.DefaultMaven.doExecute(DefaultMaven.java:328)
	at org.apache.maven.DefaultMaven.execute(DefaultMaven.java:138)
	at org.apache.maven.cli.MavenCli.main(MavenCli.java:362)
	at org.apache.maven.cli.compat.CompatibleMain.main(CompatibleMain.java:60)
	at sun.reflect.NativeMethodAccessorImpl.invoke0(Native Method)
	at sun.reflect.NativeMethodAccessorImpl.invoke(NativeMethodAccessorImpl.java:39)
	at sun.reflect.DelegatingMethodAccessorImpl.invoke(DelegatingMethodAccessorImpl.java:25)
	at java.lang.reflect.Method.invoke(Method.java:585)
	at org.codehaus.classworlds.Launcher.launchEnhanced(Launcher.java:315)
	at org.codehaus.classworlds.Launcher.launch(Launcher.java:255)
	at org.codehaus.classworlds.Launcher.mainWithExitCode(Launcher.java:430)
	at org.codehaus.classworlds.Launcher.main(Launcher.java:375)
Caused by: org.apache.maven.plugin.MojoFailureException: There are test failures.

Please refer to C:\home\hudson\workspace\maven-shared\jdk\1.5\label\windows\trunk\maven-filtering\target\surefire-reports
for the individual test results.
	at org.apache.maven.plugin.surefire.SurefirePlugin.execute(SurefirePlugin.java:575)
	at org.apache.maven.plugin.DefaultPluginManager.executeMojo(DefaultPluginManager.java:490)
	at org.apache.maven.lifecycle.DefaultLifecycleExecutor.executeGoals(DefaultLifecycleExecutor.java:694)
	... 17 more
[INFO] ------------------------------------------------------------------------
[INFO] BUILD ERRORS
[INFO] ------------------------------------------------------------------------
[INFO] Total time: 5 minutes 11 seconds
[INFO] Finished at: Fri Aug 21 01:27:53 PDT 2009
[INFO] Final Memory: 47M/93M
[INFO] ------------------------------------------------------------------------


Mime
View raw message