maven-notifications mailing list archives

Site index · List index
Message view « Date » · « Thread »
Top « Date » · « Thread »
From Hudson <Hud...@sonatype.org>
Subject Build failed in Hudson: Maven-2.2.x-bootstrap » 1.5,windows #53
Date Wed, 29 Jul 2009 02:20:42 GMT
See <http://grid.sonatype.org/ci/job/Maven-2.2.x-bootstrap/./jdk=1.5,label=windows/53/>

------------------------------------------
[...truncated 3856 lines...]
     [exec] mng3043BestEffortReactorResolution(itPackagePhase)..........SKIPPED - version
2.2.1-RC2-SNAPSHOT not in range [3.0-alpha-3,)
     [exec] mng3023ReactorDependencyResolution(itMNG3023A)..............OK (2.1 s)
     [exec] mng3023ReactorDependencyResolution(itMNG3023B)..............OK (1.8 s)
     [exec] mng3023ReactorDependencyResolution(itMNG3023C)..............OK (3.8 s)
     [exec] mng3012CoreClassImport(itMNG3012)...........................OK (1.3 s)
     [exec] mng2972OverridePluginDependency(itLifecycleInvocation)......OK (1.2 s)
     [exec] mng2972OverridePluginDependency(itCommandLineInvocation)....OK (1.2 s)
     [exec] mng2926PluginPrefixOrder(itMNG2926).........................OK (2.7 s)
     [exec] mng2921ActiveAttachedArtifacts(itMNG2921)...................OK (1.6 s)
     [exec] mng2892HideCorePlexusUtils(itMNG2892).......................OK (1.2 s)
     [exec] mng2883LegacyRepoOffline(ParentUnresolvable)................OK (2.6 s)
     [exec] mng2883LegacyRepoOffline(DependencyUnresolvable)............OK (3.6 s)
     [exec] mng2883LegacyRepoOffline(PluginUnresolvable)................OK (2.9 s)
     [exec] mng2878DefaultReportXmlImport(itMNG2878)....................OK (1.6 s)
     [exec] mng2871PrePackageSubartifactResolution(itMNG2871)...........SKIPPED - version
2.2.1-RC2-SNAPSHOT not in range [3.0-alpha-1,)
     [exec] mng2865MirrorWildcard(itFileRepo)...........................OK (1.4 s)
     [exec] mng2865MirrorWildcard(itLocalhostRepo)......................OK (1.2 s)
     [exec] mng2865MirrorWildcard(itExternalRepo).......................OK (1.2 s)
     [exec] mng2865MirrorWildcard(itCentralRepo)........................OK (1.2 s)
     [exec] mng2861RelocationsAndRanges(itMNG2861)......................OK (1.7 s)
     [exec] mng2843PluginConfigPropertiesInjection(itMNG2843)...........OK (1.4 s)
     [exec] mng2831CustomArtifactHandlerAndCustomLifecycle(itMNG2831)...OK (2.3 s)
     [exec] mng2820PomComments(it)......................................OK (4.0 s)
     [exec] mng2790LastUpdatedMetadata(itMNG2790).......................OK (2.7 s)
     [exec] mng2749ExtensionAvailableToPlugin(itMNG2749)................OK (1.2 s)
     [exec] mng2744checksumVerification(itMNG2744)......................OK (1.2 s)
     [exec] mng2739RequiredRepositoryElements(itMNG2739_RepositoryId)...OK (0.8 s)
     [exec] mng2739RequiredRepositoryElements(itMNG2739_RepositoryUrl)..OK (0.8 s)
     [exec] mng2720SiblingClasspathArtifacts(IT)........................OK (1.6 s)
     [exec] mng2695OfflinePluginSnapshots(itMNG2695)....................OK (2.4 s)
     [exec] mng2690MojoLoadingErrors(NoClassDefFromMojoLoad)............OK (1.4 s)
     [exec] mng2690MojoLoadingErrors(NoClassDefFromMojoConfiguration)...OK (1.2 s)
     [exec] mng2690MojoLoadingErrors(MojoComponentLookupException)......OK (1.3 s)
     [exec] mng2690MojoLoadingErrors(MojoRequirementComponentLookupException)..OK (1.8 s)
     [exec] mng2668UsePluginDependenciesForSorting(itMNG2668)...........OK (1.3 s)
     [exec] mng2605BogusProfileActivation(itMNG2605)....................OK (1.0 s)
     [exec] mng2591MergeInheritedPluginConfig(itNoProfile)..............OK (1.3 s)
     [exec] mng2591MergeInheritedPluginConfig(itWithProfile)............OK (1.3 s)
     [exec] mng2576MakeLikeReactor(itMakeOnlyList)......................OK (1.4 s)
     [exec] mng2576MakeLikeReactor(itMakeUpstream)......................OK (1.3 s)
     [exec] mng2576MakeLikeReactor(itMakeDownstream)....................OK (1.3 s)
     [exec] mng2576MakeLikeReactor(itMakeBoth)..........................OK (1.3 s)
     [exec] mng2576MakeLikeReactor(itMatchesByBasedir)..................OK (1.2 s)
     [exec] mng2576MakeLikeReactor(itMatchesById).......................OK (1.5 s)
     [exec] mng2576MakeLikeReactor(itMatchesByArtifactId)...............SKIPPED - version
2.2.1-RC2-SNAPSHOT not in range [3.0-alpha-3,)
     [exec] mng2576MakeLikeReactor(itResumeFrom)........................OK (1.3 s)
     [exec] mng2562Timestamp(itDefaultFormat)...........................OK (1.3 s)
     [exec] mng2562Timestamp(itCustomFormat)............................OK (1.2 s)
     [exec] mng2562Timestamp(itSameValueAcrossModules)..................OK (1.7 s)
     [exec] mng2539PluginDependenciesComeFromPluginRepos(itMNG2539).....OK (1.1 s)
     [exec] mng2432PluginPrefixOrder(itMNG2432).........................OK (1.0 s)
     [exec] mng2387InactiveProxy(it)....................................OK (1.2 s)
     [exec] mng2363BasedirAwareFileActivator(it)........................SKIPPED - version
2.2.1-RC2-SNAPSHOT not in range [3.0-alpha-3,)
     [exec] mng2362DeployedPomEncoding(it)..............................OK (3.7 s)
     [exec] mng2339BadProjectInterpolation(itMNG2339a)..................OK (1.6 s)
     [exec] mng2339BadProjectInterpolation(itMNG2339b)..................OK (3.2 s)
     [exec] mng2318LocalParentResolution(itMNG2318).....................OK (0.9 s)
     [exec] mng2309ProfileInjectionOrder(itMNG2309).....................OK (1.1 s)
     [exec] mng2293CustomPluginParamImpl(itMNG2293).....................OK (1.7 s)
     [exec] mng2277AggregatorAndResolutionPlugins(itMNG2277)............OK (1.3 s)
     [exec] mng2254PomEncoding(itMNG2254)...............................OK (1.3 s)
     [exec] mng2234ActiveProfilesFromSettings(itMNG2234)................OK (1.2 s)
     [exec] mng2228ComponentInjection(itMNG2228)........................OK (1.4 s)
     [exec] mng2201PluginConfigInterpolation(itMNG2201).................OK (1.5 s)
     [exec] mng2196ParentResolution(itMNG2196)..........................OK (0.8 s)
     [exec] mng2174PluginDepsManagedByParentProfile(itMNG2174)..........OK (1.2 s)
     [exec] mng2136ActiveByDefaultProfile(itMNG2136)....................OK (1.1 s)
     [exec] mng2130ParentLookupFromReactorCache(itMNG2130)..............OK (0.8 s)
     [exec] mng2124PomInterpolationWithParentValues(itMNG2124)..........OK (1.3 s)
     [exec] mng2123VersionRangeDependency(itMNG2123)....................OK (1.3 s)
     [exec] mng2068ReactorRelativeParents(itInheritedIdFields)..........OK (0.8 s)
     [exec] mng2068ReactorRelativeParents(itExplicitIdFields)...........OK (0.9 s)
     [exec] mng2068ReactorRelativeParents(itComplex)....................OK (0.9 s)
     [exec] mng2054PluginExecutionInheritance(itMNG2054)................OK (2.0 s)
     [exec] mng2052InterpolateWithSettingsProfileProperties(itMNG2052)..OK (1.2 s)
     [exec] mng2045testJarDependenciesBrokenInReactor(itMNG2045)........OK (1.8 s)
     [exec] mng2006ChildPathAwareUrlInheritance(itMNG2006)..............OK (1.4 s)
     [exec] mng1999DefaultReportsInheritance(itInheritSuppression)......OK (1.5 s)
     [exec] mng1999DefaultReportsInheritance(itOverrideSuppression).....OK (5.5 s)
     [exec] mng1995InterpolateBooleanModelElements(itMNG1995)...........SKIPPED - version
2.2.1-RC2-SNAPSHOT not in range [3.0-alpha-1,)
     [exec] mng1992SystemPropOverridesPomProp(itMNG1992)................OK (1.3 s)
     [exec] mng1957JdkActivationWithVersionRange(itMNG1957).............OK (1.3 s)
     [exec] mng1908LegacySnapshotUpdate(itMNG1908)......................OK (1.6 s)
     [exec] mng1830ShowVersion(Version).................................OK (0.8 s)
     [exec] mng1703PluginMgmtDepInheritance(itMNG1703)..................OK (1.2 s)
     [exec] mng1493NonStandardModulePomNames(itMNG1493).................OK (0.8 s)
     [exec] mng1491ReactorArtifactIdCollision(itMNG1491)................OK (0.9 s)
     [exec] mng1415QuotedSystemProperties(itMNG1415)....................OK (1.3 s)
     [exec] mng1412DependenciesOrder(itMNG1412).........................OK (1.2 s)
     [exec] mng1349ChecksumFormats(itMNG1349)...........................OK (1.4 s)
     [exec] mng1323AntrunDependencies(itMNG1323)........................SKIPPED - version
2.2.1-RC2-SNAPSHOT not in range [3.0-alpha-1,)
     [exec] mng1233WarDepWithProvidedScope(itMNG1233)...................OK (1.2 s)
     [exec] mng1088ReactorPluginResolution(itMNG1088)...................OK (1.0 s)
     [exec] mng1052PluginMngtConfig(itMNG1052)..........................OK (2.7 s)
     [exec] mng1021EqualAttachmentBuildNumber(itMNG1021)................OK (4.3 s)
     [exec] mng0985NonExecutedPluginMngtGoals(itMNG0985)................OK (0.8 s)
     [exec] mng0956ComponentInjectionViaProjectLevelPluginDep(itMNG0956)..OK (1.2 s)
     [exec] mng0947OptionalDependency(it)...............................OK (1.2 s)
     [exec] mng0870ReactorAwarePluginDiscovery(itMNG0870)...............OK (1.3 s)
     [exec] mng0866EvaluateDefaultValue(itMNG866).......................OK (1.3 s)
     [exec] mng0848SystemPropOverridesDefaultValue(itMNG848)............OK (1.3 s)
     [exec] mng0836PluginParentResolution(itMNG836).....................OK (1.2 s)
     [exec] mng0823MojoContextPassing(itMNG0823)........................OK (1.4 s)
     [exec] mng0820ConflictResolution(itMNG0820)........................OK (1.4 s)
     [exec] mng0818WarDepsNotTransitive(itMNG0818)......................OK (1.3 s)
     [exec] mng0814ExplicitProfileActivation(itMNG814)..................OK (1.3 s)
     [exec] mng0786ProfileAwareReactor(itMNG0786).......................OK (1.4 s)
     [exec] mng0781PluginConfigVsExecConfig(itMNG0781)..................OK (2.0 s)
     [exec] mng0773SettingsProfileReactorPollution(itMNG773)............OK (0.8 s)
     [exec] mng0768OfflineMode(itMNG768)................................OK (3.4 s)
     [exec] mng0761MissingSnapshotDistRepo(itMNG761)....................OK (3.3 s)
     [exec] mng0731LegacyRepoLayout(itMNG731)...........................OK (3.3 s)
     [exec] mng0680ParentBasedir(itMNG680)..............................OK (1.3 s)
     [exec] mng0674PluginParameterAlias(itMNG674).......................OK (1.5 s)
     [exec] mng0666IgnoreLegacyPom(itMNG666)............................OK (1.2 s)
     [exec] mng0557UserSettingsCliOption(itMNG557)......................OK (1.2 s)
     [exec] mng0553SettingsAuthzEncryption(itBasic).....................OK (3.4 s)
     [exec] mng0553SettingsAuthzEncryption(itRelocation)................OK (3.4 s)
     [exec] mng0522PluginMgmtConfig(itMNG522)...........................OK (1.6 s)
     [exec] mng0507ArtifactRelocation(itMNG507).........................OK (1.6 s)
     [exec] mng0505VersionRange(itMNG505)...............................OK (1.3 s)
     [exec] mng0496IgnoreUnknownPluginParameters(itMNG496)..............OK (1.3 s)
     [exec] mng0479OverrideCentralRepo(itMNG479)........................OK (2.4 s)
     [exec] mng0471CustomLifecycle(itMNG471)............................OK (1.9 s)
     [exec] mng0469ReportConfig(itReportConfigOverridesBuildDefaults)...OK (1.8 s)
     [exec] mng0469ReportConfig(itBuildConfigDominantDuringBuild).......OK (2.3 s)
     [exec] mng0469ReportConfig(itBuildConfigIrrelevantForReports)......OK (1.5 s)
     [exec] mng0449PluginVersionResolution(itLifecycleInvocation).......OK (1.5 s)
     [exec] mng0449PluginVersionResolution(itCliInvocation).............OK (1.1 s)
     [exec] mng0377PluginLookupFromPrefix(itMNG377).....................OK (1.2 s)
     [exec] mng0294MergeGlobalAndUserSettings(itMNG294).................OK (1.3 s)
     [exec] mng0282NonReactorExecWhenProjectIndependent(itMNG282).......OK (1.3 s)
     [exec] mng0249ResolveDepsFromReactor(itMNG0249)....................OK (1.6 s)
     [exec] mng0095ReactorFailureBehavior(itFailFast)...................OK (1.5 s)
     [exec] mng0095ReactorFailureBehavior(itFailNever)..................OK (1.5 s)
     [exec] mng0095ReactorFailureBehavior(itFailAtEnd)..................OK (1.6 s)
     [exec] 0145ReactorWithIncludesExcludes(itDefaultIncludesExcludes)..OK (1.4 s)
     [exec] 0145ReactorWithIncludesExcludes(itCustomIncludes)...........OK (1.4 s)
     [exec] 0145ReactorWithIncludesExcludes(itCustomExcludes)...........OK (1.5 s)
     [exec] 0144LifecycleExecutionOrder(it0144).........................OK (3.1 s)
     [exec] 0143TransitiveDependencyScopes(itCompileScope)..............OK (1.4 s)
     [exec] 0143TransitiveDependencyScopes(itProvidedScope).............OK (1.5 s)
     [exec] 0143TransitiveDependencyScopes(itRuntimeScope)..............OK (2.0 s)
     [exec] 0143TransitiveDependencyScopes(itTestScope).................OK (1.5 s)
     [exec] 0142DirectDependencyScopes(it0142)..........................OK (1.4 s)
     [exec] 0140InterpolationWithPomPrefix(it0140)......................OK (1.4 s)
     [exec] 0139InterpolationWithProjectPrefix(it0139)..................OK (1.3 s)
     [exec] 0138PluginLifecycle(it0138).................................OK (3.2 s)
     [exec] 0137EarLifecycle(it0137)....................................OK (2.2 s)
     [exec] 0136RarLifecycle(it0136)....................................OK (2.2 s)
     [exec] 0135EjbLifecycle(it0135)....................................OK (2.3 s)
     [exec] 0134WarLifecycle(it0134)....................................OK (2.7 s)
     [exec] 0133JarLifecycle(it0133)....................................OK (2.3 s)
     [exec] 0132PomLifecycle(it0132)....................................OK (1.8 s)
     [exec] 0131SiteLifecycle(it0131)...................................OK (1.4 s)
     [exec] 0130CleanLifecycle(it0130)..................................OK (1.4 s)
     [exec] 0113ServerAuthzAvailableToWagonMgrInPlugin(it0113)..........OK (1.3 s)
     [exec] 0090EnvVarInterpolation(it0090).............................OK (1.3 s)
     [exec] 0087PluginRealmWithProjectLevelDeps(it0087).................OK (1.2 s)
     [exec] 0086PluginRealm(it0086).....................................OK (1.5 s)
     [exec] 0085TransitiveSystemScope(it0085)...........................OK (1.2 s)
     [exec] 0072InterpolationWithDottedProperty(it0072).................OK (1.3 s)
     [exec] 0071PluginConfigWithDottedProperty(it0071)..................OK (1.4 s)
     [exec] 0064MojoConfigViaSetters(it0064)............................OK (1.3 s)
     [exec] 0063SystemScopeDependency(it0063)...........................OK (1.7 s)
     [exec] 0056MultipleGoalExecutions(it0056)..........................OK (1.3 s)
     [exec] 0052ReleaseProfile(it0052)..................................OK (1.9 s)
     [exec] 0051ReleaseProfile(it0051)..................................OK (3.0 s)
     [exec] 0041ArtifactTypeFromPluginExtension(it0041).................OK (1.6 s)
     [exec] 0040PackagingFromPluginExtension(it0040)....................OK (1.8 s)
     [exec] 0039ReleasePomInReactor(it0039).............................OK (1.3 s)
     [exec] 0038AlternatePomFileDifferentDir(it0038)....................OK (1.3 s)
     [exec] 0037AlternatePomFileSameDir(it0037).........................OK (1.3 s)
     [exec] 0036ReleasePom(it0036)......................................OK (2.0 s)
     [exec] 0032MavenPrerequisite(it0032)...............................OK (0.8 s)
     [exec] 0030DepPomDepMngtInheritance(it0030)........................OK (5.9 s)
     [exec] 0025MultipleExecutionLevelConfigs(it0025)...................OK (1.5 s)
     [exec] 0024MultipleGoalExecutions(it0024)..........................OK (1.3 s)
     [exec] 0023SettingsProfile(it0023).................................OK (1.2 s)
     [exec] 0021PomProfile(it0021)......................................OK (1.3 s)
     [exec] 0019PluginVersionMngtBySuperPom(it0019).....................OK (1.6 s)
     [exec] 0018DependencyManagement(it0018)............................OK (1.3 s)
     [exec] 0012PomInterpolation(it0012)................................OK (1.5 s)
     [exec] 0011DefaultVersionByDependencyManagement(it0011)............OK (1.3 s)
     [exec] 0010DependencyClosureResolution(it0010).....................OK (1.3 s)
     [exec] 0009GoalConfiguration(it0009)...............................OK (1.5 s)
     [exec] 0008SimplePlugin(it0008)....................................OK (1.6 s)
     [exec] Tests run: 417, Failures: 0, Errors: 1, Skipped: 0, Time elapsed: 990.682 sec
<<< FAILURE!
     [exec] testCliUsage(org.apache.maven.it.MavenITmng4254SelectableWagonProvidersTest) 
Time elapsed: 1.512 sec  <<< ERROR!
     [exec] org.apache.maven.it.VerificationException: Error in execution: [ERROR] Problem
disconnecting from wagon - ignoring: The system cannot find the path specified
     [exec] 	at org.apache.maven.it.Verifier.verifyErrorFreeLog(Verifier.java:256)
     [exec] 	at org.apache.maven.it.MavenITmng4254SelectableWagonProvidersTest.testCliUsage(MavenITmng4254SelectableWagonProvidersTest.java:62)
     [exec] 
     [exec] 
     [exec] Results :
     [exec] 
     [exec] Tests in error: 
     [exec]   testCliUsage(org.apache.maven.it.MavenITmng4254SelectableWagonProvidersTest)
     [exec] 
     [exec] Tests run: 417, Failures: 0, Errors: 1, Skipped: 0
     [exec] 
     [exec] [INFO] ------------------------------------------------------------------------
     [exec] [ERROR] BUILD FAILURE
     [exec] [INFO] ------------------------------------------------------------------------
     [exec] [INFO] There are test failures.
     [exec] 
     [exec] Please refer to C:\tmp\maven-integration-tests-2.2.x\core-it-suite\target\surefire-reports
for the individual test results.
     [exec] [INFO] ------------------------------------------------------------------------
     [exec] [INFO] Trace
     [exec] org.apache.maven.BuildFailureException: There are test failures.
     [exec] 
     [exec] Please refer to C:\tmp\maven-integration-tests-2.2.x\core-it-suite\target\surefire-reports
for the individual test results.
     [exec] 	at org.apache.maven.lifecycle.DefaultLifecycleExecutor.executeGoals(DefaultLifecycleExecutor.java:716)
     [exec] 	at org.apache.maven.lifecycle.DefaultLifecycleExecutor.executeGoalWithLifecycle(DefaultLifecycleExecutor.java:557)
     [exec] 	at org.apache.maven.lifecycle.DefaultLifecycleExecutor.executeGoal(DefaultLifecycleExecutor.java:536)
     [exec] 	at org.apache.maven.lifecycle.DefaultLifecycleExecutor.executeGoalAndHandleFailures(DefaultLifecycleExecutor.java:388)
     [exec] 	at org.apache.maven.lifecycle.DefaultLifecycleExecutor.executeTaskSegments(DefaultLifecycleExecutor.java:349)
     [exec] 	at org.apache.maven.lifecycle.DefaultLifecycleExecutor.execute(DefaultLifecycleExecutor.java:181)
     [exec] 	at org.apache.maven.DefaultMaven.doExecute(DefaultMaven.java:328)
     [exec] 	at org.apache.maven.DefaultMaven.execute(DefaultMaven.java:138)
     [exec] 	at org.apache.maven.cli.MavenCli.main(MavenCli.java:362)
     [exec] 	at org.apache.maven.cli.compat.CompatibleMain.main(CompatibleMain.java:60)
     [exec] 	at sun.reflect.NativeMethodAccessorImpl.invoke0(Native Method)
     [exec] 	at sun.reflect.NativeMethodAccessorImpl.invoke(NativeMethodAccessorImpl.java:39)
     [exec] 	at sun.reflect.DelegatingMethodAccessorImpl.invoke(DelegatingMethodAccessorImpl.java:25)
     [exec] 	at java.lang.reflect.Method.invoke(Method.java:585)
     [exec] 	at org.codehaus.classworlds.Launcher.launchEnhanced(Launcher.java:315)
     [exec] 	at org.codehaus.classworlds.Launcher.launch(Launcher.java:255)
     [exec] 	at org.codehaus.classworlds.Launcher.mainWithExitCode(Launcher.java:430)
     [exec] 	at org.codehaus.classworlds.Launcher.main(Launcher.java:375)
     [exec] Caused by: org.apache.maven.plugin.MojoFailureException: There are test failures.
     [exec] 
     [exec] Please refer to C:\tmp\maven-integration-tests-2.2.x\core-it-suite\target\surefire-reports
for the individual test results.
     [exec] 	at org.apache.maven.plugin.surefire.SurefirePlugin.execute(SurefirePlugin.java:575)
     [exec] 	at org.apache.maven.plugin.DefaultPluginManager.executeMojo(DefaultPluginManager.java:487)
     [exec] 	at org.apache.maven.lifecycle.DefaultLifecycleExecutor.executeGoals(DefaultLifecycleExecutor.java:695)
     [exec] 	... 17 more
     [exec] [INFO] ------------------------------------------------------------------------
     [exec] [INFO] Total time: 17 minutes 56 seconds
     [exec] [INFO] Finished at: Tue Jul 28 19:19:36 PDT 2009
     [exec] [INFO] Final Memory: 32M/73M
     [exec] [INFO] ------------------------------------------------------------------------

BUILD FAILED
C:\home\hudson\workspace\Maven-2.2.x-bootstrap\jdk\1.5\label\windows\maven-2.2.x\build.xml:266:
exec returned: 1

Total time: 27 minutes 2 seconds
Archiving artifacts
Sending notification to: jdcasey@jabber.org


Mime
View raw message