maven-notifications mailing list archives

Site index · List index
Message view « Date » · « Thread »
Top « Date » · « Thread »
From Hudson <Hud...@sonatype.org>
Subject Build failed in Hudson: Maven-2.2.x-bootstrap » 1.5,osx #10
Date Wed, 10 Jun 2009 16:17:16 GMT
See http://grid.sonatype.org/ci/job/Maven-2.2.x-bootstrap/./jdk=1.5,label=osx/10/

------------------------------------------
[...truncated 6671 lines...]
     [exec] mng2124PomInterpolationWithParentValues(itMNG2124)..........OK (2.7 s)
     [exec] mng2123VersionRangeDependency(itMNG2123)....................OK (1.8 s)
     [exec] mng2068ReactorRelativeParents(itInheritedIdFields)..........OK (1.1 s)
     [exec] mng2068ReactorRelativeParents(itExplicitIdFields)...........OK (1.1 s)
     [exec] mng2068ReactorRelativeParents(itComplex)....................OK (1.2 s)
     [exec] mng2054PluginExecutionInheritance(itMNG2054)................OK (2.7 s)
     [exec] mng2052InterpolateWithSettingsProfileProperties(itMNG2052)..OK (1.5 s)
     [exec] mng2045testJarDependenciesBrokenInReactor(itMNG2045)........OK (7.9 s)
     [exec] mng2006ChildPathAwareUrlInheritance(itMNG2006)..............OK (3.9 s)
     [exec] mng1999DefaultReportsInheritance(itInheritSuppression)......OK (2.8 s)
     [exec] mng1999DefaultReportsInheritance(itOverrideSuppression).....OK (17.4 s)
     [exec] mng1995InterpolateBooleanModelElements(itMNG1995)...........SKIPPED - version
2.2.0-RC3-SNAPSHOT not in range [3.0-alpha-1,)
     [exec] mng1992SystemPropOverridesPomProp(itMNG1992)................OK (3.1 s)
     [exec] mng1957JdkActivationWithVersionRange(itMNG1957).............OK (3.4 s)
     [exec] mng1908LegacySnapshotUpdate(itMNG1908)......................OK (1.6 s)
     [exec] mng1830ShowVersion(Version).................................OK (1.1 s)
     [exec] mng1703PluginMgmtDepInheritance(itMNG1703)..................OK (1.8 s)
     [exec] mng1493NonStandardModulePomNames(itMNG1493).................OK (1.1 s)
     [exec] mng1491ReactorArtifactIdCollision(itMNG1491)................OK (1.1 s)
     [exec] mng1415QuotedSystemProperties(itMNG1415)....................OK (2.7 s)
     [exec] mng1412DependenciesOrder(itMNG1412).........................OK (1.7 s)
     [exec] mng1349ChecksumFormats(itMNG1349)...........................OK (1.7 s)
     [exec] mng1323AntrunDependencies(itMNG1323)........................SKIPPED - version
2.2.0-RC3-SNAPSHOT not in range [3.0-alpha-1,)
     [exec] mng1233WarDepWithProvidedScope(itMNG1233)...................OK (1.6 s)
     [exec] mng1088ReactorPluginResolution(itMNG1088)...................OK (1.4 s)
     [exec] mng1052PluginMngtConfig(itMNG1052)..........................OK (4.2 s)
     [exec] mng1021EqualAttachmentBuildNumber(itMNG1021)................OK (3.2 s)
     [exec] mng0985NonExecutedPluginMngtGoals(itMNG0985)................OK (1.1 s)
     [exec] mng0956ComponentInjectionViaProjectLevelPluginDep(itMNG0956)..OK (1.6 s)
     [exec] mng0947OptionalDependency(it)...............................OK (1.6 s)
     [exec] mng0870ReactorAwarePluginDiscovery(itMNG0870)...............OK (1.8 s)
     [exec] mng0866EvaluateDefaultValue(itMNG866).......................OK (2.7 s)
     [exec] mng0848SystemPropOverridesDefaultValue(itMNG848)............OK (2.9 s)
     [exec] mng0836PluginParentResolution(itMNG836).....................OK (1.6 s)
     [exec] mng0823MojoContextPassing(itMNG0823)........................OK (4.0 s)
     [exec] mng0820ConflictResolution(itMNG0820)........................OK (1.6 s)
     [exec] mng0818WarDepsNotTransitive(itMNG0818)......................OK (1.6 s)
     [exec] mng0814ExplicitProfileActivation(itMNG814)..................OK (3.6 s)
     [exec] mng0786ProfileAwareReactor(itMNG0786).......................OK (3.0 s)
     [exec] mng0781PluginConfigVsExecConfig(itMNG0781)..................OK (4.2 s)
     [exec] mng0773SettingsProfileReactorPollution(itMNG773)............OK (1.3 s)
     [exec] mng0768OfflineMode(itMNG768)................................OK (4.7 s)
     [exec] mng0761MissingSnapshotDistRepo(itMNG761)....................OK (3.8 s)
     [exec] mng0731LegacyRepoLayout(itMNG731)...........................OK (2.9 s)
     [exec] mng0680ParentBasedir(itMNG680)..............................OK (3.0 s)
     [exec] mng0674PluginParameterAlias(itMNG674).......................OK (7.0 s)
     [exec] mng0666IgnoreLegacyPom(itMNG666)............................OK (1.6 s)
     [exec] mng0557UserSettingsCliOption(itMNG557)......................OK (1.8 s)
     [exec] mng0553SettingsAuthzEncryption(itBasic).....................OK (2.0 s)
     [exec] mng0553SettingsAuthzEncryption(itRelocation)................OK (2.0 s)
     [exec] mng0522PluginMgmtConfig(itMNG522)...........................OK (3.7 s)
     [exec] mng0507ArtifactRelocation(itMNG507).........................OK (5.2 s)
     [exec] mng0505VersionRange(itMNG505)...............................OK (1.6 s)
     [exec] mng0496IgnoreUnknownPluginParameters(itMNG496)..............OK (3.2 s)
     [exec] mng0479OverrideCentralRepo(itMNG479)........................OK (4.3 s)
     [exec] mng0471CustomLifecycle(itMNG471)............................OK (5.3 s)
     [exec] mng0469ReportConfig(itReportConfigOverridesBuildDefaults)...OK (2.9 s)
     [exec] mng0469ReportConfig(itBuildConfigDominantDuringBuild).......OK (2.6 s)
     [exec] mng0469ReportConfig(itBuildConfigIrrelevantForReports)......OK (4.6 s)
     [exec] mng0449PluginVersionResolution(itLifecycleInvocation).......OK (1.6 s)
     [exec] mng0449PluginVersionResolution(itCliInvocation).............OK (1.4 s)
     [exec] mng0377PluginLookupFromPrefix(itMNG377).....................OK (1.6 s)
     [exec] mng0294MergeGlobalAndUserSettings(itMNG294).................OK (1.6 s)
     [exec] mng0282NonReactorExecWhenProjectIndependent(itMNG282).......OK (4.9 s)
     [exec] mng0249ResolveDepsFromReactor(itMNG0249)....................OK (3.5 s)
     [exec] mng0095ReactorFailureBehavior(itFailFast)...................OK (3.9 s)
     [exec] mng0095ReactorFailureBehavior(itFailNever)..................OK (3.3 s)
     [exec] mng0095ReactorFailureBehavior(itFailAtEnd)..................OK (3.1 s)
     [exec] 0144LifecycleExecutionOrder(it0144).........................OK (24.0 s)
     [exec] 0143TransitiveDependencyScopes(itCompileScope)..............OK (1.6 s)
     [exec] 0143TransitiveDependencyScopes(itProvidedScope).............OK (1.6 s)
     [exec] 0143TransitiveDependencyScopes(itRuntimeScope)..............OK (1.6 s)
     [exec] 0143TransitiveDependencyScopes(itTestScope).................OK (1.6 s)
     [exec] 0142DirectDependencyScopes(it0142)..........................OK (1.6 s)
     [exec] 0140(it0140)................................................OK (3.8 s)
     [exec] 0139(it0139)................................................OK (4.5 s)
     [exec] 0138PluginLifecycle(it0138).................................OK (10.9 s)
     [exec] 0137EarLifecycle(it0137)....................................OK (7.0 s)
     [exec] 0136RarLifecycle(it0136)....................................OK (8.7 s)
     [exec] 0135EjbLifecycle(it0135)....................................OK (7.8 s)
     [exec] 0134WarLifecycle(it0134)....................................OK (10.3 s)
     [exec] 0133JarLifecycle(it0133)....................................OK (7.7 s)
     [exec] 0132PomLifecycle(it0132)....................................OK (10.9 s)
     [exec] 0131SiteLifecycle(it0131)...................................OK (4.6 s)
     [exec] 0130CleanLifecycle(it0130)..................................OK (4.1 s)
     [exec] 0113ServerAuthzAvailableToWagonMgrInPlugin(it0113)..........OK (1.6 s)
     [exec] 0090(it0090)................................................OK (4.4 s)
     [exec] 0087(it0087)................................................OK (1.7 s)
     [exec] 0086(it0086)................................................OK (4.2 s)
     [exec] 0085(it0085)................................................OK (1.6 s)
     [exec] 0072(it0072)................................................OK (5.4 s)
     [exec] 0071(it0071)................................................OK (6.5 s)
     [exec] 0064(it0064)................................................OK (6.6 s)
     [exec] 0063(it0063)................................................OK (7.0 s)
     [exec] 0056(it0056)................................................OK (4.9 s)
     [exec] 0052(it0052)................................................OK (9.4 s)
     [exec] 0051(it0051)................................................OK (12.6 s)
     [exec] 0041(it0041)................................................OK (4.2 s)
     [exec] 0040(it0040)................................................OK (3.5 s)
     [exec] 0039(it0039)................................................OK (2.4 s)
     [exec] 0038(it0038)................................................OK (2.5 s)
     [exec] 0037(it0037)................................................OK (2.4 s)
     [exec] 0036(it0036)................................................OK (3.6 s)
     [exec] 0032(it0032)................................................OK (1.2 s)
     [exec] 0030(it0030)................................................OK (7.3 s)
     [exec] 0025(it0025)................................................OK (3.5 s)
     [exec] 0024(it0024)................................................OK (4.6 s)
     [exec] 0023(it0023)................................................OK (1.6 s)
     [exec] 0021(it0021)................................................OK (1.6 s)
     [exec] 0019(it0019)................................................OK (2.2 s)
     [exec] 0018(it0018)................................................OK (1.6 s)
     [exec] 0012(it0012)................................................OK (2.9 s)
     [exec] 0011(it0011)................................................OK (1.6 s)
     [exec] 0010(it0010)................................................OK (1.6 s)
     [exec] 0009(it0009)................................................OK (3.4 s)
     [exec] 0008(it0008)................................................OK (2.6 s)
     [exec] Tests run: 379, Failures: 0, Errors: 1, Skipped: 0, Time elapsed: 1,699.464 sec
<<< FAILURE!
     [exec] testitMNG3704(org.apache.maven.it.MavenITmng3704LifecycleExecutorWrapperTest)
 Time elapsed: 8.959 sec  <<< ERROR!
     [exec] org.apache.maven.it.VerificationException: Exit code was non-zero: 100; command
line and log = 
     [exec] /tmp/apache-maven-2.2.0-RC3-SNAPSHOT/bin/mvn -e --batch-mode -Dmaven.repo.local=/opt/repos/bootstrap-maven-2.1.x
org.apache.maven.plugins:maven-clean-plugin:clean install
     [exec] + Error stacktraces are turned on.
     [exec] [INFO] Scanning for projects...
     [exec] [INFO] ------------------------------------------------------------------------
     [exec] [INFO] Building maven-mng3704-plugin Maven Mojo
     [exec] [INFO]    task-segment: [org.apache.maven.plugins:maven-clean-plugin:clean, install]
     [exec] [INFO] ------------------------------------------------------------------------
     [exec] [INFO] [clean:clean {execution: default-cli}]
     [exec] Downloading: http://repository.sonatype.org:8081/content/groups/sonatype-grid/org/apache/maven/maven-plugin-parameter-documenter/2.0.9/maven-plugin-parameter-documenter-2.0.9.jar
     [exec] Downloading: http://repository.sonatype.org:8081/content/groups/sonatype-grid/org/apache/maven/reporting/maven-reporting-api/2.0.9/maven-reporting-api-2.0.9.jar
     [exec] 9K downloaded  (maven-reporting-api-2.0.9.jar)
     [exec] 20K downloaded  (maven-plugin-parameter-documenter-2.0.9.jar)
     [exec] Downloading: http://repository.sonatype.org:8081/content/groups/sonatype-grid/org/apache/maven/maven-error-diagnostics/2.0.9/maven-error-diagnostics-2.0.9.jar
     [exec] 13K downloaded  (maven-error-diagnostics-2.0.9.jar)
     [exec] Downloading: http://repository.sonatype.org:8081/content/groups/sonatype-grid/org/apache/maven/maven-plugin-descriptor/2.0.9/maven-plugin-descriptor-2.0.9.jar
     [exec] 36K downloaded  (maven-plugin-descriptor-2.0.9.jar)
     [exec] Downloading: http://repository.sonatype.org:8081/content/groups/sonatype-grid/org/apache/maven/maven-monitor/2.0.9/maven-monitor-2.0.9.jar
     [exec] 10K downloaded  (maven-monitor-2.0.9.jar)
     [exec] [INFO] [plugin:descriptor {execution: default-descriptor}]
     [exec] [INFO] Using 2 extractors.
     [exec] [INFO] Applying extractor for language: java
     [exec] [INFO] Extractor for language: java found 1 mojo descriptors.
     [exec] [INFO] Applying extractor for language: bsh
     [exec] [INFO] Extractor for language: bsh found 0 mojo descriptors.
     [exec] [INFO] [resources:resources {execution: default-resources}]
     [exec] [WARNING] Using platform encoding (MacRoman actually) to copy filtered resources,
i.e. build is platform dependent!
     [exec] [INFO] Copying 1 resource
     [exec] [INFO] [compiler:compile {execution: default-compile}]
     [exec] [INFO] Compiling 2 source files to /private/tmp/maven-integration-tests-2.2.x/core-it-suite/target/test-classes/mng-3704/maven-mng3704-plugin/target/classes
     [exec] [INFO] [resources:testResources {execution: default-testResources}]
     [exec] [WARNING] Using platform encoding (MacRoman actually) to copy filtered resources,
i.e. build is platform dependent!
     [exec] [INFO] skip non existing resourceDirectory /private/tmp/maven-integration-tests-2.2.x/core-it-suite/target/test-classes/mng-3704/maven-mng3704-plugin/src/test/resources
     [exec] [INFO] [compiler:testCompile {execution: default-testCompile}]
     [exec] [INFO] No sources to compile
     [exec] [INFO] [surefire:test {execution: default-test}]
     [exec] [INFO] No tests to run.
     [exec] [INFO] [jar:jar {execution: default-jar}]
     [exec] [INFO] Building jar: /private/tmp/maven-integration-tests-2.2.x/core-it-suite/target/test-classes/mng-3704/maven-mng3704-plugin/target/maven-mng3704-plugin-1.jar
     [exec] [INFO] [plugin:addPluginArtifactMetadata {execution: default-addPluginArtifactMetadata}]
     [exec] [INFO] [install:install {execution: default-install}]
     [exec] [INFO] Installing /private/tmp/maven-integration-tests-2.2.x/core-it-suite/target/test-classes/mng-3704/maven-mng3704-plugin/target/maven-mng3704-plugin-1.jar
to /opt/repos/bootstrap-maven-2.1.x/org/apache/maven/its/mng3704/maven-mng3704-plugin/1/maven-mng3704-plugin-1.jar
     [exec] [INFO] [plugin:updateRegistry {execution: default-updateRegistry}]
     [exec] [INFO] ------------------------------------------------------------------------
     [exec] [INFO] BUILD SUCCESSFUL
     [exec] [INFO] ------------------------------------------------------------------------
     [exec] [INFO] Total time: 8 seconds
     [exec] [INFO] Finished at: Wed Jun 10 10:58:19 CDT 2009
     [exec] [INFO] Final Memory: 17M/30M
     [exec] [INFO] ------------------------------------------------------------------------
     [exec] ---------------------------------------------------
     [exec] constituent[0]: file:/tmp/apache-maven-2.2.0-RC3-SNAPSHOT/lib/maven-2.2.0-RC3-SNAPSHOT-uber.jar
     [exec] ---------------------------------------------------
     [exec] java.util.NoSuchElementException
     [exec] 	at java.util.HashMap$HashIterator.nextEntry(HashMap.java:844)
     [exec] 	at java.util.HashMap$ValueIterator.next(HashMap.java:871)
     [exec] 	at java.util.AbstractCollection.toArray(AbstractCollection.java:176)
     [exec] 	at java.util.ArrayList.<init>(ArrayList.java:136)
     [exec] 	at org.codehaus.plexus.DefaultPlexusContainer.disposeAllComponents(DefaultPlexusContainer.java:828)
     [exec] 	at org.codehaus.plexus.DefaultPlexusContainer.dispose(DefaultPlexusContainer.java:803)
     [exec] 	at org.codehaus.plexus.embed.Embedder.stop(Embedder.java:235)
     [exec] 	at org.apache.maven.cli.MavenCli.main(MavenCli.java:371)
     [exec] 	at org.apache.maven.cli.compat.CompatibleMain.main(CompatibleMain.java:41)
     [exec] 	at sun.reflect.NativeMethodAccessorImpl.invoke0(Native Method)
     [exec] 	at sun.reflect.NativeMethodAccessorImpl.invoke(NativeMethodAccessorImpl.java:39)
     [exec] 	at sun.reflect.DelegatingMethodAccessorImpl.invoke(DelegatingMethodAccessorImpl.java:25)
     [exec] 	at java.lang.reflect.Method.invoke(Method.java:585)
     [exec] 	at org.codehaus.classworlds.Launcher.launchEnhanced(Launcher.java:315)
     [exec] 	at org.codehaus.classworlds.Launcher.launch(Launcher.java:255)
     [exec] 	at org.codehaus.classworlds.Launcher.mainWithExitCode(Launcher.java:430)
     [exec] 	at org.codehaus.classworlds.Launcher.main(Launcher.java:375)
     [exec] 	at org.apache.maven.it.Verifier.executeGoals(Verifier.java:1275)
     [exec] 	at org.apache.maven.it.Verifier.executeGoal(Verifier.java:1128)
     [exec] 	at org.apache.maven.it.Verifier.executeGoal(Verifier.java:1122)
     [exec] 	at org.apache.maven.it.MavenITmng3704LifecycleExecutorWrapperTest.testitMNG3704(MavenITmng3704LifecycleExecutorWrapperTest.java:54)
     [exec] 
     [exec] 
     [exec] Results :
     [exec] 
     [exec] Tests in error: 
     [exec]   testitMNG3704(org.apache.maven.it.MavenITmng3704LifecycleExecutorWrapperTest)
     [exec] 
     [exec] Tests run: 379, Failures: 0, Errors: 1, Skipped: 0
     [exec] 
     [exec] [INFO] ------------------------------------------------------------------------
     [exec] [ERROR] BUILD FAILURE
     [exec] [INFO] ------------------------------------------------------------------------
     [exec] [INFO] There are test failures.
     [exec] 
     [exec] Please refer to /private/tmp/maven-integration-tests-2.2.x/core-it-suite/target/surefire-reports
for the individual test results.
     [exec] [INFO] ------------------------------------------------------------------------
     [exec] [INFO] Trace
     [exec] org.apache.maven.BuildFailureException: There are test failures.
     [exec] 
     [exec] Please refer to /private/tmp/maven-integration-tests-2.2.x/core-it-suite/target/surefire-reports
for the individual test results.
     [exec] 	at org.apache.maven.lifecycle.DefaultLifecycleExecutor.executeGoals(DefaultLifecycleExecutor.java:699)
     [exec] 	at org.apache.maven.lifecycle.DefaultLifecycleExecutor.executeGoalWithLifecycle(DefaultLifecycleExecutor.java:540)
     [exec] 	at org.apache.maven.lifecycle.DefaultLifecycleExecutor.executeGoal(DefaultLifecycleExecutor.java:519)
     [exec] 	at org.apache.maven.lifecycle.DefaultLifecycleExecutor.executeGoalAndHandleFailures(DefaultLifecycleExecutor.java:371)
     [exec] 	at org.apache.maven.lifecycle.DefaultLifecycleExecutor.executeTaskSegments(DefaultLifecycleExecutor.java:332)
     [exec] 	at org.apache.maven.lifecycle.DefaultLifecycleExecutor.execute(DefaultLifecycleExecutor.java:181)
     [exec] 	at org.apache.maven.DefaultMaven.doExecute(DefaultMaven.java:356)
     [exec] 	at org.apache.maven.DefaultMaven.execute(DefaultMaven.java:137)
     [exec] 	at org.apache.maven.cli.MavenCli.main(MavenCli.java:362)
     [exec] 	at org.apache.maven.cli.compat.CompatibleMain.main(CompatibleMain.java:41)
     [exec] 	at sun.reflect.NativeMethodAccessorImpl.invoke0(Native Method)
     [exec] 	at sun.reflect.NativeMethodAccessorImpl.invoke(NativeMethodAccessorImpl.java:39)
     [exec] 	at sun.reflect.DelegatingMethodAccessorImpl.invoke(DelegatingMethodAccessorImpl.java:25)
     [exec] 	at java.lang.reflect.Method.invoke(Method.java:585)
     [exec] 	at org.codehaus.classworlds.Launcher.launchEnhanced(Launcher.java:315)
     [exec] 	at org.codehaus.classworlds.Launcher.launch(Launcher.java:255)
     [exec] 	at org.codehaus.classworlds.Launcher.mainWithExitCode(Launcher.java:430)
     [exec] 	at org.codehaus.classworlds.Launcher.main(Launcher.java:375)
     [exec] Caused by: org.apache.maven.plugin.MojoFailureException: There are test failures.
     [exec] 
     [exec] Please refer to /private/tmp/maven-integration-tests-2.2.x/core-it-suite/target/surefire-reports
for the individual test results.
     [exec] 	at org.apache.maven.plugin.surefire.SurefirePlugin.execute(SurefirePlugin.java:575)
     [exec] 	at org.apache.maven.plugin.DefaultPluginManager.executeMojo(DefaultPluginManager.java:483)
     [exec] 	at org.apache.maven.lifecycle.DefaultLifecycleExecutor.executeGoals(DefaultLifecycleExecutor.java:678)
     [exec] 	... 17 more
     [exec] [INFO] ------------------------------------------------------------------------
     [exec] [INFO] Total time: 30 minutes 5 seconds
     [exec] [INFO] Finished at: Wed Jun 10 11:17:12 CDT 2009
     [exec] [INFO] Final Memory: 32M/74M
     [exec] [INFO] ------------------------------------------------------------------------

BUILD FAILED
http://grid.sonatype.org/ci/job/Maven-2.2.x-bootstrap/./jdk=1.5,label=osx/ws/maven-2.2.0-RC/build.xml
:298: exec returned: 1

Total time: 41 minutes 31 seconds
Archiving artifacts


Mime
View raw message