maven-notifications mailing list archives

Site index · List index
Message view « Date » · « Thread »
Top « Date » · « Thread »
From Hudson <Hud...@sonatype.org>
Subject Build failed in Hudson: Maven-Assembly-Plugin-with-ITs » 1.5,windows #27
Date Thu, 25 Jun 2009 17:19:33 GMT
See http://grid.sonatype.org/ci/job/Maven-Assembly-Plugin-with-ITs/./jdk=1.5,label=windows/27/changes

Changes:

[Benjamin Bentmann] o Added workaround for MNG-1323 that affects maven-eclipse-plugin during
CI builds on the grid

------------------------------------------
[...truncated 437 lines...]
[INFO] ...FAILED. The build exited with code 1. See C:\tmp\assembly-ITs\projects\dependency-sets\dep-with-transitive-filter\build.log
for details.
[INFO] Building: dependency-sets\dependencySet-matchScope\pom.xml
[INFO] ...FAILED. The build exited with code 1. See C:\tmp\assembly-ITs\projects\dependency-sets\dependencySet-matchScope\build.log
for details.
[INFO] Building: dependency-sets\dependencySet-nonTransitive\pom.xml
[INFO] ...FAILED. The build exited with code 1. See C:\tmp\assembly-ITs\projects\dependency-sets\dependencySet-nonTransitive\build.log
for details.
[INFO] Building: dependency-sets\dependencySet-notUnpacked\pom.xml
[INFO] ...FAILED. The build exited with code 1. See C:\tmp\assembly-ITs\projects\dependency-sets\dependencySet-notUnpacked\build.log
for details.
[INFO] Building: dependency-sets\dependencySet-projectArtifactNotIncluded\pom.xml
[INFO] ...FAILED. The build exited with code 1. See C:\tmp\assembly-ITs\projects\dependency-sets\dependencySet-projectArtifactNotIncluded\build.log
for details.
[INFO] Building: dependency-sets\dependencySet-unpacked\pom.xml
[INFO] ...FAILED. The build exited with code 1. See C:\tmp\assembly-ITs\projects\dependency-sets\dependencySet-unpacked\build.log
for details.
[INFO] Building: dependency-sets\dependencySet-unpackedExcludingMetaInf\pom.xml
[INFO] ...FAILED. The build exited with code 1. See C:\tmp\assembly-ITs\projects\dependency-sets\dependencySet-unpackedExcludingMetaInf\build.log
for details.
[INFO] Building: dependency-sets\dependencySet-unpackedSubsetsTwice\pom.xml
[INFO] ...FAILED. The build exited with code 1. See C:\tmp\assembly-ITs\projects\dependency-sets\dependencySet-unpackedSubsetsTwice\build.log
for details.
[INFO] Building: dependency-sets\dependencySet-withExecutedProject\pom.xml
[INFO] ...FAILED. The build exited with code 1. See C:\tmp\assembly-ITs\projects\dependency-sets\dependencySet-withExecutedProject\build.log
for details.
[INFO] Building: dependency-sets\include-project-artifact\pom.xml
[INFO] ...FAILED. The build exited with code 1. See C:\tmp\assembly-ITs\projects\dependency-sets\include-project-artifact\build.log
for details.
[INFO] Building: dependency-sets\include-project-attachments\pom.xml
[INFO] ...FAILED. The build exited with code 1. See C:\tmp\assembly-ITs\projects\dependency-sets\include-project-attachments\build.log
for details.
[INFO] Building: dependency-sets\include-provided\pom.xml
[INFO] ...FAILED. The build exited with code 1. See C:\tmp\assembly-ITs\projects\dependency-sets\include-provided\build.log
for details.
[INFO] Building: dependency-sets\including-pom-dependency\pom.xml
[INFO] ...FAILED. The build exited with code 1. See C:\tmp\assembly-ITs\projects\dependency-sets\including-pom-dependency\build.log
for details.
[INFO] Building: dependency-sets\including-sar-dependency\pom.xml
[INFO] ...FAILED. The build exited with code 1. See C:\tmp\assembly-ITs\projects\dependency-sets\including-sar-dependency\build.log
for details.
[INFO] Building: dependency-sets\massembly-201\pom.xml
[INFO] ...FAILED. The build exited with code 1. See C:\tmp\assembly-ITs\projects\dependency-sets\massembly-201\build.log
for details.
[INFO] Building: dependency-sets\massembly-232\pom.xml
[INFO] ...FAILED. The build exited with code 1. See C:\tmp\assembly-ITs\projects\dependency-sets\massembly-232\build.log
for details.
[INFO] Building: dependency-sets\massembly-235\pom.xml
[INFO] ...FAILED. The build exited with code 1. See C:\tmp\assembly-ITs\projects\dependency-sets\massembly-235\build.log
for details.
[INFO] Building: dependency-sets\massembly-345\pom.xml
[INFO] ...FAILED. The build exited with code 1. See C:\tmp\assembly-ITs\projects\dependency-sets\massembly-345\build.log
for details.
[INFO] Building: dependency-sets\massembly-99\pom.xml
[INFO] ...FAILED. The build exited with code 1. See C:\tmp\assembly-ITs\projects\dependency-sets\massembly-99\build.log
for details.
[INFO] Building: dependency-sets\multiple-wildcard-includes\pom.xml
[INFO] ...FAILED. The build exited with code 1. See C:\tmp\assembly-ITs\projects\dependency-sets\multiple-wildcard-includes\build.log
for details.
[INFO] Building: dependency-sets\outputFileNameMappingWithUnpack\pom.xml
[INFO] ...FAILED. The build exited with code 1. See C:\tmp\assembly-ITs\projects\dependency-sets\outputFileNameMappingWithUnpack\build.log
for details.
[INFO] Building: dependency-sets\using-moduleSet-implied-depSet\pom.xml
[INFO] ...FAILED. The build exited with code 1. See C:\tmp\assembly-ITs\projects\dependency-sets\using-moduleSet-implied-depSet\build.log
for details.
[INFO] Building: descriptor-refs\bin\jars-in-archive-root\pom.xml
[INFO] ...FAILED. The build exited with code 1. See C:\tmp\assembly-ITs\projects\descriptor-refs\bin\jars-in-archive-root\build.log
for details.
[INFO] Building: descriptor-refs\jar-with-dependencies\component-descriptors-merged\pom.xml
[INFO] ...FAILED. The build exited with code 1. See C:\tmp\assembly-ITs\projects\descriptor-refs\jar-with-dependencies\component-descriptors-merged\build.log
for details.
[INFO] Building: descriptor-refs\jar-with-dependencies\deps-unpacked-to-root-dir\pom.xml
[INFO] ...FAILED. The build exited with code 1. See C:\tmp\assembly-ITs\projects\descriptor-refs\jar-with-dependencies\deps-unpacked-to-root-dir\build.log
for details.
[INFO] Building: descriptor-refs\jar-with-dependencies\no-target-dir\pom.xml
[INFO] ...FAILED. The build exited with code 1. See C:\tmp\assembly-ITs\projects\descriptor-refs\jar-with-dependencies\no-target-dir\build.log
for details.
[INFO] Building: descriptor-refs\project\multimodule-sources-copied\pom.xml
[INFO] ...FAILED. The build exited with code 1. See C:\tmp\assembly-ITs\projects\descriptor-refs\project\multimodule-sources-copied\build.log
for details.
[INFO] Building: descriptor-refs\project\no-target-dir\pom.xml
[INFO] ...FAILED. The build exited with code 1. See C:\tmp\assembly-ITs\projects\descriptor-refs\project\no-target-dir\build.log
for details.
[INFO] Building: descriptor-refs\project\no-target-dir-multimodule\pom.xml
[INFO] ...FAILED. The build exited with code 1. See C:\tmp\assembly-ITs\projects\descriptor-refs\project\no-target-dir-multimodule\build.log
for details.
[INFO] Building: descriptor-refs\project\sources-copied\pom.xml
[INFO] ...FAILED. The build exited with code 1. See C:\tmp\assembly-ITs\projects\descriptor-refs\project\sources-copied\build.log
for details.
[INFO] Building: descriptor-refs\src\no-target-dir\pom.xml
[INFO] ...FAILED. The build exited with code 1. See C:\tmp\assembly-ITs\projects\descriptor-refs\src\no-target-dir\build.log
for details.
[INFO] Building: descriptor-refs\src\src-dir-copied\pom.xml
[INFO] ...FAILED. The build exited with code 1. See C:\tmp\assembly-ITs\projects\descriptor-refs\src\src-dir-copied\build.log
for details.
[INFO] Building: file-modes\file-set-fileMode\pom.xml
[INFO] ...FAILED. The build exited with code 1. See C:\tmp\assembly-ITs\projects\file-modes\file-set-fileMode\build.log
for details.
[INFO] Building: file-modes\fileItem-fileMode\pom.xml
[INFO] ...FAILED. The build exited with code 1. See C:\tmp\assembly-ITs\projects\file-modes\fileItem-fileMode\build.log
for details.
[INFO] Building: file-sets\default-directory-unspecified\pom.xml
[INFO] ...FAILED. The build exited with code 1. See C:\tmp\assembly-ITs\projects\file-sets\default-directory-unspecified\build.log
for details.
[INFO] Building: file-sets\default-excludes-unspecified\pom.xml
[INFO] ...FAILED. The build exited with code 1. See C:\tmp\assembly-ITs\projects\file-sets\default-excludes-unspecified\build.log
for details.
[INFO] Building: file-sets\dont-use-default-excludes\pom.xml
[INFO] ...FAILED. The build exited with code 1. See C:\tmp\assembly-ITs\projects\file-sets\dont-use-default-excludes\build.log
for details.
[INFO] Building: file-sets\excludes-using-regex\pom.xml
[INFO] ...FAILED. The build exited with code 1. See C:\tmp\assembly-ITs\projects\file-sets\excludes-using-regex\build.log
for details.
[INFO] Building: file-sets\excluding-svn-dirs\pom.xml
[INFO] ...FAILED. The build exited with code 1. See C:\tmp\assembly-ITs\projects\file-sets\excluding-svn-dirs\build.log
for details.
[INFO] Building: file-sets\filtered-module-sources\pom.xml
[INFO] ...FAILED. The build exited with code 1. See C:\tmp\assembly-ITs\projects\file-sets\filtered-module-sources\build.log
for details.
[INFO] Building: file-sets\filtered-multimodule\pom.xml
[INFO] ...FAILED. The build exited with code 1. See C:\tmp\assembly-ITs\projects\file-sets\filtered-multimodule\build.log
for details.
[INFO] Building: file-sets\include-base-directory\pom.xml
[INFO] ...FAILED. The build exited with code 1. See C:\tmp\assembly-ITs\projects\file-sets\include-base-directory\build.log
for details.
[INFO] Building: file-sets\include-parent-dir\pom.xml
[INFO] ...FAILED. The build exited with code 1. See C:\tmp\assembly-ITs\projects\file-sets\include-parent-dir\build.log
for details.
[INFO] Building: file-sets\multimodule-unix-lineEndings\pom.xml
[INFO] ...FAILED. The build exited with code 1. See C:\tmp\assembly-ITs\projects\file-sets\multimodule-unix-lineEndings\build.log
for details.
[INFO] Building: file-sets\multimodule-win-lineEndings\pom.xml
[INFO] ...FAILED. The build exited with code 1. See C:\tmp\assembly-ITs\projects\file-sets\multimodule-win-lineEndings\build.log
for details.
[INFO] Building: file-sets\use-default-excludes\pom.xml
[INFO] ...FAILED. The build exited with code 1. See C:\tmp\assembly-ITs\projects\file-sets\use-default-excludes\build.log
for details.
[INFO] Building: filtering-feature\filtersDefinedInAssemblyPluginConfig\pom.xml
[INFO] ...FAILED. The build exited with code 1. See C:\tmp\assembly-ITs\projects\filtering-feature\filtersDefinedInAssemblyPluginConfig\build.log
for details.
[INFO] Building: forking-tests\assembly-assembly-with-module-binaries\pom.xml
[INFO] ...FAILED. The build exited with code 1. See C:\tmp\assembly-ITs\projects\forking-tests\assembly-assembly-with-module-binaries\build.log
for details.
[INFO] Building: forking-tests\assembly-attached-with-module-binaries\pom.xml
[INFO] ...FAILED. The build exited with code 1. See C:\tmp\assembly-ITs\projects\forking-tests\assembly-attached-with-module-binaries\build.log
for details.
[INFO] Building: mojo-configuration\ignoreDirFormatExtensions\pom.xml
[INFO] ...FAILED. The build exited with code 1. See C:\tmp\assembly-ITs\projects\mojo-configuration\ignoreDirFormatExtensions\build.log
for details.
[INFO] Building: mojo-configuration\manifest-with-customEntry\pom.xml
[INFO] ...FAILED. The build exited with code 1. See C:\tmp\assembly-ITs\projects\mojo-configuration\manifest-with-customEntry\build.log
for details.
[INFO] Building: mojo-configuration\manifest-with-mainClass\pom.xml
[INFO] ...FAILED. The build exited with code 1. See C:\tmp\assembly-ITs\projects\mojo-configuration\manifest-with-mainClass\build.log
for details.
[INFO] Building: mojo-configuration\massembly-291\pom.xml
[INFO] ...FAILED. The build exited with code 1. See C:\tmp\assembly-ITs\projects\mojo-configuration\massembly-291\build.log
for details.
[INFO] Building: mojo-configuration\massembly-301\pom.xml
[INFO] ...FAILED. The build exited with code 1. See C:\tmp\assembly-ITs\projects\mojo-configuration\massembly-301\build.log
for details.
[INFO] Building: mojo-configuration\no-appendAssemblyId-no-classifier\pom.xml
[INFO] ...FAILED. The build exited with code 1. See C:\tmp\assembly-ITs\projects\mojo-configuration\no-appendAssemblyId-no-classifier\build.log
for details.
[INFO] Building: mojo-configuration\skipAssemblyCLIPropertySet\pom.xml
[INFO] ...FAILED. The build exited with code 1. See C:\tmp\assembly-ITs\projects\mojo-configuration\skipAssemblyCLIPropertySet\build.log
for details.
[INFO] Building: mojo-tests\single-in-one-project-hierarchy\pom.xml
[INFO] ...FAILED. The build exited with code 1. See C:\tmp\assembly-ITs\projects\mojo-tests\single-in-one-project-hierarchy\build.log
for details.
[INFO] Building: mojo-tests\single-twice-in-multimodule-hierarchy\pom.xml
[INFO] ...FAILED. The build exited with code 1. See C:\tmp\assembly-ITs\projects\mojo-tests\single-twice-in-multimodule-hierarchy\build.log
for details.
[INFO] Building: mojo-tests\single-twice-in-one-project-hierarchy\pom.xml
[INFO] ...FAILED. The build exited with code 1. See C:\tmp\assembly-ITs\projects\mojo-tests\single-twice-in-one-project-hierarchy\build.log
for details.
[INFO] Building: multimodule\massembly-298\pom.xml
[INFO] ...FAILED. The build exited with code 1. See C:\tmp\assembly-ITs\projects\multimodule\massembly-298\build.log
for details.
[INFO] Building: multimodule\two-level-multimodule\pom.xml
[INFO] ...FAILED. The build exited with code 1. See C:\tmp\assembly-ITs\projects\multimodule\two-level-multimodule\build.log
for details.
[INFO] Building: multimodule\two-level-multimodule-dontIncludeSubModules\pom.xml
[INFO] ...FAILED. The build exited with code 1. See C:\tmp\assembly-ITs\projects\multimodule\two-level-multimodule-dontIncludeSubModules\build.log
for details.
[INFO] Building: multimodule\two-levels-includeBaseDir-withBin\pom.xml
[INFO] ...FAILED. The build exited with code 1. See C:\tmp\assembly-ITs\projects\multimodule\two-levels-includeBaseDir-withBin\build.log
for details.
[INFO] Building: multimodule\two-levels-includeBaseDir-withSrc\pom.xml
[INFO] ...FAILED. The post-build script returned false.
[INFO] Building: multimodule\twoLevel-dontIncludeSubModules-artifactIdExprOutDir\pom.xml
[INFO] ...SUCCESS.
[INFO] Building: multimodule\twoLevel-includeSubModules-excludeSubModuleSourceDirs\pom.xml
[INFO] ...SUCCESS.
[INFO] Building: repositories\basic-repository\pom.xml
[INFO] ...SUCCESS.
[INFO] Building: repositories\massembly-196\pom.xml
[INFO] ...SUCCESS.
[INFO] ---------------------------------------
[INFO] Execution Summary:
[INFO]   Builds Passing: 14
[INFO]   Builds Failing: 71
[INFO] ---------------------------------------
[ERROR] The following builds failed:
[ERROR] *  bugs\massembly-285\pom.xml
[ERROR] *  bugs\massembly-306\pom.xml
[ERROR] *  bugs\massembly-375\pom.xml
[ERROR] *  container-descriptors\configured-handler\pom.xml
[ERROR] *  container-descriptors\custom-containerDescriptorHandler\pom.xml
[ERROR] *  container-descriptors\custom-handler-withFileEntries\pom.xml
[ERROR] *  container-descriptors\custom-handler-withMixedEntries\pom.xml
[ERROR] *  dependency-sets\dep-with-transitive-filter\pom.xml
[ERROR] *  dependency-sets\dependencySet-matchScope\pom.xml
[ERROR] *  dependency-sets\dependencySet-nonTransitive\pom.xml
[ERROR] *  dependency-sets\dependencySet-notUnpacked\pom.xml
[ERROR] *  dependency-sets\dependencySet-projectArtifactNotIncluded\pom.xml
[ERROR] *  dependency-sets\dependencySet-unpacked\pom.xml
[ERROR] *  dependency-sets\dependencySet-unpackedExcludingMetaInf\pom.xml
[ERROR] *  dependency-sets\dependencySet-unpackedSubsetsTwice\pom.xml
[ERROR] *  dependency-sets\dependencySet-withExecutedProject\pom.xml
[ERROR] *  dependency-sets\include-project-artifact\pom.xml
[ERROR] *  dependency-sets\include-project-attachments\pom.xml
[ERROR] *  dependency-sets\include-provided\pom.xml
[ERROR] *  dependency-sets\including-pom-dependency\pom.xml
[ERROR] *  dependency-sets\including-sar-dependency\pom.xml
[ERROR] *  dependency-sets\massembly-201\pom.xml
[ERROR] *  dependency-sets\massembly-232\pom.xml
[ERROR] *  dependency-sets\massembly-235\pom.xml
[ERROR] *  dependency-sets\massembly-345\pom.xml
[ERROR] *  dependency-sets\massembly-99\pom.xml
[ERROR] *  dependency-sets\multiple-wildcard-includes\pom.xml
[ERROR] *  dependency-sets\outputFileNameMappingWithUnpack\pom.xml
[ERROR] *  dependency-sets\using-moduleSet-implied-depSet\pom.xml
[ERROR] *  descriptor-refs\bin\jars-in-archive-root\pom.xml
[ERROR] *  descriptor-refs\jar-with-dependencies\component-descriptors-merged\pom.xml
[ERROR] *  descriptor-refs\jar-with-dependencies\deps-unpacked-to-root-dir\pom.xml
[ERROR] *  descriptor-refs\jar-with-dependencies\no-target-dir\pom.xml
[ERROR] *  descriptor-refs\project\multimodule-sources-copied\pom.xml
[ERROR] *  descriptor-refs\project\no-target-dir\pom.xml
[ERROR] *  descriptor-refs\project\no-target-dir-multimodule\pom.xml
[ERROR] *  descriptor-refs\project\sources-copied\pom.xml
[ERROR] *  descriptor-refs\src\no-target-dir\pom.xml
[ERROR] *  descriptor-refs\src\src-dir-copied\pom.xml
[ERROR] *  file-modes\file-set-fileMode\pom.xml
[ERROR] *  file-modes\fileItem-fileMode\pom.xml
[ERROR] *  file-sets\default-directory-unspecified\pom.xml
[ERROR] *  file-sets\default-excludes-unspecified\pom.xml
[ERROR] *  file-sets\dont-use-default-excludes\pom.xml
[ERROR] *  file-sets\excludes-using-regex\pom.xml
[ERROR] *  file-sets\excluding-svn-dirs\pom.xml
[ERROR] *  file-sets\filtered-module-sources\pom.xml
[ERROR] *  file-sets\filtered-multimodule\pom.xml
[ERROR] *  file-sets\include-base-directory\pom.xml
[ERROR] *  file-sets\include-parent-dir\pom.xml
[ERROR] *  file-sets\multimodule-unix-lineEndings\pom.xml
[ERROR] *  file-sets\multimodule-win-lineEndings\pom.xml
[ERROR] *  file-sets\use-default-excludes\pom.xml
[ERROR] *  filtering-feature\filtersDefinedInAssemblyPluginConfig\pom.xml
[ERROR] *  forking-tests\assembly-assembly-with-module-binaries\pom.xml
[ERROR] *  forking-tests\assembly-attached-with-module-binaries\pom.xml
[ERROR] *  mojo-configuration\ignoreDirFormatExtensions\pom.xml
[ERROR] *  mojo-configuration\manifest-with-customEntry\pom.xml
[ERROR] *  mojo-configuration\manifest-with-mainClass\pom.xml
[ERROR] *  mojo-configuration\massembly-291\pom.xml
[ERROR] *  mojo-configuration\massembly-301\pom.xml
[ERROR] *  mojo-configuration\no-appendAssemblyId-no-classifier\pom.xml
[ERROR] *  mojo-configuration\skipAssemblyCLIPropertySet\pom.xml
[ERROR] *  mojo-tests\single-in-one-project-hierarchy\pom.xml
[ERROR] *  mojo-tests\single-twice-in-multimodule-hierarchy\pom.xml
[ERROR] *  mojo-tests\single-twice-in-one-project-hierarchy\pom.xml
[ERROR] *  multimodule\massembly-298\pom.xml
[ERROR] *  multimodule\two-level-multimodule\pom.xml
[ERROR] *  multimodule\two-level-multimodule-dontIncludeSubModules\pom.xml
[ERROR] *  multimodule\two-levels-includeBaseDir-withBin\pom.xml
[ERROR] *  multimodule\two-levels-includeBaseDir-withSrc\pom.xml
[INFO] ---------------------------------------
[INFO] Error for project: Maven Assembly Plugin (during install)
[INFO] ------------------------------------------------------------------------
[INFO] : org.apache.maven.plugin.invoker.InvokerMojo@13a0934
71 builds failed.
[INFO] ------------------------------------------------------------------------
[INFO] Trace
org.apache.maven.BuildFailureException: 71 builds failed.
	at org.apache.maven.lifecycle.DefaultLifecycleExecutor.executeGoals(DefaultLifecycleExecutor.java:699)
	at org.apache.maven.lifecycle.DefaultLifecycleExecutor.executeGoalWithLifecycle(DefaultLifecycleExecutor.java:540)
	at org.apache.maven.lifecycle.DefaultLifecycleExecutor.executeGoal(DefaultLifecycleExecutor.java:519)
	at org.apache.maven.lifecycle.DefaultLifecycleExecutor.executeGoalAndHandleFailures(DefaultLifecycleExecutor.java:371)
	at org.apache.maven.lifecycle.DefaultLifecycleExecutor.executeTaskSegments(DefaultLifecycleExecutor.java:332)
	at org.apache.maven.lifecycle.DefaultLifecycleExecutor.execute(DefaultLifecycleExecutor.java:181)
	at org.apache.maven.DefaultMaven.doExecute(DefaultMaven.java:356)
	at org.apache.maven.DefaultMaven.execute(DefaultMaven.java:137)
	at org.apache.maven.cli.MavenCli.main(MavenCli.java:356)
	at sun.reflect.NativeMethodAccessorImpl.invoke0(Native Method)
	at sun.reflect.NativeMethodAccessorImpl.invoke(NativeMethodAccessorImpl.java:39)
	at sun.reflect.DelegatingMethodAccessorImpl.invoke(DelegatingMethodAccessorImpl.java:25)
	at java.lang.reflect.Method.invoke(Method.java:585)
	at org.codehaus.classworlds.Launcher.launchEnhanced(Launcher.java:315)
	at org.codehaus.classworlds.Launcher.launch(Launcher.java:255)
	at org.codehaus.classworlds.Launcher.mainWithExitCode(Launcher.java:430)
	at org.codehaus.classworlds.Launcher.main(Launcher.java:375)
Caused by: org.apache.maven.plugin.MojoFailureException: 71 builds failed.
	at org.apache.maven.plugin.invoker.InvokerMojo.execute(InvokerMojo.java:603)
	at org.apache.maven.plugin.DefaultPluginManager.executeMojo(DefaultPluginManager.java:483)
	at org.apache.maven.lifecycle.DefaultLifecycleExecutor.executeGoals(DefaultLifecycleExecutor.java:678)
	... 16 more
[INFO] ------------------------------------------------------------------------
[INFO] BUILD ERRORS
[INFO] ------------------------------------------------------------------------
[INFO] Total time: 8 minutes 17 seconds
[INFO] Finished at: Thu Jun 25 10:19:29 PDT 2009
[INFO] Final Memory: 35M/67M
[INFO] ------------------------------------------------------------------------


Mime
View raw message