maven-notifications mailing list archives: April 2009

Site index · List index
Message listThread · Author · Date
.COM Hudson Build failed in Hudson: Users votes in Jira #129 Fri, 24 Apr, 05:02
.COM Hudson Hudson build is back to normal: Users votes in Jira #130 Sat, 25 Apr, 05:04
Contin...@vmbuild.apache.org [continuum] BUILD SUCCESSFUL: Maven Integration Testing - Maven Integration Tests - default maven2 buildDefinition Fri, 03 Apr, 16:52
Contin...@vmbuild.apache.org [continuum] BUILD SUCCESSFUL: Maven Parent Projects - Apache Maven - default maven2 buildDefinition Wed, 08 Apr, 15:13
Contin...@vmbuild.apache.org [continuum] BUILD FAILURE: Maven 2.0.x Branch - Integration Test Executor - default maven2 buildDefinition Fri, 10 Apr, 00:28
Contin...@vmbuild.apache.org [continuum] BUILD FAILURE: Maven 2.0.x Branch - Integration Test Executor - default maven2 buildDefinition Fri, 10 Apr, 06:03
Contin...@vmbuild.apache.org [continuum] BUILD SUCCESSFUL: Maven 2.0.x Branch - Integration Test Executor - default maven2 buildDefinition Fri, 10 Apr, 19:59
Contin...@vmbuild.apache.org [continuum] BUILD SUCCESSFUL: Maven 2.0.x Branch - Maven Plugin Parameter Documenter API - default maven2 buildDefinition Fri, 10 Apr, 23:51
Contin...@vmbuild.apache.org [continuum] BUILD SUCCESSFUL: Maven 2.1.x Branch - Maven Plugin Registry Model - default maven2 buildDefinition Fri, 10 Apr, 23:52
Contin...@vmbuild.apache.org [continuum] BUILD SUCCESSFUL: Maven 2.0.x Branch - Maven Plugin Registry Model - default maven2 buildDefinition Fri, 10 Apr, 23:53
Contin...@vmbuild.apache.org [continuum] BUILD SUCCESSFUL: Maven 2.1.x Branch - Maven Profile Model - default maven2 buildDefinition Fri, 10 Apr, 23:54
Contin...@vmbuild.apache.org [continuum] BUILD SUCCESSFUL: Maven 2.0.x Branch - Maven Profile Model - default maven2 buildDefinition Fri, 10 Apr, 23:55
Contin...@vmbuild.apache.org [continuum] BUILD SUCCESSFUL: Maven 2.1.x Branch - Maven Project Builder - default maven2 buildDefinition Fri, 10 Apr, 23:56
Contin...@vmbuild.apache.org [continuum] BUILD SUCCESSFUL: Maven 2.0.x Branch - Maven Project Builder - default maven2 buildDefinition Fri, 10 Apr, 23:57
Contin...@vmbuild.apache.org [continuum] BUILD SUCCESSFUL: Maven 2.1.x Branch - Maven Reporting - default maven2 buildDefinition Fri, 10 Apr, 23:58
Contin...@vmbuild.apache.org [continuum] BUILD SUCCESSFUL: Maven 2.0.x Branch - Maven Reporting - default maven2 buildDefinition Fri, 10 Apr, 23:59
Contin...@vmbuild.apache.org [continuum] BUILD SUCCESSFUL: Maven 2.1.x Branch - Maven Reporting API - default maven2 buildDefinition Fri, 10 Apr, 23:59
Contin...@vmbuild.apache.org [continuum] BUILD FAILURE: Maven Parent Projects - Apache Maven - default maven2 buildDefinition Tue, 21 Apr, 05:03
Contin...@vmbuild.apache.org [continuum] BUILD ERROR: Maven Parent Projects - Apache Maven - default maven2 buildDefinition Fri, 24 Apr, 04:03
Contin...@vmbuild.apache.org [continuum] BUILD ERROR: Maven Parent Projects - Apache Maven - default maven2 buildDefinition Fri, 24 Apr, 05:03
Contin...@vmbuild.apache.org [continuum] BUILD FAILURE: Maven Parent Projects - Apache Maven - default maven2 buildDefinition Fri, 24 Apr, 07:41
Hudson Hudson build is back to normal: maven-core-integration-testing » 1.5,windows #274 Thu, 02 Apr, 21:09
Hudson Build failed in Hudson: maven-core-integration-testing » 1.5,windows #278 Sun, 12 Apr, 13:06
Hudson Build failed in Hudson: Maven-2.0.x-with-bootstrap » 1.4,windows #102 Mon, 13 Apr, 17:17
Hudson Build failed in Hudson: Maven-2.1.x-bootstrap » 1.4,windows #146 Mon, 13 Apr, 17:24
Hudson Build failed in Hudson: Maven 2.1.x » 1.5,windows #110 Mon, 13 Apr, 21:06
Hudson Build failed in Hudson: Maven-2.0.x » 1.4,windows #79 Mon, 13 Apr, 21:06
Hudson Build failed in Hudson: surefire-trunk » 1.4,ubuntu #1 Tue, 14 Apr, 16:08
Hudson Build failed in Hudson: surefire-trunk » 1.4,windows #1 Tue, 14 Apr, 16:09
Hudson Build failed in Hudson: surefire-trunk » 1.4,osx #1 Tue, 14 Apr, 16:13
Hudson Build failed in Hudson: surefire-trunk » 1.5,windows #1 Tue, 14 Apr, 16:15
Hudson Build failed in Hudson: surefire-trunk » 1.5,ubuntu #1 Tue, 14 Apr, 16:17
Hudson Build failed in Hudson: surefire-trunk » 1.5,ubuntu #2 Tue, 14 Apr, 16:34
Hudson Build failed in Hudson: surefire-trunk » 1.5,windows #2 Tue, 14 Apr, 16:35
Hudson Build failed in Hudson: surefire-trunk » 1.5,osx #2 Tue, 14 Apr, 17:26
Hudson Hudson build is back to normal: Maven 2.1.x » 1.5,windows #111 Tue, 14 Apr, 18:44
Hudson Hudson build is back to normal: Maven-2.0.x » 1.4,windows #80 Tue, 14 Apr, 19:03
Hudson Hudson build is back to normal: maven-core-integration-testing » 1.5,windows #279 Tue, 14 Apr, 19:15
Hudson Hudson build is back to normal: Maven-2.1.x-bootstrap » 1.4,windows #147 Tue, 14 Apr, 20:42
Hudson Build failed in Hudson: Maven-2.0.x-bootstrap » 1.4,osx #103 Sat, 18 Apr, 06:01
Hudson Hudson build is back to normal: Maven-2.0.x-bootstrap » 1.4,windows #103 Sat, 18 Apr, 06:09
Hudson Hudson build is back to normal: Maven-2.0.x-bootstrap » 1.4,osx #104 Sun, 19 Apr, 10:51
Hudson Build failed in Hudson: maven-parent-pom-trunk » default #26 Tue, 21 Apr, 05:06
Hudson Build failed in Hudson: Maven-2.1.x-bootstrap » 1.4,ubuntu #150 Tue, 21 Apr, 17:24
Hudson Build failed in Hudson: Maven-2.1.x-bootstrap » 1.4,windows #150 Tue, 21 Apr, 17:24
Hudson Build failed in Hudson: Maven-2.1.x-bootstrap » 1.4,osx #150 Tue, 21 Apr, 17:27
Hudson Build failed in Hudson: Maven-2.1.x-bootstrap » 1.5,windows #153 Wed, 22 Apr, 17:23
Hudson Hudson build is back to normal: Maven-2.1.x-bootstrap » 1.5,windows #154 Wed, 22 Apr, 21:50
Hudson Build failed in Hudson: Maven 2.1.x » 1.5,windows #118 Sun, 26 Apr, 21:05
Hudson Build failed in Hudson: Maven 2.1.x » 1.5,ubuntu #118 Sun, 26 Apr, 21:05
Hudson Build failed in Hudson: Maven-2.1.x-bootstrap » 1.5,windows #156 Sun, 26 Apr, 21:23
Hudson Build failed in Hudson: Maven-2.1.x-bootstrap » 1.5,ubuntu #156 Sun, 26 Apr, 21:25
Hudson Build failed in Hudson: Maven 2.1.x » 1.5,osx #118 Sun, 26 Apr, 21:56
Hudson Build failed in Hudson: Maven-2.1.x-bootstrap » 1.5,osx #156 Sun, 26 Apr, 22:15
Hudson Build failed in Hudson: Maven-2.1.x-bootstrap » 1.5,windows #157 Mon, 27 Apr, 01:23
Hudson Hudson build is back to normal: Maven-2.1.x-bootstrap » 1.5,ubuntu #157 Mon, 27 Apr, 01:47
Hudson Hudson build is back to normal: Maven-2.1.x-bootstrap » 1.5,osx #157 Mon, 27 Apr, 04:08
Hudson Build failed in Hudson: Maven 2.1.x » 1.5,windows #119 Mon, 27 Apr, 05:05
Hudson Hudson build is back to normal: Maven 2.1.x » 1.5,ubuntu #119 Mon, 27 Apr, 05:06
Hudson Hudson build is back to normal: Maven 2.1.x » 1.5,osx #119 Mon, 27 Apr, 05:14
Hudson Build failed in Hudson: Maven 2.1.x » 1.5,ubuntu #120 Mon, 27 Apr, 13:06
Hudson Build failed in Hudson: Maven 2.1.x » 1.5,windows #120 Mon, 27 Apr, 13:07
Hudson Build failed in Hudson: Maven 2.1.x » 1.5,osx #120 Mon, 27 Apr, 13:12
Hudson Build failed in Hudson: Maven-2.1.x-bootstrap » 1.5,ubuntu #158 Mon, 27 Apr, 13:23
Hudson Build failed in Hudson: Maven-2.1.x-bootstrap » 1.5,windows #158 Mon, 27 Apr, 13:23
Hudson Build failed in Hudson: Maven-2.1.x-bootstrap » 1.5,osx #158 Mon, 27 Apr, 13:24
Hudson Build failed in Hudson: Maven-2.1.x-bootstrap » 1.5,ubuntu #159 Mon, 27 Apr, 13:32
Hudson Build failed in Hudson: Maven-2.1.x-bootstrap » 1.5,windows #159 Mon, 27 Apr, 13:32
Hudson Build failed in Hudson: Maven-2.1.x-bootstrap » 1.5,osx #159 Mon, 27 Apr, 13:33
Hudson Build failed in Hudson: Maven-2.1.x-bootstrap » 1.5,ubuntu #160 Mon, 27 Apr, 17:23
Hudson Build failed in Hudson: Maven-2.1.x-bootstrap » 1.5,windows #160 Mon, 27 Apr, 17:24
Hudson Build failed in Hudson: Maven-2.1.x-bootstrap » 1.5,osx #160 Mon, 27 Apr, 20:59
Hudson Hudson build is back to normal: Maven 2.1.x » 1.5,ubuntu #121 Mon, 27 Apr, 21:06
Hudson Hudson build is back to normal: Maven 2.1.x » 1.5,windows #121 Mon, 27 Apr, 21:10
Hudson Hudson build is back to normal: Maven 2.1.x » 1.5,osx #121 Mon, 27 Apr, 22:44
Hudson Build failed in Hudson: Maven-2.1.x-bootstrap » 1.5,windows #161 Tue, 28 Apr, 17:23
Hudson Hudson build is back to normal: Maven-2.1.x-bootstrap » 1.5,ubuntu #161 Tue, 28 Apr, 17:53
Hudson Hudson build is back to normal: Maven-2.1.x-bootstrap » 1.5,osx #161 Tue, 28 Apr, 22:19
Hudson Hudson build is back to normal: Maven-2.1.x-bootstrap » 1.5,windows #162 Tue, 28 Apr, 22:53
Message listThread · Author · Date
Box list
Apr 201485
Mar 2014336
Feb 2014308
Jan 2014189
Dec 2013319
Nov 2013274
Oct 2013167
Sep 2013486
Aug 2013263
Jul 2013726
Jun 2013722
May 2013378
Apr 2013313
Mar 2013467
Feb 2013520
Jan 20131437
Dec 20121778
Nov 2012775
Oct 20121224
Sep 2012791
Aug 2012362
Jul 2012232
Jun 2012149
May 2012189
Apr 2012115
Mar 201257
Feb 2012155
Jan 2012170
Dec 2011244
Nov 2011187
Oct 2011139
Sep 2011190
Aug 2011276
Jul 201194
Jun 20114
Apr 201162
Mar 201176
Feb 201154
Jan 201185
Dec 201079
Nov 201061
Oct 201058
Sep 20101
Aug 201057
Jul 201037
Jun 201020
May 201075
Apr 201053
Mar 201012
Feb 201030
Jan 201071
Dec 2009104
Nov 200919
Oct 200931
Sep 2009193
Aug 2009268
Jul 2009193
Jun 2009147
May 200975
Apr 200979
Mar 2009134
Feb 2009657
Jan 200983
Dec 2008349
Nov 2008288
Oct 2008986
Sep 2008842
Aug 2008707
Jul 2008887
Jun 2008167
May 200821
Apr 2008231
Mar 2008438
Feb 2008317
Jan 2008205
Dec 2007185
Nov 2007532
Oct 2007439
Sep 2007699
Aug 20071294
Jul 2007351
Jun 20072211
May 2007273
Apr 2007262
Mar 2007534
Feb 20071648
Jan 20072359
Dec 2006575
Nov 2006357
Oct 2006642
Sep 2006660
Aug 20061662
Jul 20061320
Jun 2006473
May 20064700
Apr 20061113
Mar 20061048