maven-notifications mailing list archives

Site index · List index
Message view « Date » · « Thread »
Top « Date » · « Thread »
From Hudson <Hud...@sonatype.org>
Subject Build failed in Hudson: Maven 2.1.x » 1.5,ubuntu #120
Date Mon, 27 Apr 2009 13:06:09 GMT
See http://grid.sonatype.org/ci/job/Maven%202.1.x/./jdk=1.5,label=ubuntu/120/changes

Changes:

[John Casey] [MNG-4082] Use plexus-sec-dispatcher 1.3-SNAPSHOT which uses plexus-cipher 1.4-SNAPSHOT,
which in turn provides support for escaping curly braces when they are intended as literals
in password strings.

[John Casey] adding buildnumber profile for git builds.

------------------------------------------
[...truncated 815 lines...]
[INFO] ------------------------------------------------------------------------
[INFO] Building Maven Plugin API
[INFO]    task-segment: [clean, install]
[INFO] ------------------------------------------------------------------------
[INFO] [clean:clean]
[INFO] Deleting directory /home/hudson/workspace/Maven 2.1.x/jdk/1.5/label/ubuntu/maven-2.1.xx/maven-plugin-api/target
[INFO] Deleting directory /home/hudson/workspace/Maven 2.1.x/jdk/1.5/label/ubuntu/maven-2.1.xx/maven-plugin-api/target/classes
[INFO] Deleting directory /home/hudson/workspace/Maven 2.1.x/jdk/1.5/label/ubuntu/maven-2.1.xx/maven-plugin-api/target/test-classes
[INFO] Deleting directory /home/hudson/workspace/Maven 2.1.x/jdk/1.5/label/ubuntu/maven-2.1.xx/maven-plugin-api/target/site
[INFO] [enforcer:enforce {execution: enforce-jdk}]
[INFO] [remote-resources:process {execution: default}]
[INFO] [resources:resources]
[INFO] Using encoding: 'UTF-8' to copy filtered resources.
[INFO] [compiler:compile]
[INFO] Compiling 8 source files to /home/hudson/workspace/Maven 2.1.x/jdk/1.5/label/ubuntu/maven-2.1.xx/maven-plugin-api/target/classes
[INFO] [resources:testResources]
[INFO] Using encoding: 'UTF-8' to copy filtered resources.
[INFO] [compiler:testCompile]
[INFO] No sources to compile
[INFO] [surefire:test]
[INFO] Surefire report directory: /home/hudson/workspace/Maven 2.1.x/jdk/1.5/label/ubuntu/maven-2.1.xx/maven-plugin-api/target/surefire-reports

-------------------------------------------------------
 T E S T S
-------------------------------------------------------
There are no tests to run.

Results :

Tests run: 0, Failures: 0, Errors: 0, Skipped: 0

[INFO] [jar:jar]
[INFO] Building jar: /home/hudson/workspace/Maven 2.1.x/jdk/1.5/label/ubuntu/maven-2.1.xx/maven-plugin-api/target/maven-plugin-api-2.1.1-SNAPSHOT.jar
[INFO] [install:install]
[INFO] Installing /home/hudson/workspace/Maven 2.1.x/jdk/1.5/label/ubuntu/maven-2.1.xx/maven-plugin-api/target/maven-plugin-api-2.1.1-SNAPSHOT.jar
to /opt/repos/maven-2.1.x/org/apache/maven/maven-plugin-api/2.1.1-SNAPSHOT/maven-plugin-api-2.1.1-SNAPSHOT.jar
[INFO] ------------------------------------------------------------------------
[INFO] Building Maven Plugin Descriptor Model
[INFO]    task-segment: [clean, install]
[INFO] ------------------------------------------------------------------------
[INFO] [clean:clean]
[INFO] Deleting directory /home/hudson/workspace/Maven 2.1.x/jdk/1.5/label/ubuntu/maven-2.1.xx/maven-plugin-descriptor/target
[INFO] Deleting directory /home/hudson/workspace/Maven 2.1.x/jdk/1.5/label/ubuntu/maven-2.1.xx/maven-plugin-descriptor/target/classes
[INFO] Deleting directory /home/hudson/workspace/Maven 2.1.x/jdk/1.5/label/ubuntu/maven-2.1.xx/maven-plugin-descriptor/target/test-classes
[INFO] Deleting directory /home/hudson/workspace/Maven 2.1.x/jdk/1.5/label/ubuntu/maven-2.1.xx/maven-plugin-descriptor/target/site
[INFO] [enforcer:enforce {execution: enforce-jdk}]
[INFO] [modello:java {execution: standard}]
[INFO] outputDirectory: /home/hudson/workspace/Maven 2.1.x/jdk/1.5/label/ubuntu/maven-2.1.xx/maven-plugin-descriptor/target/generated-sources/modello
[INFO] Working on model: src/main/mdo/lifecycle.mdo
[INFO] Generating current version: 1.0.0
[INFO] [modello:xpp3-reader {execution: standard}]
[INFO] outputDirectory: /home/hudson/workspace/Maven 2.1.x/jdk/1.5/label/ubuntu/maven-2.1.xx/maven-plugin-descriptor/target/generated-sources/modello
[INFO] Working on model: src/main/mdo/lifecycle.mdo
[INFO] Generating current version: 1.0.0
[INFO] [modello:xpp3-writer {execution: standard}]
[INFO] outputDirectory: /home/hudson/workspace/Maven 2.1.x/jdk/1.5/label/ubuntu/maven-2.1.xx/maven-plugin-descriptor/target/generated-sources/modello
[INFO] Working on model: src/main/mdo/lifecycle.mdo
[INFO] Generating current version: 1.0.0
[INFO] [remote-resources:process {execution: default}]
[INFO] [resources:resources]
[INFO] Using encoding: 'UTF-8' to copy filtered resources.
[INFO] [compiler:compile]
[INFO] Compiling 15 source files to /home/hudson/workspace/Maven 2.1.x/jdk/1.5/label/ubuntu/maven-2.1.xx/maven-plugin-descriptor/target/classes
[INFO] [resources:testResources]
[INFO] Using encoding: 'UTF-8' to copy filtered resources.
[INFO] [compiler:testCompile]
[INFO] Compiling 1 source file to /home/hudson/workspace/Maven 2.1.x/jdk/1.5/label/ubuntu/maven-2.1.xx/maven-plugin-descriptor/target/test-classes
[INFO] [surefire:test]
[INFO] Surefire report directory: /home/hudson/workspace/Maven 2.1.x/jdk/1.5/label/ubuntu/maven-2.1.xx/maven-plugin-descriptor/target/surefire-reports

-------------------------------------------------------
 T E S T S
-------------------------------------------------------
Running org.apache.maven.plugin.lifecycle.LifecycleXpp3ReaderTest
Tests run: 1, Failures: 0, Errors: 0, Skipped: 0, Time elapsed: 0.039 sec

Results :

Tests run: 1, Failures: 0, Errors: 0, Skipped: 0

[INFO] [jar:jar]
[INFO] Building jar: /home/hudson/workspace/Maven 2.1.x/jdk/1.5/label/ubuntu/maven-2.1.xx/maven-plugin-descriptor/target/maven-plugin-descriptor-2.1.1-SNAPSHOT.jar
[INFO] [install:install]
[INFO] Installing /home/hudson/workspace/Maven 2.1.x/jdk/1.5/label/ubuntu/maven-2.1.xx/maven-plugin-descriptor/target/maven-plugin-descriptor-2.1.1-SNAPSHOT.jar
to /opt/repos/maven-2.1.x/org/apache/maven/maven-plugin-descriptor/2.1.1-SNAPSHOT/maven-plugin-descriptor-2.1.1-SNAPSHOT.jar
[INFO] ------------------------------------------------------------------------
[INFO] Building Maven Monitor
[INFO]    task-segment: [clean, install]
[INFO] ------------------------------------------------------------------------
[INFO] [clean:clean]
[INFO] Deleting directory /home/hudson/workspace/Maven 2.1.x/jdk/1.5/label/ubuntu/maven-2.1.xx/maven-monitor/target
[INFO] Deleting directory /home/hudson/workspace/Maven 2.1.x/jdk/1.5/label/ubuntu/maven-2.1.xx/maven-monitor/target/classes
[INFO] Deleting directory /home/hudson/workspace/Maven 2.1.x/jdk/1.5/label/ubuntu/maven-2.1.xx/maven-monitor/target/test-classes
[INFO] Deleting directory /home/hudson/workspace/Maven 2.1.x/jdk/1.5/label/ubuntu/maven-2.1.xx/maven-monitor/target/site
[INFO] [enforcer:enforce {execution: enforce-jdk}]
[INFO] [remote-resources:process {execution: default}]
[INFO] [resources:resources]
[INFO] Using encoding: 'UTF-8' to copy filtered resources.
[INFO] [compiler:compile]
[INFO] Compiling 5 source files to /home/hudson/workspace/Maven 2.1.x/jdk/1.5/label/ubuntu/maven-2.1.xx/maven-monitor/target/classes
[INFO] [resources:testResources]
[INFO] Using encoding: 'UTF-8' to copy filtered resources.
[INFO] [compiler:testCompile]
[INFO] No sources to compile
[INFO] [surefire:test]
[INFO] Surefire report directory: /home/hudson/workspace/Maven 2.1.x/jdk/1.5/label/ubuntu/maven-2.1.xx/maven-monitor/target/surefire-reports

-------------------------------------------------------
 T E S T S
-------------------------------------------------------
There are no tests to run.

Results :

Tests run: 0, Failures: 0, Errors: 0, Skipped: 0

[INFO] [jar:jar]
[INFO] Building jar: /home/hudson/workspace/Maven 2.1.x/jdk/1.5/label/ubuntu/maven-2.1.xx/maven-monitor/target/maven-monitor-2.1.1-SNAPSHOT.jar
[INFO] [install:install]
[INFO] Installing /home/hudson/workspace/Maven 2.1.x/jdk/1.5/label/ubuntu/maven-2.1.xx/maven-monitor/target/maven-monitor-2.1.1-SNAPSHOT.jar
to /opt/repos/maven-2.1.x/org/apache/maven/maven-monitor/2.1.1-SNAPSHOT/maven-monitor-2.1.1-SNAPSHOT.jar
[INFO] ------------------------------------------------------------------------
[INFO] Building Maven Core
[INFO]    task-segment: [clean, install]
[INFO] ------------------------------------------------------------------------
[INFO] [clean:clean]
[INFO] Deleting directory /home/hudson/workspace/Maven 2.1.x/jdk/1.5/label/ubuntu/maven-2.1.xx/maven-core/target
[INFO] Deleting directory /home/hudson/workspace/Maven 2.1.x/jdk/1.5/label/ubuntu/maven-2.1.xx/maven-core/target/classes
[INFO] Deleting directory /home/hudson/workspace/Maven 2.1.x/jdk/1.5/label/ubuntu/maven-2.1.xx/maven-core/target/test-classes
[INFO] Deleting directory /home/hudson/workspace/Maven 2.1.x/jdk/1.5/label/ubuntu/maven-2.1.xx/maven-core/target/site
[INFO] snapshot org.sonatype.plexus:plexus-sec-dispatcher:1.3-SNAPSHOT: checking for updates
from central
[INFO] snapshot org.sonatype.plexus:plexus-sec-dispatcher:1.3-SNAPSHOT: checking for updates
from apache.snapshots
Downloading: http://repository.sonatype.org:8081/content/groups/sonatype-grid/org/sonatype/plexus/plexus-sec-dispatcher/1.3-SNAPSHOT/plexus-sec-dispatcher-1.3-SNAPSHOT.pom
Downloading: http://repository.sonatype.org:8081/content/groups/sonatype-grid/org/sonatype/plexus/plexus-sec-dispatcher/1.3-SNAPSHOT/plexus-sec-dispatcher-1.3-SNAPSHOT.pom
Downloading: http://repository.sonatype.org:8081/content/groups/sonatype-grid/org/sonatype/plexus/plexus-sec-dispatcher/1.3-SNAPSHOT/plexus-sec-dispatcher-1.3-SNAPSHOT.jar
Downloading: http://repository.sonatype.org:8081/content/groups/sonatype-grid/org/sonatype/plexus/plexus-sec-dispatcher/1.3-SNAPSHOT/plexus-sec-dispatcher-1.3-SNAPSHOT.jar
[INFO] ------------------------------------------------------------------------
[ERROR] BUILD ERROR
[INFO] ------------------------------------------------------------------------
[INFO] Failed to resolve artifact.

Missing:
----------
1) org.sonatype.plexus:plexus-sec-dispatcher:jar:1.3-SNAPSHOT

  Try downloading the file manually from the project website.

  Then, install it using the command: 
      mvn install:install-file -DgroupId=org.sonatype.plexus -DartifactId=plexus-sec-dispatcher
-Dversion=1.3-SNAPSHOT -Dpackaging=jar -Dfile=/path/to/file

  Alternatively, if you host your own repository you can deploy the file there: 
      mvn deploy:deploy-file -DgroupId=org.sonatype.plexus -DartifactId=plexus-sec-dispatcher
-Dversion=1.3-SNAPSHOT -Dpackaging=jar -Dfile=/path/to/file -Durl=[url] -DrepositoryId=[id]

  Path to dependency: 
  	1) org.apache.maven:maven-core:jar:2.1.1-SNAPSHOT
  	2) org.sonatype.plexus:plexus-sec-dispatcher:jar:1.3-SNAPSHOT

----------
1 required artifact is missing.

for artifact: 
  org.apache.maven:maven-core:jar:2.1.1-SNAPSHOT

from the specified remote repositories:
  Nexus (http://repository.sonatype.org:8081/content/groups/sonatype-grid)



[INFO] ------------------------------------------------------------------------
[INFO] Trace
org.apache.maven.lifecycle.LifecycleExecutionException: Missing:
----------
1) org.sonatype.plexus:plexus-sec-dispatcher:jar:1.3-SNAPSHOT

  Try downloading the file manually from the project website.

  Then, install it using the command: 
      mvn install:install-file -DgroupId=org.sonatype.plexus -DartifactId=plexus-sec-dispatcher
-Dversion=1.3-SNAPSHOT -Dpackaging=jar -Dfile=/path/to/file

  Alternatively, if you host your own repository you can deploy the file there: 
      mvn deploy:deploy-file -DgroupId=org.sonatype.plexus -DartifactId=plexus-sec-dispatcher
-Dversion=1.3-SNAPSHOT -Dpackaging=jar -Dfile=/path/to/file -Durl=[url] -DrepositoryId=[id]

  Path to dependency: 
  	1) org.apache.maven:maven-core:jar:2.1.1-SNAPSHOT
  	2) org.sonatype.plexus:plexus-sec-dispatcher:jar:1.3-SNAPSHOT

----------
1 required artifact is missing.

for artifact: 
  org.apache.maven:maven-core:jar:2.1.1-SNAPSHOT

from the specified remote repositories:
  Nexus (http://repository.sonatype.org:8081/content/groups/sonatype-grid)


	at org.apache.maven.lifecycle.DefaultLifecycleExecutor.executeGoals(DefaultLifecycleExecutor.java:693)
	at org.apache.maven.lifecycle.DefaultLifecycleExecutor.executeGoalWithLifecycle(DefaultLifecycleExecutor.java:538)
	at org.apache.maven.lifecycle.DefaultLifecycleExecutor.executeGoal(DefaultLifecycleExecutor.java:517)
	at org.apache.maven.lifecycle.DefaultLifecycleExecutor.executeGoalAndHandleFailures(DefaultLifecycleExecutor.java:369)
	at org.apache.maven.lifecycle.DefaultLifecycleExecutor.executeTaskSegments(DefaultLifecycleExecutor.java:330)
	at org.apache.maven.lifecycle.DefaultLifecycleExecutor.execute(DefaultLifecycleExecutor.java:181)
	at org.apache.maven.DefaultMaven.doExecute(DefaultMaven.java:336)
	at org.apache.maven.DefaultMaven.execute(DefaultMaven.java:129)
	at org.apache.maven.cli.MavenCli.main(MavenCli.java:302)
	at sun.reflect.NativeMethodAccessorImpl.invoke0(Native Method)
	at sun.reflect.NativeMethodAccessorImpl.invoke(NativeMethodAccessorImpl.java:39)
	at sun.reflect.DelegatingMethodAccessorImpl.invoke(DelegatingMethodAccessorImpl.java:25)
	at java.lang.reflect.Method.invoke(Method.java:585)
	at org.codehaus.classworlds.Launcher.launchEnhanced(Launcher.java:315)
	at org.codehaus.classworlds.Launcher.launch(Launcher.java:255)
	at org.codehaus.classworlds.Launcher.mainWithExitCode(Launcher.java:430)
	at org.codehaus.classworlds.Launcher.main(Launcher.java:375)
Caused by: org.apache.maven.artifact.resolver.MultipleArtifactsNotFoundException: Missing:
----------
1) org.sonatype.plexus:plexus-sec-dispatcher:jar:1.3-SNAPSHOT

  Try downloading the file manually from the project website.

  Then, install it using the command: 
      mvn install:install-file -DgroupId=org.sonatype.plexus -DartifactId=plexus-sec-dispatcher
-Dversion=1.3-SNAPSHOT -Dpackaging=jar -Dfile=/path/to/file

  Alternatively, if you host your own repository you can deploy the file there: 
      mvn deploy:deploy-file -DgroupId=org.sonatype.plexus -DartifactId=plexus-sec-dispatcher
-Dversion=1.3-SNAPSHOT -Dpackaging=jar -Dfile=/path/to/file -Durl=[url] -DrepositoryId=[id]

  Path to dependency: 
  	1) org.apache.maven:maven-core:jar:2.1.1-SNAPSHOT
  	2) org.sonatype.plexus:plexus-sec-dispatcher:jar:1.3-SNAPSHOT

----------
1 required artifact is missing.

for artifact: 
  org.apache.maven:maven-core:jar:2.1.1-SNAPSHOT

from the specified remote repositories:
  Nexus (http://repository.sonatype.org:8081/content/groups/sonatype-grid)


	at org.apache.maven.artifact.resolver.DefaultArtifactResolver.resolveTransitively(DefaultArtifactResolver.java:324)
	at org.apache.maven.artifact.resolver.DefaultArtifactResolver.resolveTransitively(DefaultArtifactResolver.java:288)
	at org.apache.maven.plugin.DefaultPluginManager.resolveTransitiveDependencies(DefaultPluginManager.java:1440)
	at org.apache.maven.plugin.DefaultPluginManager.executeMojo(DefaultPluginManager.java:410)
	at org.apache.maven.lifecycle.DefaultLifecycleExecutor.executeGoals(DefaultLifecycleExecutor.java:676)
	... 16 more
[INFO] ------------------------------------------------------------------------
[INFO] Total time: 48 seconds
[INFO] Finished at: Mon Apr 27 07:06:08 GMT-06:00 2009
[INFO] Final Memory: 37M/80M
[INFO] ------------------------------------------------------------------------
[locks-and-latches] Releasing all the locks
[locks-and-latches] All the locks released


Mime
View raw message