maven-notifications mailing list archives: March 2009

Site index · List index
Message list1 · 2 · Next »Thread · Author · Date
Contin...@vmbuild.apache.org [continuum] BUILD SUCCESSFUL: Maven Plugins - Maven Resources Plugin - default maven2 buildDefinition Sat, 07 Mar, 00:01
Contin...@vmbuild.apache.org [continuum] BUILD FAILURE: Maven 2.1.x Branch - Maven Ant Mojo Support - default maven2 buildDefinition Mon, 09 Mar, 16:18
Contin...@vmbuild.apache.org [continuum] BUILD FAILURE: Maven 2.1.x Branch - Maven Artifact Manager - default maven2 buildDefinition Mon, 09 Mar, 16:20
Contin...@vmbuild.apache.org [continuum] BUILD FAILURE: Maven 2.1.x Branch - Maven Artifact Test Helper Library - default maven2 buildDefinition Mon, 09 Mar, 16:21
Contin...@vmbuild.apache.org [continuum] BUILD FAILURE: Maven 2.1.x Branch - Maven Core - default maven2 buildDefinition Mon, 09 Mar, 16:23
Contin...@vmbuild.apache.org [continuum] BUILD FAILURE: Maven 2.1.x Branch - Maven Distribution - default maven2 buildDefinition Mon, 09 Mar, 16:23
Contin...@vmbuild.apache.org [continuum] BUILD FAILURE: Maven 2.1.x Branch - Maven Local Settings Model - default maven2 buildDefinition Mon, 09 Mar, 16:36
Contin...@vmbuild.apache.org [continuum] BUILD FAILURE: Maven 2.1.x Branch - Maven Plugin Descriptor Model - default maven2 buildDefinition Mon, 09 Mar, 16:40
Contin...@vmbuild.apache.org [continuum] BUILD FAILURE: Maven 2.1.x Branch - Maven Profile Model - default maven2 buildDefinition Mon, 09 Mar, 16:43
Contin...@vmbuild.apache.org [continuum] BUILD FAILURE: Maven 2.1.x Branch - Maven Project Builder - default maven2 buildDefinition Mon, 09 Mar, 16:44
Contin...@vmbuild.apache.org [continuum] BUILD FAILURE: Maven 2.1.x Branch - Maven Artifact Manager - default maven2 buildDefinition Mon, 09 Mar, 22:55
Contin...@vmbuild.apache.org [continuum] BUILD FAILURE: Maven 2.1.x Branch - Maven Artifact Test Helper Library - default maven2 buildDefinition Mon, 09 Mar, 22:56
Contin...@vmbuild.apache.org [continuum] BUILD FAILURE: Maven 2.1.x Branch - Maven Beanshell Mojo Support - default maven2 buildDefinition Mon, 09 Mar, 22:56
Contin...@vmbuild.apache.org [continuum] BUILD FAILURE: Maven 2.1.x Branch - Maven Core - default maven2 buildDefinition Mon, 09 Mar, 22:58
Contin...@vmbuild.apache.org [continuum] BUILD FAILURE: Maven 2.1.x Branch - Maven Distribution - default maven2 buildDefinition Mon, 09 Mar, 22:58
Contin...@vmbuild.apache.org [continuum] BUILD SUCCESSFUL: Maven 2.1.x Branch - Maven Local Settings Model - default maven2 buildDefinition Mon, 09 Mar, 23:15
Contin...@vmbuild.apache.org [continuum] BUILD SUCCESSFUL: Maven 2.1.x Branch - Maven Plugin Descriptor Model - default maven2 buildDefinition Mon, 09 Mar, 23:18
Contin...@vmbuild.apache.org [continuum] BUILD SUCCESSFUL: Maven 2.1.x Branch - Maven Profile Model - default maven2 buildDefinition Mon, 09 Mar, 23:20
Contin...@vmbuild.apache.org [continuum] BUILD FAILURE: Maven 2.1.x Branch - Maven Project Builder - default maven2 buildDefinition Mon, 09 Mar, 23:21
Contin...@vmbuild.apache.org [continuum] BUILD FAILURE: Maven 2.1.x Branch - Maven Toolchains - default maven2 buildDefinition Mon, 09 Mar, 23:24
Contin...@vmbuild.apache.org [continuum] BUILD FAILURE: Maven 2.1.x Branch - Maven Artifact Test Helper Library - default maven2 buildDefinition Tue, 10 Mar, 09:29
Contin...@vmbuild.apache.org [continuum] BUILD FAILURE: Maven 2.1.x Branch - Maven Core - default maven2 buildDefinition Tue, 10 Mar, 09:31
Contin...@vmbuild.apache.org [continuum] BUILD FAILURE: Maven 2.1.x Branch - Maven Project Builder - default maven2 buildDefinition Tue, 10 Mar, 09:44
Contin...@vmbuild.apache.org [continuum] BUILD FAILURE: Maven 2.1.x Branch - Maven Ant Mojo Support - default maven2 buildDefinition Tue, 10 Mar, 10:58
Contin...@vmbuild.apache.org [continuum] BUILD FAILURE: Maven 2.1.x Branch - Maven Artifact Manager - default maven2 buildDefinition Tue, 10 Mar, 10:59
Contin...@vmbuild.apache.org [continuum] BUILD FAILURE: Maven 2.1.x Branch - Maven Artifact Test Helper Library - default maven2 buildDefinition Tue, 10 Mar, 11:01
Contin...@vmbuild.apache.org [continuum] BUILD SUCCESSFUL: Maven 2.1.x Branch - Maven Beanshell Mojo Support - default maven2 buildDefinition Tue, 10 Mar, 11:02
Contin...@vmbuild.apache.org [continuum] BUILD FAILURE: Maven 2.1.x Branch - Maven Project Builder - default maven2 buildDefinition Tue, 10 Mar, 11:05
Contin...@vmbuild.apache.org [continuum] BUILD FAILURE: Maven 2.1.x Branch - Maven Core - default maven2 buildDefinition Tue, 10 Mar, 11:08
Contin...@vmbuild.apache.org [continuum] BUILD FAILURE: Maven 2.1.x Branch - Maven Toolchains - default maven2 buildDefinition Tue, 10 Mar, 11:08
Contin...@vmbuild.apache.org [continuum] BUILD FAILURE: Maven 2.1.x Branch - Maven Distribution - default maven2 buildDefinition Tue, 10 Mar, 11:09
Contin...@vmbuild.apache.org [continuum] BUILD FAILURE: Maven 2.1.x Branch - Maven Ant Mojo Support - default maven2 buildDefinition Tue, 10 Mar, 14:49
Contin...@vmbuild.apache.org [continuum] BUILD SUCCESSFUL: Maven 2.1.x Branch - Maven Artifact Manager - default maven2 buildDefinition Tue, 10 Mar, 14:50
Contin...@vmbuild.apache.org [continuum] BUILD SUCCESSFUL: Maven 2.1.x Branch - Maven Artifact Test Helper Library - default maven2 buildDefinition Tue, 10 Mar, 14:52
Contin...@vmbuild.apache.org [continuum] BUILD FAILURE: Maven 2.1.x Branch - Maven Core - default maven2 buildDefinition Tue, 10 Mar, 14:54
Contin...@vmbuild.apache.org [continuum] BUILD SUCCESSFUL: Maven 2.1.x Branch - Maven Project Builder - default maven2 buildDefinition Tue, 10 Mar, 15:24
Contin...@vmbuild.apache.org [continuum] BUILD FAILURE: Maven 2.1.x Branch - Maven Ant Mojo Support - default maven2 buildDefinition Tue, 10 Mar, 18:38
Contin...@vmbuild.apache.org [continuum] BUILD SUCCESSFUL: Maven 2.1.x Branch - Maven Core - default maven2 buildDefinition Tue, 10 Mar, 18:41
Contin...@vmbuild.apache.org [continuum] BUILD FAILURE: Maven 2.1.x Branch - Maven Distribution - default maven2 buildDefinition Tue, 10 Mar, 18:42
Contin...@vmbuild.apache.org [continuum] BUILD SUCCESSFUL: Maven 2.1.x Branch - Maven Toolchains - default maven2 buildDefinition Tue, 10 Mar, 18:55
Contin...@vmbuild.apache.org [continuum] BUILD SUCCESSFUL: Maven 2.1.x Branch - Maven Ant Mojo Support - default maven2 buildDefinition Tue, 10 Mar, 19:59
Contin...@vmbuild.apache.org [continuum] BUILD SUCCESSFUL: Maven 2.1.x Branch - Maven Distribution - default maven2 buildDefinition Tue, 10 Mar, 20:03
Contin...@vmbuild.apache.org [continuum] BUILD SUCCESSFUL: Maven 2.0.x Branch - Integration Test Executor - default maven2 buildDefinition Sat, 14 Mar, 03:14
Contin...@vmbuild.apache.org [continuum] BUILD SUCCESSFUL: Maven Parent Projects - Apache Maven - default maven2 buildDefinition Sun, 15 Mar, 21:46
Contin...@vmbuild.apache.org [continuum] BUILD SUCCESSFUL: Maven Plugins - Maven WAR Plugin - default maven2 buildDefinition Mon, 16 Mar, 06:01
Contin...@vmbuild.apache.org [continuum] BUILD FAILURE: Maven Integration Testing - Maven Integration Test Plugin :: Plugin Dependency - default maven2 buildDefinition Tue, 17 Mar, 13:44
Contin...@vmbuild.apache.org [continuum] BUILD SUCCESSFUL: Maven Integration Testing - Maven Integration Test Plugin :: Invalid Descriptor - default maven2 buildDefinition Tue, 17 Mar, 13:45
Contin...@vmbuild.apache.org [continuum] BUILD SUCCESSFUL: Maven 2.1.x Branch - Maven - default maven2 buildDefinition Wed, 18 Mar, 01:50
Contin...@vmbuild.apache.org [continuum] BUILD SUCCESSFUL: Maven Integration Testing - Maven Integration Test Plugin :: Plugin Dependency - default maven2 buildDefinition Wed, 18 Mar, 02:03
Hudson Build failed in Hudson: Maven-2.0.x-with-bootstrap » 1.4,osx #97 Sun, 01 Mar, 10:19
Hudson Build failed in Hudson: Maven-2.1.x-bootstrap » 1.4,osx #116 Sun, 01 Mar, 10:25
Hudson Build failed in Hudson: Maven-2.1.x-bootstrap » 1.4,windows #116 Sun, 01 Mar, 10:28
Hudson Build failed in Hudson: Maven-2.1.x-bootstrap » 1.4,osx #117 Sun, 01 Mar, 14:25
Hudson Build failed in Hudson: maven-shared » 1.5,windows #67 Sun, 01 Mar, 14:36
Hudson Build failed in Hudson: maven-shared » 1.5,ubuntu #67 Sun, 01 Mar, 14:37
Hudson Hudson build is back to normal: Maven-2.1.x-bootstrap » 1.4,windows #117 Sun, 01 Mar, 14:44
Hudson Hudson build is back to normal: maven-shared » 1.5,windows #68 Mon, 02 Mar, 09:32
Hudson Hudson build is back to normal: maven-shared » 1.5,ubuntu #68 Mon, 02 Mar, 09:32
Hudson Build failed in Hudson: Maven-2.1.x-bootstrap » 1.4,osx #118 Tue, 03 Mar, 02:25
Hudson Build failed in Hudson: Maven-2.1.x-bootstrap » 1.4,osx #119 Tue, 03 Mar, 14:25
Hudson Build failed in Hudson: Maven-2.0.x-with-bootstrap » 1.4,osx #98 Wed, 04 Mar, 14:18
Hudson Build failed in Hudson: Maven-2.1.x-bootstrap » 1.4,osx #120 Wed, 04 Mar, 14:25
Hudson Build failed in Hudson: Maven-2.0.x-with-bootstrap » 1.4,ubuntu #98 Wed, 04 Mar, 14:42
Hudson Build failed in Hudson: Maven-2.0.x-with-bootstrap » 1.4,windows #98 Wed, 04 Mar, 14:45
Hudson Build failed in Hudson: Maven-2.1.x-bootstrap » 1.4,ubuntu #120 Wed, 04 Mar, 14:47
Hudson Build failed in Hudson: Maven-2.1.x-bootstrap » 1.4,windows #120 Wed, 04 Mar, 14:52
Hudson Build failed in Hudson: Maven-2.1.x-bootstrap » 1.4,osx #121 Wed, 04 Mar, 18:25
Hudson Hudson build is back to normal: Maven-2.1.x-bootstrap » 1.4,ubuntu #121 Wed, 04 Mar, 18:44
Hudson Hudson build is back to normal: Maven-2.1.x-bootstrap » 1.4,windows #121 Wed, 04 Mar, 18:47
Hudson Build failed in Hudson: Maven-2.1.x-bootstrap » 1.4,windows #122 Wed, 04 Mar, 18:58
Hudson Build failed in Hudson: Maven-2.1.x-bootstrap » 1.4,ubuntu #122 Wed, 04 Mar, 18:58
Hudson Hudson build is back to normal: Maven-2.1.x-bootstrap » 1.4,osx #122 Wed, 04 Mar, 19:35
Hudson Hudson build is back to normal: Maven-2.1.x-bootstrap » 1.4,ubuntu #123 Wed, 04 Mar, 22:55
Hudson Hudson build is back to normal: Maven-2.1.x-bootstrap » 1.4,windows #123 Wed, 04 Mar, 23:01
Hudson Build failed in Hudson: Maven-2.1.x-bootstrap » 1.4,osx #124 Thu, 05 Mar, 17:04
Hudson Hudson build is back to normal: Maven-2.0.x-with-bootstrap » 1.4,ubuntu #99 Thu, 05 Mar, 22:19
Hudson Hudson build is back to normal: Maven-2.0.x-with-bootstrap » 1.4,windows #99 Thu, 05 Mar, 22:21
Hudson Hudson build is back to normal: Maven-2.0.x-with-bootstrap » 1.4,osx #99 Thu, 05 Mar, 22:26
Hudson Build failed in Hudson: Maven 2.1.x » 1.5,windows #98 Sun, 08 Mar, 13:05
Hudson Build failed in Hudson: Maven-2.1.x-bootstrap » 1.4,windows #131 Sun, 08 Mar, 13:24
Hudson Build failed in Hudson: maven-core-integration-testing » 1.5,windows #247 Sun, 08 Mar, 21:05
Hudson Build failed in Hudson: Maven-2.1.x-bootstrap » 1.4,windows #132 Mon, 09 Mar, 17:24
Hudson Build failed in Hudson: Maven-2.1.x-bootstrap » 1.4,osx #132 Mon, 09 Mar, 17:24
Hudson Build failed in Hudson: Maven-2.1.x-bootstrap » 1.4,ubuntu #132 Mon, 09 Mar, 17:24
Hudson Hudson build is back to normal: maven-core-integration-testing » 1.5,windows #248 Mon, 09 Mar, 19:43
Hudson Hudson build is back to normal: Maven 2.1.x » 1.5,windows #99 Mon, 09 Mar, 20:19
Hudson Hudson build is back to normal: Maven-2.1.x-bootstrap » 1.4,ubuntu #133 Mon, 09 Mar, 20:47
Hudson Hudson build is back to normal: Maven-2.1.x-bootstrap » 1.4,osx #133 Mon, 09 Mar, 20:51
Hudson Hudson build is back to normal: Maven-2.1.x-bootstrap » 1.4,windows #133 Mon, 09 Mar, 20:51
Hudson Build failed in Hudson: maven-core-integration-testing » 1.5,windows #253 Tue, 10 Mar, 21:04
Hudson Build failed in Hudson: Maven 2.1.x » 1.5,windows #100 Tue, 10 Mar, 21:05
Hudson Build failed in Hudson: Maven-2.1.x-bootstrap » 1.4,windows #134 Tue, 10 Mar, 21:24
Hudson Hudson build is back to normal: Maven 2.1.x » 1.5,windows #101 Wed, 11 Mar, 13:14
Hudson Hudson build is back to normal: Maven-2.1.x-bootstrap » 1.4,windows #135 Wed, 11 Mar, 13:51
Hudson Hudson build is back to normal: maven-core-integration-testing » 1.5,windows #254 Fri, 13 Mar, 05:15
Hudson Build failed in Hudson: Maven 2.1.x » 1.5,windows #103 Fri, 13 Mar, 21:15
Hudson Build failed in Hudson: Maven-release-trunk » 1.5,windows #26 Sat, 14 Mar, 16:57
Hudson Build failed in Hudson: Maven 2.1.x » 1.5,windows #104 Sat, 14 Mar, 21:06
Hudson Build failed in Hudson: Maven-2.1.x-bootstrap » 1.4,windows #139 Sat, 14 Mar, 21:24
Hudson Build failed in Hudson: Maven-2.1.x-bootstrap » 1.4,windows #140 Sun, 15 Mar, 01:24
Message list1 · 2 · Next »Thread · Author · Date
Box list
Sep 2014199
Aug 2014246
Jul 2014317
Jun 2014341
May 2014161
Apr 2014146
Mar 2014336
Feb 2014308
Jan 2014189
Dec 2013319
Nov 2013274
Oct 2013167
Sep 2013486
Aug 2013263
Jul 2013726
Jun 2013722
May 2013378
Apr 2013313
Mar 2013467
Feb 2013520
Jan 20131437
Dec 20121778
Nov 2012775
Oct 20121224
Sep 2012791
Aug 2012362
Jul 2012232
Jun 2012149
May 2012189
Apr 2012115
Mar 201257
Feb 2012155
Jan 2012170
Dec 2011244
Nov 2011187
Oct 2011139
Sep 2011190
Aug 2011276
Jul 201194
Jun 20114
Apr 201162
Mar 201176
Feb 201154
Jan 201185
Dec 201079
Nov 201061
Oct 201058
Sep 20101
Aug 201057
Jul 201037
Jun 201020
May 201075
Apr 201053
Mar 201012
Feb 201030
Jan 201071
Dec 2009104
Nov 200919
Oct 200931
Sep 2009193
Aug 2009268
Jul 2009193
Jun 2009147
May 200975
Apr 200979
Mar 2009134
Feb 2009657
Jan 200983
Dec 2008349
Nov 2008288
Oct 2008986
Sep 2008842
Aug 2008707
Jul 2008887
Jun 2008167
May 200821
Apr 2008231
Mar 2008438
Feb 2008317
Jan 2008205
Dec 2007185
Nov 2007532
Oct 2007439
Sep 2007699
Aug 20071294
Jul 2007351
Jun 20072211
May 2007273
Apr 2007262
Mar 2007534
Feb 20071648
Jan 20072359
Dec 2006575
Nov 2006357
Oct 2006642
Sep 2006660
Aug 20061662
Jul 20061320
Jun 2006473
May 20064700
Apr 20061113
Mar 20061048