maven-notifications mailing list archives

Site index · List index
Message view « Date » · « Thread »
Top « Date » · « Thread »
From Hudson <Hud...@sonatype.org>
Subject Build failed in Hudson: Maven-2.1.x-bootstrap » 1.4,ubuntu #132
Date Mon, 09 Mar 2009 17:24:44 GMT
See http://grid.sonatype.org/ci/job/Maven-2.1.x-bootstrap/./jdk=1.4,label=ubuntu/132/changes

Changes:

[John Casey] [maven-release-plugin] prepare for next development iteration

[John Casey] [maven-release-plugin] prepare release maven-2.1.0-RC1

[John Casey] rolling back failed release.

[John Casey] [maven-release-plugin] prepare for next development iteration

[John Casey] Adjusting clirr config to use 2.1.0-M1, and to deal with new API modifications
in 2.1.0...many of which are in the generated model classes.

------------------------------------------
[...truncated 146 lines...]
     [java] [INFO] Using encoding: 'UTF-8' to copy filtered resources.
     [java] [INFO] [compiler:testCompile]
     [java] [INFO] Compiling 8 source files to /home/hudson/workspace/Maven-2.1.x-bootstrap/jdk/1.4/label/ubuntu/maven-2.1.x/maven-artifact/target/test-classes
     [java] [INFO] [surefire:test]
     [java] [INFO] Surefire report directory: /home/hudson/workspace/Maven-2.1.x-bootstrap/jdk/1.4/label/ubuntu/maven-2.1.x/maven-artifact/target/surefire-reports
     [java] 
     [java] -------------------------------------------------------
     [java]  T E S T S
     [java] -------------------------------------------------------
     [java] Running org.apache.maven.artifact.DefaultArtifactTest
     [java] Tests run: 9, Failures: 0, Errors: 0, Skipped: 0, Time elapsed: 0.037 sec
     [java] Running org.apache.maven.artifact.factory.DefaultArtifactFactoryTest
     [java] Tests run: 1, Failures: 0, Errors: 0, Skipped: 0, Time elapsed: 0.187 sec
     [java] Running org.apache.maven.artifact.ArtifactUtilsTest
     [java] Tests run: 2, Failures: 0, Errors: 0, Skipped: 0, Time elapsed: 0.007 sec
     [java] Running org.apache.maven.artifact.resolver.ArtifactResolutionExceptionTest
     [java] Tests run: 1, Failures: 0, Errors: 0, Skipped: 0, Time elapsed: 0.006 sec
     [java] Running org.apache.maven.artifact.resolver.DefaultArtifactCollectorTest
     [java] Tests run: 33, Failures: 0, Errors: 0, Skipped: 0, Time elapsed: 0.661 sec
     [java] Running org.apache.maven.artifact.versioning.VersionRangeTest
     [java] Tests run: 3, Failures: 0, Errors: 0, Skipped: 0, Time elapsed: 0.004 sec
     [java] Running org.apache.maven.artifact.versioning.DefaultArtifactVersionTest
     [java] Tests run: 8, Failures: 0, Errors: 0, Skipped: 0, Time elapsed: 0.01 sec
     [java] 
     [java] Results :
     [java] 
     [java] Tests run: 57, Failures: 0, Errors: 0, Skipped: 0
     [java] 
     [java] [INFO] [jar:jar]
     [java] [INFO] Building jar: /home/hudson/workspace/Maven-2.1.x-bootstrap/jdk/1.4/label/ubuntu/maven-2.1.x/maven-artifact/target/maven-artifact-2.1.1-SNAPSHOT.jar
     [java] [INFO] [install:install]
     [java] [INFO] Installing /home/hudson/workspace/Maven-2.1.x-bootstrap/jdk/1.4/label/ubuntu/maven-2.1.x/maven-artifact/target/maven-artifact-2.1.1-SNAPSHOT.jar
to /opt/repos/bootstrap-maven-2.1.x/org/apache/maven/maven-artifact/2.1.1-SNAPSHOT/maven-artifact-2.1.1-SNAPSHOT.jar
     [java] [INFO] ------------------------------------------------------------------------
     [java] [INFO] Building Maven Repository Metadata Model
     [java] [INFO]    task-segment: [clean, install]
     [java] [INFO] ------------------------------------------------------------------------
     [java] [INFO] [clean:clean]
     [java] [INFO] Deleting directory /home/hudson/workspace/Maven-2.1.x-bootstrap/jdk/1.4/label/ubuntu/maven-2.1.x/maven-repository-metadata/target
     [java] [INFO] Deleting directory /home/hudson/workspace/Maven-2.1.x-bootstrap/jdk/1.4/label/ubuntu/maven-2.1.x/maven-repository-metadata/target/classes
     [java] [INFO] Deleting directory /home/hudson/workspace/Maven-2.1.x-bootstrap/jdk/1.4/label/ubuntu/maven-2.1.x/maven-repository-metadata/target/test-classes
     [java] [INFO] Deleting directory /home/hudson/workspace/Maven-2.1.x-bootstrap/jdk/1.4/label/ubuntu/maven-2.1.x/maven-repository-metadata/target/site
     [java] [INFO] [modello:java {execution: standard}]
     [java] [INFO] outputDirectory: /home/hudson/workspace/Maven-2.1.x-bootstrap/jdk/1.4/label/ubuntu/maven-2.1.x/maven-repository-metadata/target/generated-sources/modello
     [java] [INFO] Working on model: src/main/mdo/metadata.mdo
     [java] [INFO] Generating current version: 1.0.0
     [java] [INFO] [modello:xpp3-reader {execution: standard}]
     [java] [INFO] outputDirectory: /home/hudson/workspace/Maven-2.1.x-bootstrap/jdk/1.4/label/ubuntu/maven-2.1.x/maven-repository-metadata/target/generated-sources/modello
     [java] [INFO] Working on model: src/main/mdo/metadata.mdo
     [java] [INFO] Generating current version: 1.0.0
     [java] [INFO] [modello:xpp3-writer {execution: standard}]
     [java] [INFO] outputDirectory: /home/hudson/workspace/Maven-2.1.x-bootstrap/jdk/1.4/label/ubuntu/maven-2.1.x/maven-repository-metadata/target/generated-sources/modello
     [java] [INFO] Working on model: src/main/mdo/metadata.mdo
     [java] [INFO] Generating current version: 1.0.0
     [java] [INFO] [remote-resources:process {execution: default}]
     [java] [INFO] [resources:resources]
     [java] [INFO] Using encoding: 'UTF-8' to copy filtered resources.
     [java] [INFO] [compiler:compile]
     [java] [INFO] Compiling 6 source files to /home/hudson/workspace/Maven-2.1.x-bootstrap/jdk/1.4/label/ubuntu/maven-2.1.x/maven-repository-metadata/target/classes
     [java] [INFO] [resources:testResources]
     [java] [INFO] Using encoding: 'UTF-8' to copy filtered resources.
     [java] [INFO] [compiler:testCompile]
     [java] [INFO] No sources to compile
     [java] [INFO] [surefire:test]
     [java] [INFO] Surefire report directory: /home/hudson/workspace/Maven-2.1.x-bootstrap/jdk/1.4/label/ubuntu/maven-2.1.x/maven-repository-metadata/target/surefire-reports
     [java] 
     [java] -------------------------------------------------------
     [java]  T E S T S
     [java] -------------------------------------------------------
     [java] There are no tests to run.
     [java] 
     [java] Results :
     [java] 
     [java] Tests run: 0, Failures: 0, Errors: 0, Skipped: 0
     [java] 
     [java] [INFO] [jar:jar]
     [java] [INFO] Building jar: /home/hudson/workspace/Maven-2.1.x-bootstrap/jdk/1.4/label/ubuntu/maven-2.1.x/maven-repository-metadata/target/maven-repository-metadata-2.1.1-SNAPSHOT.jar
     [java] [INFO] [install:install]
     [java] [INFO] Installing /home/hudson/workspace/Maven-2.1.x-bootstrap/jdk/1.4/label/ubuntu/maven-2.1.x/maven-repository-metadata/target/maven-repository-metadata-2.1.1-SNAPSHOT.jar
to /opt/repos/bootstrap-maven-2.1.x/org/apache/maven/maven-repository-metadata/2.1.1-SNAPSHOT/maven-repository-metadata-2.1.1-SNAPSHOT.jar
     [java] [INFO] ------------------------------------------------------------------------
     [java] [INFO] Building Maven Artifact Manager
     [java] [INFO]    task-segment: [clean, install]
     [java] [INFO] ------------------------------------------------------------------------
     [java] [INFO] [clean:clean]
     [java] [INFO] Deleting directory /home/hudson/workspace/Maven-2.1.x-bootstrap/jdk/1.4/label/ubuntu/maven-2.1.x/maven-artifact-manager/target
     [java] [INFO] Deleting directory /home/hudson/workspace/Maven-2.1.x-bootstrap/jdk/1.4/label/ubuntu/maven-2.1.x/maven-artifact-manager/target/classes
     [java] [INFO] Deleting directory /home/hudson/workspace/Maven-2.1.x-bootstrap/jdk/1.4/label/ubuntu/maven-2.1.x/maven-artifact-manager/target/test-classes
     [java] [INFO] Deleting directory /home/hudson/workspace/Maven-2.1.x-bootstrap/jdk/1.4/label/ubuntu/maven-2.1.x/maven-artifact-manager/target/site
     [java] Downloading: http://repository.sonatype.org:8081/content/groups/sonatype-grid/org/apache/maven/maven-repository-metadata/2.1.0/maven-repository-metadata-2.1.0.pom
     [java] [INFO] Unable to find resource 'org.apache.maven:maven-repository-metadata:pom:2.1.0'
in repository central (http://Nexus)
     [java] Downloading: http://repository.sonatype.org:8081/content/groups/sonatype-grid/org/apache/maven/maven-artifact/2.1.0/maven-artifact-2.1.0.pom
     [java] [INFO] Unable to find resource 'org.apache.maven:maven-artifact:pom:2.1.0' in
repository central (http://Nexus)
     [java] Downloading: http://repository.sonatype.org:8081/content/groups/sonatype-grid/org/apache/maven/maven-repository-metadata/2.1.0/maven-repository-metadata-2.1.0.jar
     [java] [INFO] Unable to find resource 'org.apache.maven:maven-repository-metadata:jar:2.1.0'
in repository central (http://Nexus)
     [java] Downloading: http://repository.sonatype.org:8081/content/groups/sonatype-grid/org/apache/maven/maven-artifact/2.1.0/maven-artifact-2.1.0.jar
     [java] [INFO] Unable to find resource 'org.apache.maven:maven-artifact:jar:2.1.0' in
repository central (http://Nexus)
     [java] [INFO] ------------------------------------------------------------------------
     [java] [ERROR] BUILD ERROR
     [java] [INFO] ------------------------------------------------------------------------
     [java] [INFO] Failed to resolve artifact.
     [java] 
     [java] Missing:
     [java] ----------
     [java] 1) org.apache.maven:maven-repository-metadata:jar:2.1.0
     [java] 
     [java]   Try downloading the file manually from the project website.
     [java] 
     [java]   Then, install it using the command: 
     [java]       mvn install:install-file -DgroupId=org.apache.maven -DartifactId=maven-repository-metadata
-Dversion=2.1.0 -Dpackaging=jar -Dfile=/path/to/file
     [java] 
     [java]   Alternatively, if you host your own repository you can deploy the file there:

     [java]       mvn deploy:deploy-file -DgroupId=org.apache.maven -DartifactId=maven-repository-metadata
-Dversion=2.1.0 -Dpackaging=jar -Dfile=/path/to/file -Durl=[url] -DrepositoryId=[id]
     [java] 
     [java]   Path to dependency: 
     [java]   	1) org.apache.maven:maven-artifact-manager:jar:2.1.1-SNAPSHOT
     [java]   	2) org.apache.maven:maven-repository-metadata:jar:2.1.0
     [java] 
     [java] 2) org.apache.maven:maven-artifact:jar:2.1.0
     [java] 
     [java]   Try downloading the file manually from the project website.
     [java] 
     [java]   Then, install it using the command: 
     [java]       mvn install:install-file -DgroupId=org.apache.maven -DartifactId=maven-artifact
-Dversion=2.1.0 -Dpackaging=jar -Dfile=/path/to/file
     [java] 
     [java]   Alternatively, if you host your own repository you can deploy the file there:

     [java]       mvn deploy:deploy-file -DgroupId=org.apache.maven -DartifactId=maven-artifact
-Dversion=2.1.0 -Dpackaging=jar -Dfile=/path/to/file -Durl=[url] -DrepositoryId=[id]
     [java] 
     [java]   Path to dependency: 
     [java]   	1) org.apache.maven:maven-artifact-manager:jar:2.1.1-SNAPSHOT
     [java]   	2) org.apache.maven:maven-artifact:jar:2.1.0
     [java] 
     [java] ----------
     [java] 2 required artifacts are missing.
     [java] 
     [java] for artifact: 
     [java]   org.apache.maven:maven-artifact-manager:jar:2.1.1-SNAPSHOT
     [java] 
     [java] from the specified remote repositories:
     [java]   Nexus (http://repository.sonatype.org:8081/content/groups/sonatype-grid)
     [java] 
     [java] 
     [java] 
     [java] [INFO] ------------------------------------------------------------------------
     [java] [INFO] Trace
     [java] org.apache.maven.lifecycle.LifecycleExecutionException: Missing:
     [java] ----------
     [java] 1) org.apache.maven:maven-repository-metadata:jar:2.1.0
     [java] 
     [java]   Try downloading the file manually from the project website.
     [java] 
     [java]   Then, install it using the command: 
     [java]       mvn install:install-file -DgroupId=org.apache.maven -DartifactId=maven-repository-metadata
-Dversion=2.1.0 -Dpackaging=jar -Dfile=/path/to/file
     [java] 
     [java]   Alternatively, if you host your own repository you can deploy the file there:

     [java]       mvn deploy:deploy-file -DgroupId=org.apache.maven -DartifactId=maven-repository-metadata
-Dversion=2.1.0 -Dpackaging=jar -Dfile=/path/to/file -Durl=[url] -DrepositoryId=[id]
     [java] 
     [java]   Path to dependency: 
     [java]   	1) org.apache.maven:maven-artifact-manager:jar:2.1.1-SNAPSHOT
     [java]   	2) org.apache.maven:maven-repository-metadata:jar:2.1.0
     [java] 
     [java] 2) org.apache.maven:maven-artifact:jar:2.1.0
     [java] 
     [java]   Try downloading the file manually from the project website.
     [java] 
     [java]   Then, install it using the command: 
     [java]       mvn install:install-file -DgroupId=org.apache.maven -DartifactId=maven-artifact
-Dversion=2.1.0 -Dpackaging=jar -Dfile=/path/to/file
     [java] 
     [java]   Alternatively, if you host your own repository you can deploy the file there:

     [java]       mvn deploy:deploy-file -DgroupId=org.apache.maven -DartifactId=maven-artifact
-Dversion=2.1.0 -Dpackaging=jar -Dfile=/path/to/file -Durl=[url] -DrepositoryId=[id]
     [java] 
     [java]   Path to dependency: 
     [java]   	1) org.apache.maven:maven-artifact-manager:jar:2.1.1-SNAPSHOT
     [java]   	2) org.apache.maven:maven-artifact:jar:2.1.0
     [java] 
     [java] ----------
     [java] 2 required artifacts are missing.
     [java] 
     [java] for artifact: 
     [java]   org.apache.maven:maven-artifact-manager:jar:2.1.1-SNAPSHOT
     [java] 
     [java] from the specified remote repositories:
     [java]   Nexus (http://repository.sonatype.org:8081/content/groups/sonatype-grid)
     [java] 
     [java] 
     [java] 	at org.apache.maven.lifecycle.DefaultLifecycleExecutor.executeGoals(DefaultLifecycleExecutor.java:694)
     [java] 	at org.apache.maven.lifecycle.DefaultLifecycleExecutor.executeGoalWithLifecycle(DefaultLifecycleExecutor.java:539)
     [java] 	at org.apache.maven.lifecycle.DefaultLifecycleExecutor.executeGoal(DefaultLifecycleExecutor.java:518)
     [java] 	at org.apache.maven.lifecycle.DefaultLifecycleExecutor.executeGoalAndHandleFailures(DefaultLifecycleExecutor.java:370)
     [java] 	at org.apache.maven.lifecycle.DefaultLifecycleExecutor.executeTaskSegments(DefaultLifecycleExecutor.java:331)
     [java] 	at org.apache.maven.lifecycle.DefaultLifecycleExecutor.execute(DefaultLifecycleExecutor.java:181)
     [java] 	at org.apache.maven.DefaultMaven.doExecute(DefaultMaven.java:355)
     [java] 	at org.apache.maven.DefaultMaven.execute(DefaultMaven.java:136)
     [java] 	at org.apache.maven.cli.MavenCli.main(MavenCli.java:356)
     [java] 	at org.apache.maven.cli.MavenCli.main(MavenCli.java:97)
     [java] Caused by: org.apache.maven.artifact.resolver.MultipleArtifactsNotFoundException:
Missing:
     [java] ----------
     [java] 1) org.apache.maven:maven-repository-metadata:jar:2.1.0
     [java] 
     [java]   Try downloading the file manually from the project website.
     [java] 
     [java]   Then, install it using the command: 
     [java]       mvn install:install-file -DgroupId=org.apache.maven -DartifactId=maven-repository-metadata
-Dversion=2.1.0 -Dpackaging=jar -Dfile=/path/to/file
     [java] 
     [java]   Alternatively, if you host your own repository you can deploy the file there:

     [java]       mvn deploy:deploy-file -DgroupId=org.apache.maven -DartifactId=maven-repository-metadata
-Dversion=2.1.0 -Dpackaging=jar -Dfile=/path/to/file -Durl=[url] -DrepositoryId=[id]
     [java] 
     [java]   Path to dependency: 
     [java]   	1) org.apache.maven:maven-artifact-manager:jar:2.1.1-SNAPSHOT
     [java]   	2) org.apache.maven:maven-repository-metadata:jar:2.1.0
     [java] 
     [java] 2) org.apache.maven:maven-artifact:jar:2.1.0
     [java] 
     [java]   Try downloading the file manually from the project website.
     [java] 
     [java]   Then, install it using the command: 
     [java]       mvn install:install-file -DgroupId=org.apache.maven -DartifactId=maven-artifact
-Dversion=2.1.0 -Dpackaging=jar -Dfile=/path/to/file
     [java] 
     [java]   Alternatively, if you host your own repository you can deploy the file there:

     [java]       mvn deploy:deploy-file -DgroupId=org.apache.maven -DartifactId=maven-artifact
-Dversion=2.1.0 -Dpackaging=jar -Dfile=/path/to/file -Durl=[url] -DrepositoryId=[id]
     [java] 
     [java]   Path to dependency: 
     [java]   	1) org.apache.maven:maven-artifact-manager:jar:2.1.1-SNAPSHOT
     [java]   	2) org.apache.maven:maven-artifact:jar:2.1.0
     [java] 
     [java] ----------
     [java] 2 required artifacts are missing.
     [java] 
     [java] for artifact: 
     [java]   org.apache.maven:maven-artifact-manager:jar:2.1.1-SNAPSHOT
     [java] 
     [java] from the specified remote repositories:
     [java]   Nexus (http://repository.sonatype.org:8081/content/groups/sonatype-grid)
     [java] 
     [java] 
     [java] 	at org.apache.maven.artifact.resolver.DefaultArtifactResolver.resolveTransitively(DefaultArtifactResolver.java:360)
     [java] 	at org.apache.maven.artifact.resolver.DefaultArtifactResolver.resolveTransitively(DefaultArtifactResolver.java:304)
     [java] 	at org.apache.maven.plugin.DefaultPluginManager.resolveTransitiveDependencies(DefaultPluginManager.java:1467)
     [java] 	at org.apache.maven.plugin.DefaultPluginManager.executeMojo(DefaultPluginManager.java:410)
     [java] 	at org.apache.maven.lifecycle.DefaultLifecycleExecutor.executeGoals(DefaultLifecycleExecutor.java:677)
     [java] 	... 9 more
     [java] [INFO] ------------------------------------------------------------------------
     [java] [INFO] Total time: 13 seconds
     [java] [INFO] Finished at: Mon Mar 09 11:24:37 GMT-06:00 2009
     [java] [INFO] Final Memory: 19M/35M
     [java] [INFO] ------------------------------------------------------------------------

BUILD FAILED
/home/hudson/workspace/Maven-2.1.x-bootstrap/jdk/1.4/label/ubuntu/maven-2.1.x/build.xml:187:
Java returned: 1

Total time: 31 seconds


Mime
View raw message