maven-notifications mailing list archives

Site index · List index
Message view « Date » · « Thread »
Top « Date » · « Thread »
From Hudson <Hud...@sonatype.org>
Subject Build failed in Hudson: Maven-2.0.x-with-bootstrap » 1.4,osx #98
Date Wed, 04 Mar 2009 14:18:48 GMT
See http://grid.sonatype.org/ci/job/Maven-2.0.x-with-bootstrap/./jdk=1.4,label=osx/98/changes

Changes:

[Brett Porter] [MNG-3641] move profile activation check to span all projects at once in a
reactor
Merged from: r749997

------------------------------------------
[...truncated 2506 lines...]
     [exec] 851b downloaded
     [exec] Downloading: http://repository.sonatype.org:8081/content/groups/public/org/codehaus/plexus/plexus-interactivity-api/1.0-alpha-4/plexus-interactivity-api-1.0-alpha-4.pom
     [exec] 6K downloaded
     [exec] Downloading: http://repository.sonatype.org:8081/content/groups/public/org/codehaus/plexus/plexus-container-default/1.0-alpha-7/plexus-container-default-1.0-alpha-7.pom
     [exec] 1K downloaded
     [exec] Downloading: http://repository.sonatype.org:8081/content/groups/public/plexus/plexus-containers/1.0.2/plexus-containers-1.0.2.pom
     [exec] 471b downloaded
     [exec] Downloading: http://repository.sonatype.org:8081/content/groups/public/plexus/plexus-root/1.0.3/plexus-root-1.0.3.pom
     [exec] 5K downloaded
     [exec] Downloading: http://repository.sonatype.org:8081/content/groups/public/plexus/plexus-utils/1.0.2/plexus-utils-1.0.2.pom
     [exec] 740b downloaded
     [exec] Downloading: http://repository.sonatype.org:8081/content/groups/public/org/apache/maven/maven-plugin-descriptor/2.0.6/maven-plugin-descriptor-2.0.6.pom
     [exec] 1K downloaded
     [exec] Downloading: http://repository.sonatype.org:8081/content/groups/public/org/apache/maven/maven-monitor/2.0.6/maven-monitor-2.0.6.pom
     [exec] 1K downloaded
     [exec] Downloading: http://repository.sonatype.org:8081/content/groups/public/org/apache/maven/wagon/wagon-ssh/1.0-beta-2/wagon-ssh-1.0-beta-2.pom
     [exec] 1K downloaded
     [exec] Downloading: http://repository.sonatype.org:8081/content/groups/public/com/jcraft/jsch/0.1.27/jsch-0.1.27.pom
     [exec] 965b downloaded
     [exec] Downloading: http://repository.sonatype.org:8081/content/groups/public/classworlds/classworlds/1.1/classworlds-1.1.pom
     [exec] 3K downloaded
     [exec] Downloading: http://repository.sonatype.org:8081/content/groups/public/org/apache/maven/maven-toolchain/1.0/maven-toolchain-1.0.pom
     [exec] 3K downloaded
     [exec] Downloading: http://repository.sonatype.org:8081/content/groups/public/org/apache/maven/surefire/surefire-booter/2.4.3/surefire-booter-2.4.3.jar
     [exec] 261K downloaded
     [exec] Downloading: http://repository.sonatype.org:8081/content/groups/public/org/apache/maven/surefire/surefire-api/2.4.3/surefire-api-2.4.3.jar
     [exec] 503K downloaded
     [exec] Downloading: http://repository.sonatype.org:8081/content/groups/public/org/codehaus/plexus/plexus-utils/1.5.1/plexus-utils-1.5.1.jar
     [exec] 205K downloaded
     [exec] [INFO] [surefire:test]
     [exec] [INFO] No tests to run.
     [exec] Downloading: http://repository.sonatype.org:8081/content/groups/public/org/apache/maven/maven-project/2.0.7/maven-project-2.0.7.pom
     [exec] 2K downloaded
     [exec] Downloading: http://repository.sonatype.org:8081/content/groups/public/org/apache/maven/maven/2.0.7/maven-2.0.7.pom
     [exec] 10K downloaded
     [exec] Downloading: http://repository.sonatype.org:8081/content/groups/public/org/apache/maven/maven-settings/2.0.7/maven-settings-2.0.7.pom
     [exec] 1K downloaded
     [exec] Downloading: http://repository.sonatype.org:8081/content/groups/public/org/apache/maven/maven-model/2.0.7/maven-model-2.0.7.pom
     [exec] 2K downloaded
     [exec] Downloading: http://repository.sonatype.org:8081/content/groups/public/org/codehaus/plexus/plexus-utils/1.4.1/plexus-utils-1.4.1.pom
     [exec] 1K downloaded
     [exec] Downloading: http://repository.sonatype.org:8081/content/groups/public/org/apache/maven/maven-profile/2.0.7/maven-profile-2.0.7.pom
     [exec] 1K downloaded
     [exec] Downloading: http://repository.sonatype.org:8081/content/groups/public/org/apache/maven/maven-artifact-manager/2.0.7/maven-artifact-manager-2.0.7.pom
     [exec] 2K downloaded
     [exec] Downloading: http://repository.sonatype.org:8081/content/groups/public/org/apache/maven/maven-repository-metadata/2.0.7/maven-repository-metadata-2.0.7.pom
     [exec] 1K downloaded
     [exec] Downloading: http://repository.sonatype.org:8081/content/groups/public/org/apache/maven/maven-artifact/2.0.7/maven-artifact-2.0.7.pom
     [exec] 1K downloaded
     [exec] Downloading: http://repository.sonatype.org:8081/content/groups/public/org/apache/maven/maven-plugin-registry/2.0.7/maven-plugin-registry-2.0.7.pom
     [exec] 1K downloaded
     [exec] Downloading: http://repository.sonatype.org:8081/content/groups/public/org/apache/maven/maven-archiver/2.3/maven-archiver-2.3.pom
     [exec] 3K downloaded
     [exec] Downloading: http://repository.sonatype.org:8081/content/groups/public/org/apache/maven/shared/maven-shared-components/8/maven-shared-components-8.pom
     [exec] 2K downloaded
     [exec] Downloading: http://repository.sonatype.org:8081/content/groups/public/org/codehaus/plexus/plexus-archiver/1.0-alpha-9/plexus-archiver-1.0-alpha-9.pom
     [exec] 1K downloaded
     [exec] Downloading: http://repository.sonatype.org:8081/content/groups/public/org/codehaus/plexus/plexus-components/1.1.9/plexus-components-1.1.9.pom
     [exec] 2K downloaded
     [exec] Downloading: http://repository.sonatype.org:8081/content/groups/public/org/codehaus/plexus/plexus/1.0.10/plexus-1.0.10.pom
     [exec] 8K downloaded
     [exec] Downloading: http://repository.sonatype.org:8081/content/groups/public/org/codehaus/plexus/plexus-container-default/1.0-alpha-15/plexus-container-default-1.0-alpha-15.pom
     [exec] 1K downloaded
     [exec] Downloading: http://repository.sonatype.org:8081/content/groups/public/org/codehaus/plexus/plexus-containers/1.0-alpha-15/plexus-containers-1.0-alpha-15.pom
     [exec] 1K downloaded
     [exec] Downloading: http://repository.sonatype.org:8081/content/groups/public/org/codehaus/plexus/plexus/1.0.9/plexus-1.0.9.pom
     [exec] 7K downloaded
     [exec] Downloading: http://repository.sonatype.org:8081/content/groups/public/org/codehaus/plexus/plexus-component-api/1.0-alpha-15/plexus-component-api-1.0-alpha-15.pom
     [exec] 948b downloaded
     [exec] Downloading: http://repository.sonatype.org:8081/content/groups/public/org/codehaus/plexus/plexus-classworlds/1.2-alpha-6/plexus-classworlds-1.2-alpha-6.pom
     [exec] 2K downloaded
     [exec] Downloading: http://repository.sonatype.org:8081/content/groups/public/org/codehaus/plexus/plexus-io/1.0-alpha-1/plexus-io-1.0-alpha-1.pom
     [exec] 1K downloaded
     [exec] Downloading: http://repository.sonatype.org:8081/content/groups/public/org/codehaus/plexus/plexus-container-default/1.0-alpha-9/plexus-container-default-1.0-alpha-9.pom
     [exec] 1K downloaded
     [exec] Downloading: http://repository.sonatype.org:8081/content/groups/public/org/codehaus/plexus/plexus-component-api/1.0-alpha-16/plexus-component-api-1.0-alpha-16.pom
     [exec] 2K downloaded
     [exec] Downloading: http://repository.sonatype.org:8081/content/groups/public/org/codehaus/plexus/plexus-containers/1.0-alpha-16/plexus-containers-1.0-alpha-16.pom
     [exec] 1K downloaded
     [exec] Downloading: http://repository.sonatype.org:8081/content/groups/public/org/codehaus/plexus/plexus-utils/1.4.9/plexus-utils-1.4.9.pom
     [exec] 2K downloaded
     [exec] Downloading: http://repository.sonatype.org:8081/content/groups/public/commons-lang/commons-lang/2.1/commons-lang-2.1.pom
     [exec] 9K downloaded
     [exec] Downloading: http://repository.sonatype.org:8081/content/groups/public/org/codehaus/plexus/plexus-utils/1.4.9/plexus-utils-1.4.9.jar
     [exec] 199K downloaded
     [exec] Downloading: http://repository.sonatype.org:8081/content/groups/public/org/apache/maven/maven-archiver/2.3/maven-archiver-2.3.jar
     [exec] 17K downloaded
     [exec] Downloading: http://repository.sonatype.org:8081/content/groups/public/org/codehaus/plexus/plexus-archiver/1.0-alpha-9/plexus-archiver-1.0-alpha-9.jar
     [exec] 153K downloaded
     [exec] Downloading: http://repository.sonatype.org:8081/content/groups/public/org/codehaus/plexus/plexus-io/1.0-alpha-1/plexus-io-1.0-alpha-1.jar
     [exec] 11K downloaded
     [exec] Downloading: http://repository.sonatype.org:8081/content/groups/public/commons-lang/commons-lang/2.1/commons-lang-2.1.jar
     [exec] 202K downloaded
     [exec] [INFO] [jar:jar]
     [exec] [INFO] Building jar: http://grid.sonatype.org/ci/job/Maven-2.0.x-with-bootstrap/./jdk=1.4,label=osx/ws/maven-2.0.x/maven-integration-tests/target/classes/target/maven-integration-tests-2.0.x.jar

     [exec] Downloading: http://repository.sonatype.org:8081/content/groups/public/org/apache/maven/maven-settings/2.0/maven-settings-2.0.pom
     [exec] 1K downloaded
     [exec] Downloading: http://repository.sonatype.org:8081/content/groups/public/org/apache/maven/scm/maven-scm-manager-plexus/1.1/maven-scm-manager-plexus-1.1.pom
     [exec] 2K downloaded
     [exec] Downloading: http://repository.sonatype.org:8081/content/groups/public/org/apache/maven/scm/maven-scm-managers/1.1/maven-scm-managers-1.1.pom
     [exec] 1K downloaded
     [exec] Downloading: http://repository.sonatype.org:8081/content/groups/public/org/apache/maven/scm/maven-scm/1.1/maven-scm-1.1.pom
     [exec] 19K downloaded
     [exec] Downloading: http://repository.sonatype.org:8081/content/groups/public/org/apache/maven/scm/maven-scm-api/1.1/maven-scm-api-1.1.pom
     [exec] 1K downloaded
     [exec] Downloading: http://repository.sonatype.org:8081/content/groups/public/org/codehaus/plexus/plexus-utils/1.5.6/plexus-utils-1.5.6.pom
     [exec] 5K downloaded
     [exec] Downloading: http://repository.sonatype.org:8081/content/groups/public/org/codehaus/plexus/plexus/1.0.12/plexus-1.0.12.pom
     [exec] 9K downloaded
     [exec] Downloading: http://repository.sonatype.org:8081/content/groups/public/org/apache/maven/scm/maven-scm-providers-standard/1.1/maven-scm-providers-standard-1.1.pom
     [exec] 3K downloaded
     [exec] Downloading: http://repository.sonatype.org:8081/content/groups/public/org/apache/maven/scm/maven-scm-providers/1.1/maven-scm-providers-1.1.pom
     [exec] 3K downloaded
     [exec] Downloading: http://repository.sonatype.org:8081/content/groups/public/org/apache/maven/scm/maven-scm-provider-accurev/1.1/maven-scm-provider-accurev-1.1.pom
     [exec] 4K downloaded
     [exec] Downloading: http://repository.sonatype.org:8081/content/groups/public/org/apache/maven/scm/maven-scm-provider-bazaar/1.1/maven-scm-provider-bazaar-1.1.pom
     [exec] 1K downloaded
     [exec] Downloading: http://repository.sonatype.org:8081/content/groups/public/regexp/regexp/1.3/regexp-1.3.pom
     [exec] 145b downloaded
     [exec] Downloading: http://repository.sonatype.org:8081/content/groups/public/org/apache/maven/scm/maven-scm-provider-clearcase/1.1/maven-scm-provider-clearcase-1.1.pom
     [exec] 2K downloaded
     [exec] Downloading: http://repository.sonatype.org:8081/content/groups/public/org/apache/maven/scm/maven-scm-provider-cvsexe/1.1/maven-scm-provider-cvsexe-1.1.pom
     [exec] 2K downloaded
     [exec] Downloading: http://repository.sonatype.org:8081/content/groups/public/org/apache/maven/scm/maven-scm-providers-cvs/1.1/maven-scm-providers-cvs-1.1.pom
     [exec] 1K downloaded
     [exec] Downloading: http://repository.sonatype.org:8081/content/groups/public/org/apache/maven/scm/maven-scm-provider-cvs-commons/1.1/maven-scm-provider-cvs-commons-1.1.pom
     [exec] 2K downloaded
     [exec] Downloading: http://repository.sonatype.org:8081/content/groups/public/org/apache/maven/scm/maven-scm-provider-cvsjava/1.1/maven-scm-provider-cvsjava-1.1.pom
     [exec] 2K downloaded
     [exec] Downloading: http://repository.sonatype.org:8081/content/groups/public/org/netbeans/lib/cvsclient/20060125/cvsclient-20060125.pom
     [exec] 459b downloaded
     [exec] Downloading: http://repository.sonatype.org:8081/content/groups/public/ch/ethz/ganymed/ganymed-ssh2/build210/ganymed-ssh2-build210.pom
     [exec] 710b downloaded
     [exec] Downloading: http://repository.sonatype.org:8081/content/groups/public/org/apache/maven/scm/maven-scm-provider-gitexe/1.1/maven-scm-provider-gitexe-1.1.pom
     [exec] 2K downloaded
     [exec] Downloading: http://repository.sonatype.org:8081/content/groups/public/org/apache/maven/scm/maven-scm-providers-git/1.1/maven-scm-providers-git-1.1.pom
     [exec] 1K downloaded
     [exec] Downloading: http://repository.sonatype.org:8081/content/groups/public/org/apache/maven/scm/maven-scm-provider-git-commons/1.1/maven-scm-provider-git-commons-1.1.pom
     [exec] 2K downloaded
     [exec] Downloading: http://repository.sonatype.org:8081/content/groups/public/org/apache/maven/scm/maven-scm-provider-hg/1.1/maven-scm-provider-hg-1.1.pom
     [exec] 2K downloaded
     [exec] Downloading: http://repository.sonatype.org:8081/content/groups/public/org/apache/maven/scm/maven-scm-provider-perforce/1.1/maven-scm-provider-perforce-1.1.pom
     [exec] 2K downloaded
     [exec] Downloading: http://repository.sonatype.org:8081/content/groups/public/org/apache/maven/scm/maven-scm-provider-starteam/1.1/maven-scm-provider-starteam-1.1.pom
     [exec] 2K downloaded
     [exec] Downloading: http://repository.sonatype.org:8081/content/groups/public/org/apache/maven/scm/maven-scm-provider-svnexe/1.1/maven-scm-provider-svnexe-1.1.pom
     [exec] 2K downloaded
     [exec] Downloading: http://repository.sonatype.org:8081/content/groups/public/org/apache/maven/scm/maven-scm-providers-svn/1.1/maven-scm-providers-svn-1.1.pom
     [exec] 1K downloaded
     [exec] Downloading: http://repository.sonatype.org:8081/content/groups/public/org/apache/maven/scm/maven-scm-provider-svn-commons/1.1/maven-scm-provider-svn-commons-1.1.pom
     [exec] 1K downloaded
     [exec] Downloading: http://repository.sonatype.org:8081/content/groups/public/org/apache/maven/scm/maven-scm-provider-synergy/1.1/maven-scm-provider-synergy-1.1.pom
     [exec] 1K downloaded
     [exec] Downloading: http://repository.sonatype.org:8081/content/groups/public/org/apache/maven/scm/maven-scm-provider-vss/1.1/maven-scm-provider-vss-1.1.pom
     [exec] 2K downloaded
     [exec] Downloading: http://repository.sonatype.org:8081/content/groups/public/org/apache/maven/scm/maven-scm-provider-local/1.1/maven-scm-provider-local-1.1.pom
     [exec] 2K downloaded
     [exec] Downloading: http://repository.sonatype.org:8081/content/groups/public/org/codehaus/plexus/plexus-utils/1.5.6/plexus-utils-1.5.6.jar
     [exec] 244K downloaded
     [exec] Downloading: http://repository.sonatype.org:8081/content/groups/public/org/apache/maven/scm/maven-scm-manager-plexus/1.1/maven-scm-manager-plexus-1.1.jar
     [exec] 9K downloaded
     [exec] Downloading: http://repository.sonatype.org:8081/content/groups/public/org/apache/maven/scm/maven-scm-api/1.1/maven-scm-api-1.1.jar
     [exec] 80K downloaded
     [exec] Downloading: http://repository.sonatype.org:8081/content/groups/public/org/apache/maven/scm/maven-scm-provider-accurev/1.1/maven-scm-provider-accurev-1.1.jar
     [exec] 25K downloaded
     [exec] Downloading: http://repository.sonatype.org:8081/content/groups/public/org/apache/maven/scm/maven-scm-provider-bazaar/1.1/maven-scm-provider-bazaar-1.1.jar
     [exec] 45K downloaded
     [exec] Downloading: http://repository.sonatype.org:8081/content/groups/public/regexp/regexp/1.3/regexp-1.3.jar
     [exec] 24K downloaded
     [exec] Downloading: http://repository.sonatype.org:8081/content/groups/public/org/apache/maven/scm/maven-scm-provider-clearcase/1.1/maven-scm-provider-clearcase-1.1.jar
     [exec] 58K downloaded
     [exec] Downloading: http://repository.sonatype.org:8081/content/groups/public/org/apache/maven/scm/maven-scm-provider-cvsexe/1.1/maven-scm-provider-cvsexe-1.1.jar
     [exec] 25K downloaded
     [exec] Downloading: http://repository.sonatype.org:8081/content/groups/public/org/apache/maven/scm/maven-scm-provider-cvs-commons/1.1/maven-scm-provider-cvs-commons-1.1.jar
     [exec] 68K downloaded
     [exec] Downloading: http://repository.sonatype.org:8081/content/groups/public/org/apache/maven/scm/maven-scm-provider-cvsjava/1.1/maven-scm-provider-cvsjava-1.1.jar
     [exec] 39K downloaded
     [exec] Downloading: http://repository.sonatype.org:8081/content/groups/public/org/netbeans/lib/cvsclient/20060125/cvsclient-20060125.jar
     [exec] 604K downloaded
     [exec] Downloading: http://repository.sonatype.org:8081/content/groups/public/ch/ethz/ganymed/ganymed-ssh2/build210/ganymed-ssh2-build210.jar
     [exec] 239K downloaded
     [exec] Downloading: http://repository.sonatype.org:8081/content/groups/public/org/apache/maven/scm/maven-scm-provider-gitexe/1.1/maven-scm-provider-gitexe-1.1.jar
     [exec] 44K downloaded
     [exec] Downloading: http://repository.sonatype.org:8081/content/groups/public/org/apache/maven/scm/maven-scm-provider-git-commons/1.1/maven-scm-provider-git-commons-1.1.jar
     [exec] 34K downloaded
     [exec] Downloading: http://repository.sonatype.org:8081/content/groups/public/org/apache/maven/scm/maven-scm-provider-hg/1.1/maven-scm-provider-hg-1.1.jar
     [exec] 50K downloaded
     [exec] Downloading: http://repository.sonatype.org:8081/content/groups/public/org/apache/maven/scm/maven-scm-provider-perforce/1.1/maven-scm-provider-perforce-1.1.jar
     [exec] 63K downloaded
     [exec] Downloading: http://repository.sonatype.org:8081/content/groups/public/org/apache/maven/scm/maven-scm-provider-starteam/1.1/maven-scm-provider-starteam-1.1.jar
     [exec] 67K downloaded
     [exec] Downloading: http://repository.sonatype.org:8081/content/groups/public/org/apache/maven/scm/maven-scm-provider-svnexe/1.1/maven-scm-provider-svnexe-1.1.jar
     [exec] 57K downloaded
     [exec] Downloading: http://repository.sonatype.org:8081/content/groups/public/org/apache/maven/scm/maven-scm-provider-svn-commons/1.1/maven-scm-provider-svn-commons-1.1.jar
     [exec] 36K downloaded
     [exec] Downloading: http://repository.sonatype.org:8081/content/groups/public/org/apache/maven/scm/maven-scm-provider-synergy/1.1/maven-scm-provider-synergy-1.1.jar
     [exec] 49K downloaded
     [exec] Downloading: http://repository.sonatype.org:8081/content/groups/public/org/apache/maven/scm/maven-scm-provider-vss/1.1/maven-scm-provider-vss-1.1.jar
     [exec] 53K downloaded
     [exec] Downloading: http://repository.sonatype.org:8081/content/groups/public/org/apache/maven/scm/maven-scm-provider-local/1.1/maven-scm-provider-local-1.1.jar
     [exec] 39K downloaded
     [exec] [INFO] [scm:update {execution: scm}]
     [exec] [INFO] Executing: /bin/sh -c cd /tmp/maven-integration-tests-2.0.x &&
svn --non-interactive update /tmp/maven-integration-tests-2.0.x
     [exec] [INFO] Working directory: /tmp/maven-integration-tests-2.0.x
     [exec] [ERROR] Provider message:
     [exec] [ERROR] The svn command failed.
     [exec] [ERROR] Command output:
     [exec] [ERROR] svn: Can't open file '/tmp/maven-integration-tests-2.0.x/core-it-support/maven-it-sample/src/test/java/org/apache/maven/it/.svn/text-base/MavenITmngXXXXDescriptionOfProblemTest.java.svn-base':
No such file or directory
     [exec] 
     [exec] [INFO] ------------------------------------------------------------------------
     [exec] [ERROR] BUILD ERROR
     [exec] [INFO] ------------------------------------------------------------------------
     [exec] [INFO] Command failed.The svn command failed.
     [exec] [INFO] ------------------------------------------------------------------------
     [exec] [INFO] Trace
     [exec] org.apache.maven.lifecycle.LifecycleExecutionException: Command failed.The svn
command failed.
     [exec] 	at org.apache.maven.lifecycle.DefaultLifecycleExecutor.executeGoals(DefaultLifecycleExecutor.java:584)
     [exec] 	at org.apache.maven.lifecycle.DefaultLifecycleExecutor.executeGoalWithLifecycle(DefaultLifecycleExecutor.java:500)
     [exec] 	at org.apache.maven.lifecycle.DefaultLifecycleExecutor.executeGoal(DefaultLifecycleExecutor.java:479)
     [exec] 	at org.apache.maven.lifecycle.DefaultLifecycleExecutor.executeGoalAndHandleFailures(DefaultLifecycleExecutor.java:331)
     [exec] 	at org.apache.maven.lifecycle.DefaultLifecycleExecutor.executeTaskSegments(DefaultLifecycleExecutor.java:292)
     [exec] 	at org.apache.maven.lifecycle.DefaultLifecycleExecutor.execute(DefaultLifecycleExecutor.java:142)
     [exec] 	at org.apache.maven.DefaultMaven.doExecute(DefaultMaven.java:345)
     [exec] 	at org.apache.maven.DefaultMaven.execute(DefaultMaven.java:132)
     [exec] 	at org.apache.maven.cli.MavenCli.main(MavenCli.java:290)
     [exec] 	at sun.reflect.NativeMethodAccessorImpl.invoke0(Native Method)
     [exec] 	at sun.reflect.NativeMethodAccessorImpl.invoke(NativeMethodAccessorImpl.java:39)
     [exec] 	at sun.reflect.DelegatingMethodAccessorImpl.invoke(DelegatingMethodAccessorImpl.java:25)
     [exec] 	at java.lang.reflect.Method.invoke(Method.java:324)
     [exec] 	at org.codehaus.classworlds.Launcher.launchEnhanced(Launcher.java:315)
     [exec] 	at org.codehaus.classworlds.Launcher.launch(Launcher.java:255)
     [exec] 	at org.codehaus.classworlds.Launcher.mainWithExitCode(Launcher.java:430)
     [exec] 	at org.codehaus.classworlds.Launcher.main(Launcher.java:375)
     [exec] Caused by: org.apache.maven.plugin.MojoExecutionException: Command failed.The
svn command failed.
     [exec] 	at org.apache.maven.scm.plugin.AbstractScmMojo.checkResult(AbstractScmMojo.java:400)
     [exec] 	at org.apache.maven.scm.plugin.UpdateMojo.execute(UpdateMojo.java:93)
     [exec] 	at org.apache.maven.plugin.DefaultPluginManager.executeMojo(DefaultPluginManager.java:454)
     [exec] 	at org.apache.maven.lifecycle.DefaultLifecycleExecutor.executeGoals(DefaultLifecycleExecutor.java:559)
     [exec] 	... 16 more
     [exec] [INFO] ------------------------------------------------------------------------
     [exec] [INFO] Total time: 24 seconds
     [exec] [INFO] Finished at: Wed Mar 04 08:18:48 CST 2009
     [exec] [INFO] Final Memory: 13M/26M
     [exec] [INFO] ------------------------------------------------------------------------

BUILD FAILED
http://grid.sonatype.org/ci/job/Maven-2.0.x-with-bootstrap/./jdk=1.4,label=osx/ws/maven-2.0.x/build.xml
:269: exec returned: 1

Total time: 2 minutes 0 seconds


Mime
View raw message