maven-notifications mailing list archives: February 2009

Site index · List index
Message list1 · 2 · 3 · 4 · 5 · 6 · 7 · 8 · 9 · Next »Thread · Author · Date
[continuum] BUILD FAILURE: Maven RC branch - Maven - default maven2 buildDefinition
Contin...@vmbuild.apache.org   [continuum] BUILD FAILURE: Maven RC branch - Maven - default maven2 buildDefinition Sun, 01 Feb, 04:35
Contin...@vmbuild.apache.org   [continuum] BUILD FAILURE: Maven RC branch - Maven - default maven2 buildDefinition Tue, 10 Feb, 02:45
Contin...@vmbuild.apache.org   [continuum] BUILD FAILURE: Maven RC branch - Maven - default maven2 buildDefinition Tue, 10 Feb, 05:26
Contin...@vmbuild.apache.org   [continuum] BUILD FAILURE: Maven RC branch - Maven - default maven2 buildDefinition Tue, 10 Feb, 18:18
Hudson Build failed in Hudson: Maven-2.0.10-RC-bootstrap » 1.4,ubuntu #59 Sun, 01 Feb, 06:17
Hudson   Hudson build is back to normal: Maven-2.0.10-RC-bootstrap » 1.4,ubuntu #60 Sun, 01 Feb, 10:34
Hudson Build failed in Hudson: Maven-2.0.10-RC-bootstrap » 1.4,osx #59 Sun, 01 Feb, 06:17
Hudson   Hudson build is back to normal: Maven-2.0.10-RC-bootstrap » 1.4,osx #60 Sun, 01 Feb, 10:42
Hudson Build failed in Hudson: Maven-2.0.10-RC-bootstrap » 1.4,windows #59 Sun, 01 Feb, 06:17
Hudson   Hudson build is back to normal: Maven-2.0.10-RC-bootstrap » 1.4,windows #60 Sun, 01 Feb, 10:37
Build failed in Hudson: Maven-2.1.x-with-bootstrap #291
Apache Hudson Server   Build failed in Hudson: Maven-2.1.x-with-bootstrap #291 Sun, 01 Feb, 11:22
Apache Hudson Server     Build failed in Hudson: Maven-2.1.x-with-bootstrap #292 Mon, 02 Feb, 12:22
Apache Hudson Server       Build failed in Hudson: Maven-2.1.x-with-bootstrap #293 Tue, 03 Feb, 20:22
Apache Hudson Server         Build failed in Hudson: Maven-2.1.x-with-bootstrap #294 Tue, 03 Feb, 21:20
Apache Hudson Server           Build failed in Hudson: Maven-2.1.x-with-bootstrap #295 Tue, 03 Feb, 22:22
Apache Hudson Server             Build failed in Hudson: Maven-2.1.x-with-bootstrap #296 Tue, 03 Feb, 23:21
Apache Hudson Server               Build failed in Hudson: Maven-2.1.x-with-bootstrap #297 Wed, 04 Feb, 16:17
Apache Hudson Server                 Build failed in Hudson: Maven-2.1.x-with-bootstrap #298 Wed, 04 Feb, 17:21
Apache Hudson Server                   Build failed in Hudson: Maven-2.1.x-with-bootstrap #299 Thu, 05 Feb, 21:21
Apache Hudson Server                     Hudson build is back to normal: Maven-2.1.x-with-bootstrap #300 Fri, 06 Feb, 11:34
[continuum] BUILD SUCCESSFUL: Maven RC branch - Maven - default maven2 buildDefinition
Contin...@vmbuild.apache.org   [continuum] BUILD SUCCESSFUL: Maven RC branch - Maven - default maven2 buildDefinition Sun, 01 Feb, 11:48
Contin...@vmbuild.apache.org   [continuum] BUILD SUCCESSFUL: Maven RC branch - Maven - default maven2 buildDefinition Wed, 18 Feb, 02:54
Contin...@vmbuild.apache.org   [continuum] BUILD SUCCESSFUL: Maven RC branch - Maven - default maven2 buildDefinition Tue, 24 Feb, 23:21
Hudson Build failed in Hudson: Maven-2.1.x-bootstrap » 1.4,ubuntu #70 Wed, 04 Feb, 14:38
Hudson   Build failed in Hudson: Maven-2.1.x-bootstrap » 1.4,ubuntu #71 Wed, 04 Feb, 18:36
Hudson     Hudson build is back to normal: Maven-2.1.x-bootstrap » 1.4,ubuntu #72 Fri, 06 Feb, 14:41
Hudson Build failed in Hudson: Maven-2.1.x-bootstrap » 1.4,windows #70 Wed, 04 Feb, 14:39
Hudson   Build failed in Hudson: Maven-2.1.x-bootstrap » 1.4,windows #71 Wed, 04 Feb, 18:46
Hudson     Build failed in Hudson: Maven-2.1.x-bootstrap » 1.4,windows #72 Fri, 06 Feb, 14:44
Hudson       Build failed in Hudson: Maven-2.1.x-bootstrap » 1.4,windows #73 Sat, 07 Feb, 02:20
Hudson         Hudson build is back to normal: Maven-2.1.x-bootstrap » 1.4,windows #74 Sat, 07 Feb, 06:38
Hudson Build failed in Hudson: Maven-2.1.x-bootstrap » 1.4,osx #70 Wed, 04 Feb, 14:48
Hudson   Build failed in Hudson: Maven-2.1.x-bootstrap » 1.4,osx #71 Wed, 04 Feb, 18:40
Hudson     Build failed in Hudson: Maven-2.1.x-bootstrap » 1.4,osx #72 Fri, 06 Feb, 14:46
Hudson       Build failed in Hudson: Maven-2.1.x-bootstrap » 1.4,osx #73 Sat, 07 Feb, 02:42
Hudson         Hudson build is back to normal: Maven-2.1.x-bootstrap » 1.4,osx #74 Sat, 07 Feb, 06:39
[continuum] BUILD FAILURE: Maven 2.0.x Branch - Integration Test Executor - default maven2 buildDefinition
Contin...@vmbuild.apache.org   [continuum] BUILD FAILURE: Maven 2.0.x Branch - Integration Test Executor - default maven2 buildDefinition Fri, 06 Feb, 14:19
Contin...@vmbuild.apache.org   [continuum] BUILD FAILURE: Maven 2.0.x Branch - Integration Test Executor - default maven2 buildDefinition Sat, 07 Feb, 03:19
Contin...@vmbuild.apache.org   [continuum] BUILD FAILURE: Maven 2.0.x Branch - Integration Test Executor - default maven2 buildDefinition Tue, 10 Feb, 02:19
Contin...@vmbuild.apache.org   [continuum] BUILD FAILURE: Maven 2.0.x Branch - Integration Test Executor - default maven2 buildDefinition Tue, 10 Feb, 05:22
Contin...@vmbuild.apache.org   [continuum] BUILD FAILURE: Maven 2.0.x Branch - Integration Test Executor - default maven2 buildDefinition Fri, 20 Feb, 06:08
Contin...@vmbuild.apache.org   [continuum] BUILD FAILURE: Maven 2.0.x Branch - Integration Test Executor - default maven2 buildDefinition Thu, 26 Feb, 03:36
Contin...@vmbuild.apache.org   [continuum] BUILD FAILURE: Maven 2.0.x Branch - Integration Test Executor - default maven2 buildDefinition Thu, 26 Feb, 15:29
Contin...@vmbuild.apache.org   [continuum] BUILD FAILURE: Maven 2.0.x Branch - Integration Test Executor - default maven2 buildDefinition Thu, 26 Feb, 19:56
Hudson Build failed in Hudson: Maven-2.0.x-with-bootstrap » 1.4,ubuntu #79 Fri, 06 Feb, 14:40
Hudson   Build failed in Hudson: Maven-2.0.x-with-bootstrap » 1.4,ubuntu #80 Sat, 07 Feb, 02:36
Hudson     Build failed in Hudson: Maven-2.0.x-with-bootstrap » 1.4,ubuntu #81 Sat, 07 Feb, 10:42
Hudson       Hudson build is back to normal: Maven-2.0.x-with-bootstrap » 1.4,ubuntu #82 Sun, 08 Feb, 05:46
Hudson Build failed in Hudson: Maven-2.0.x-with-bootstrap » 1.4,windows #79 Fri, 06 Feb, 14:44
Hudson   Hudson build is back to normal: Maven-2.0.x-with-bootstrap » 1.4,windows #80 Sat, 07 Feb, 02:38
[continuum] BUILD SUCCESSFUL: Maven 2.0.x Branch - Integration Test Executor - default maven2 buildDefinition
Contin...@vmbuild.apache.org   [continuum] BUILD SUCCESSFUL: Maven 2.0.x Branch - Integration Test Executor - default maven2 buildDefinition Fri, 06 Feb, 17:45
Contin...@vmbuild.apache.org   [continuum] BUILD SUCCESSFUL: Maven 2.0.x Branch - Integration Test Executor - default maven2 buildDefinition Sat, 07 Feb, 05:14
Contin...@vmbuild.apache.org   [continuum] BUILD SUCCESSFUL: Maven 2.0.x Branch - Integration Test Executor - default maven2 buildDefinition Tue, 10 Feb, 21:47
Contin...@vmbuild.apache.org   [continuum] BUILD SUCCESSFUL: Maven 2.0.x Branch - Integration Test Executor - default maven2 buildDefinition Wed, 18 Feb, 02:21
Contin...@vmbuild.apache.org   [continuum] BUILD SUCCESSFUL: Maven 2.0.x Branch - Integration Test Executor - default maven2 buildDefinition Fri, 20 Feb, 09:12
Contin...@vmbuild.apache.org   [continuum] BUILD SUCCESSFUL: Maven 2.0.x Branch - Integration Test Executor - default maven2 buildDefinition Thu, 26 Feb, 07:26
Contin...@vmbuild.apache.org   [continuum] BUILD SUCCESSFUL: Maven 2.0.x Branch - Integration Test Executor - default maven2 buildDefinition Thu, 26 Feb, 22:54
Hudson Build failed in Hudson: Maven-2.1.x-bootstrap » 1.4,ubuntu #73 Sat, 07 Feb, 02:36
Hudson   Hudson build is back to normal: Maven-2.1.x-bootstrap » 1.4,ubuntu #74 Sat, 07 Feb, 06:34
Hudson Build failed in Hudson: Maven-2.0.x-with-bootstrap » 1.4,osx #80 Sat, 07 Feb, 02:44
Hudson   Hudson build is back to normal: Maven-2.0.x-with-bootstrap » 1.4,osx #81 Sat, 07 Feb, 10:44
Hudson Build failed in Hudson: Maven 2.1.x » 1.5,osx #61 Sat, 07 Feb, 06:02
Hudson   Hudson build is back to normal: Maven 2.1.x » 1.5,osx #62 Sat, 07 Feb, 14:05
Hudson Build failed in Hudson: Maven-2.1.x-bootstrap » 1.4,ubuntu #75 Sat, 07 Feb, 10:41
Hudson   Build failed in Hudson: Maven-2.1.x-bootstrap » 1.4,ubuntu #76 Sun, 08 Feb, 02:34
Hudson     Hudson build is back to normal: Maven-2.1.x-bootstrap » 1.4,ubuntu #77 Sun, 08 Feb, 03:34
Hudson Build failed in Hudson: Maven-2.1.x-bootstrap » 1.4,osx #75 Sat, 07 Feb, 10:42
Hudson   Build failed in Hudson: Maven-2.1.x-bootstrap » 1.4,osx #76 Sun, 08 Feb, 02:38
Hudson     Hudson build is back to normal: Maven-2.1.x-bootstrap » 1.4,osx #77 Sun, 08 Feb, 03:45
Hudson Build failed in Hudson: Maven-2.1.x-bootstrap » 1.4,windows #76 Sun, 08 Feb, 02:38
Hudson   Hudson build is back to normal: Maven-2.1.x-bootstrap » 1.4,windows #77 Sun, 08 Feb, 03:36
[continuum] BUILD ERROR: Maven Integration Testing - Maven Verifier Component - default maven2 buildDefinition
Contin...@vmbuild.apache.org   [continuum] BUILD ERROR: Maven Integration Testing - Maven Verifier Component - default maven2 buildDefinition Mon, 09 Feb, 20:50
Contin...@vmbuild.apache.org   [continuum] BUILD ERROR: Maven Integration Testing - Maven Verifier Component - default maven2 buildDefinition Mon, 16 Feb, 19:30
Hudson Build failed in Hudson: Maven-2.1.x-bootstrap » 1.4,osx #80 Mon, 09 Feb, 22:26
Hudson   Build failed in Hudson: Maven-2.1.x-bootstrap » 1.4,osx #81 Tue, 10 Feb, 02:25
Hudson     Build failed in Hudson: Maven-2.1.x-bootstrap » 1.4,osx #82 Tue, 10 Feb, 10:26
Hudson       Build failed in Hudson: Maven-2.1.x-bootstrap » 1.4,osx #83 Tue, 10 Feb, 18:28
Hudson         Hudson build is back to normal: Maven-2.1.x-bootstrap » 1.4,osx #84 Thu, 12 Feb, 02:48
Hudson Build failed in Hudson: Maven-2.1.x-bootstrap » 1.4,windows #80 Mon, 09 Feb, 22:49
Hudson   Build failed in Hudson: Maven-2.1.x-bootstrap » 1.4,windows #81 Tue, 10 Feb, 02:45
Hudson     Hudson build is back to normal: Maven-2.1.x-bootstrap » 1.4,windows #82 Tue, 10 Feb, 10:49
Contin...@vmbuild.apache.org [continuum] BUILD ERROR: Maven Integration Testing - Maven Integration Test Plugin :: File - default maven2 buildDefinition Mon, 09 Feb, 22:53
[continuum] BUILD SUCCESSFUL: Maven Integration Testing - Maven Verifier Component - default maven2 buildDefinition
Contin...@vmbuild.apache.org   [continuum] BUILD SUCCESSFUL: Maven Integration Testing - Maven Verifier Component - default maven2 buildDefinition Mon, 09 Feb, 23:14
Contin...@vmbuild.apache.org   [continuum] BUILD SUCCESSFUL: Maven Integration Testing - Maven Verifier Component - default maven2 buildDefinition Sat, 21 Feb, 14:02
Hudson Build failed in Hudson: Maven-2.0.10-RC-bootstrap » 1.4,ubuntu #61 Tue, 10 Feb, 02:34
Hudson   Build failed in Hudson: Maven-2.0.10-RC-bootstrap » 1.4,ubuntu #62 Tue, 10 Feb, 06:18
Hudson     Build failed in Hudson: Maven-2.0.10-RC-bootstrap » 1.4,ubuntu #63 Tue, 10 Feb, 10:40
Hudson Build failed in Hudson: Maven-2.0.10-RC-bootstrap » 1.4,windows #61 Tue, 10 Feb, 02:38
Hudson   Build failed in Hudson: Maven-2.0.10-RC-bootstrap » 1.4,windows #62 Tue, 10 Feb, 06:18
Hudson     Build failed in Hudson: Maven-2.0.10-RC-bootstrap » 1.4,windows #63 Tue, 10 Feb, 10:40
Hudson Build failed in Hudson: Maven-2.0.10-RC-bootstrap » 1.4,osx #61 Tue, 10 Feb, 02:43
Hudson   Build failed in Hudson: Maven-2.0.10-RC-bootstrap » 1.4,osx #62 Tue, 10 Feb, 06:18
Hudson     Build failed in Hudson: Maven-2.0.10-RC-bootstrap » 1.4,osx #63 Tue, 10 Feb, 10:41
[continuum] BUILD FAILURE: Maven 2.1.x Branch - Maven Core - default maven2 buildDefinition
Contin...@vmbuild.apache.org   [continuum] BUILD FAILURE: Maven 2.1.x Branch - Maven Core - default maven2 buildDefinition Tue, 10 Feb, 02:50
Contin...@vmbuild.apache.org   [continuum] BUILD FAILURE: Maven 2.1.x Branch - Maven Core - default maven2 buildDefinition Thu, 12 Feb, 01:54
Contin...@vmbuild.apache.org   [continuum] BUILD FAILURE: Maven 2.1.x Branch - Maven Core - default maven2 buildDefinition Fri, 13 Feb, 00:51
Contin...@vmbuild.apache.org   [continuum] BUILD FAILURE: Maven 2.1.x Branch - Maven Core - default maven2 buildDefinition Fri, 13 Feb, 07:55
Contin...@vmbuild.apache.org   [continuum] BUILD FAILURE: Maven 2.1.x Branch - Maven Core - default maven2 buildDefinition Thu, 19 Feb, 14:55
Contin...@vmbuild.apache.org   [continuum] BUILD FAILURE: Maven 2.1.x Branch - Maven Core - default maven2 buildDefinition Thu, 19 Feb, 18:03
[continuum] BUILD SUCCESSFUL: Maven Integration Testing - Maven Integration Test Plugin :: Log File - default maven2 buildDefinition
Contin...@vmbuild.apache.org   [continuum] BUILD SUCCESSFUL: Maven Integration Testing - Maven Integration Test Plugin :: Log File - default maven2 buildDefinition Tue, 10 Feb, 02:58
Contin...@vmbuild.apache.org   [continuum] BUILD SUCCESSFUL: Maven Integration Testing - Maven Integration Test Plugin :: Log File - default maven2 buildDefinition Wed, 18 Feb, 03:19
[continuum] BUILD SUCCESSFUL: Maven 2.1.x Branch - Maven Core - default maven2 buildDefinition
Contin...@vmbuild.apache.org   [continuum] BUILD SUCCESSFUL: Maven 2.1.x Branch - Maven Core - default maven2 buildDefinition Tue, 10 Feb, 05:30
Contin...@vmbuild.apache.org   [continuum] BUILD SUCCESSFUL: Maven 2.1.x Branch - Maven Core - default maven2 buildDefinition Thu, 12 Feb, 03:17
Contin...@vmbuild.apache.org   [continuum] BUILD SUCCESSFUL: Maven 2.1.x Branch - Maven Core - default maven2 buildDefinition Fri, 13 Feb, 09:40
Contin...@vmbuild.apache.org   [continuum] BUILD SUCCESSFUL: Maven 2.1.x Branch - Maven Core - default maven2 buildDefinition Wed, 18 Feb, 03:07
Contin...@vmbuild.apache.org   [continuum] BUILD SUCCESSFUL: Maven 2.1.x Branch - Maven Core - default maven2 buildDefinition Thu, 19 Feb, 22:01
Contin...@vmbuild.apache.org   [continuum] BUILD SUCCESSFUL: Maven 2.1.x Branch - Maven Core - default maven2 buildDefinition Tue, 24 Feb, 23:39
Apache Hudson Server Build failed in Hudson: Maven-2.1.x-with-bootstrap #306 Wed, 11 Feb, 00:25
Apache Hudson Server   Build failed in Hudson: Maven-2.1.x-with-bootstrap #307 Wed, 11 Feb, 05:17
Apache Hudson Server     Build failed in Hudson: Maven-2.1.x-with-bootstrap #308 Thu, 12 Feb, 23:21
Apache Hudson Server       Build failed in Hudson: Maven-2.1.x-with-bootstrap #309 Fri, 13 Feb, 02:52
Apache Hudson Server         Build failed in Hudson: Maven-2.1.x-with-bootstrap #310 Fri, 13 Feb, 06:47
Apache Hudson Server           Build failed in Hudson: Maven-2.1.x-with-bootstrap #311 Fri, 13 Feb, 16:40
Apache Hudson Server             Build failed in Hudson: Maven-2.1.x-with-bootstrap #312 Fri, 13 Feb, 22:17
Apache Hudson Server               Build failed in Hudson: Maven-2.1.x-with-bootstrap #313 Sat, 14 Feb, 21:04
Apache Hudson Server                 Build failed in Hudson: Maven-2.1.x-with-bootstrap #314 Sun, 15 Feb, 01:33
Apache Hudson Server                   Build failed in Hudson: Maven-2.1.x-with-bootstrap #315 Sun, 15 Feb, 11:17
Apache Hudson Server                     Build failed in Hudson: Maven-2.1.x-with-bootstrap #316 Tue, 17 Feb, 13:17
Apache Hudson Server                       Build failed in Hudson: Maven-2.1.x-with-bootstrap #317 Tue, 17 Feb, 15:25
Apache Hudson Server                         Build failed in Hudson: Maven-2.1.x-with-bootstrap #318 Tue, 17 Feb, 20:17
Apache Hudson Server                           Build failed in Hudson: Maven-2.1.x-with-bootstrap #319 Tue, 17 Feb, 21:16
Apache Hudson Server                             Build failed in Hudson: Maven-2.1.x-with-bootstrap #320 Tue, 17 Feb, 22:28
Apache Hudson Server                               Build failed in Hudson: Maven-2.1.x-with-bootstrap #321 Wed, 18 Feb, 01:19
Apache Hudson Server                                 Build failed in Hudson: Maven-2.1.x-with-bootstrap #322 Wed, 18 Feb, 05:17
Apache Hudson Server                                   Build failed in Hudson: Maven-2.1.x-with-bootstrap #323 Wed, 18 Feb, 20:17
Apache Hudson Server                                     Build failed in Hudson: Maven-2.1.x-with-bootstrap #324 Wed, 18 Feb, 21:17
Apache Hudson Server                                       Build failed in Hudson: Maven-2.1.x-with-bootstrap #325 Thu, 19 Feb, 05:34
Apache Hudson Server                                         Build failed in Hudson: Maven-2.1.x-with-bootstrap #326 Thu, 19 Feb, 19:44
Apache Hudson Server                                           Build failed in Hudson: Maven-2.1.x-with-bootstrap #327 Thu, 19 Feb, 23:42
Apache Hudson Server                                             Build failed in Hudson: Maven-2.1.x-with-bootstrap #328 Fri, 20 Feb, 03:55
Apache Hudson Server                                               Build failed in Hudson: Maven-2.1.x-with-bootstrap #329 Fri, 20 Feb, 08:39
Apache Hudson Server                                                 Build failed in Hudson: Maven-2.1.x-with-bootstrap #330 Fri, 20 Feb, 21:31
Apache Hudson Server                                                   Build failed in Hudson: Maven-2.1.x-with-bootstrap #331 Sat, 21 Feb, 03:17
Apache Hudson Server                                                     Build failed in Hudson: Maven-2.1.x-with-bootstrap #332 Sat, 21 Feb, 04:17
Apache Hudson Server                                                       Build failed in Hudson: Maven-3.0.x-with-bootstrap #333 Sat, 21 Feb, 07:52
Apache Hudson Server                                                         Build failed in Hudson: Maven-3.0.x-with-bootstrap #334 Sat, 21 Feb, 08:51
Apache Hudson Server                                                           Build failed in Hudson: Maven-3.0.x-with-bootstrap #335 Sat, 21 Feb, 10:20
Apache Hudson Server                                                             Build failed in Hudson: Maven-3.0.x-with-bootstrap #336 Sat, 21 Feb, 16:21
Apache Hudson Server                                                               Build failed in Hudson: Maven-3.0.x-with-bootstrap #337 Sun, 22 Feb, 20:21
Apache Hudson Server                                                                 Build failed in Hudson: Maven-3.0.x-with-bootstrap #338 Sun, 22 Feb, 21:22
[continuum] BUILD FAILURE: Maven 2.1.x Branch - Maven Ant Mojo Support - default maven2 buildDefinition
Contin...@vmbuild.apache.org   [continuum] BUILD FAILURE: Maven 2.1.x Branch - Maven Ant Mojo Support - default maven2 buildDefinition Thu, 12 Feb, 01:51
Contin...@vmbuild.apache.org   [continuum] BUILD FAILURE: Maven 2.1.x Branch - Maven Ant Mojo Support - default maven2 buildDefinition Thu, 12 Feb, 03:14
Contin...@vmbuild.apache.org   [continuum] BUILD FAILURE: Maven 2.1.x Branch - Maven Ant Mojo Support - default maven2 buildDefinition Thu, 12 Feb, 05:16
Contin...@vmbuild.apache.org   [continuum] BUILD FAILURE: Maven 2.1.x Branch - Maven Ant Mojo Support - default maven2 buildDefinition Thu, 19 Feb, 14:45
[continuum] BUILD SUCCESSFUL: Maven 2.1.x Branch - Maven Ant Mojo Support - default maven2 buildDefinition
Contin...@vmbuild.apache.org   [continuum] BUILD SUCCESSFUL: Maven 2.1.x Branch - Maven Ant Mojo Support - default maven2 buildDefinition Fri, 13 Feb, 00:46
Contin...@vmbuild.apache.org   [continuum] BUILD SUCCESSFUL: Maven 2.1.x Branch - Maven Ant Mojo Support - default maven2 buildDefinition Wed, 18 Feb, 02:58
Contin...@vmbuild.apache.org   [continuum] BUILD SUCCESSFUL: Maven 2.1.x Branch - Maven Ant Mojo Support - default maven2 buildDefinition Thu, 19 Feb, 21:55
Contin...@vmbuild.apache.org   [continuum] BUILD SUCCESSFUL: Maven 2.1.x Branch - Maven Ant Mojo Support - default maven2 buildDefinition Tue, 24 Feb, 23:25
Hudson Build failed in Hudson: Maven 2.1.x » 1.5,osx #70 Fri, 13 Feb, 06:02
Hudson   Hudson build is back to normal: Maven 2.1.x » 1.5,osx #71 Fri, 13 Feb, 10:03
Hudson Build failed in Hudson: maven-shared » 1.5,windows #45 Fri, 13 Feb, 18:34
Hudson   Build failed in Hudson: maven-shared » 1.5,windows #46 Fri, 13 Feb, 22:12
Hudson     Build failed in Hudson: maven-shared » 1.5,windows #47 Fri, 13 Feb, 22:14
Hudson       Build failed in Hudson: maven-shared » 1.5,windows #48 Fri, 13 Feb, 22:20
Hudson         Build failed in Hudson: maven-shared » 1.5,windows #49 Fri, 13 Feb, 22:31
Hudson           Build failed in Hudson: maven-shared » 1.5,windows #50 Fri, 13 Feb, 22:34
Hudson             Build failed in Hudson: maven-shared » 1.5,windows #51 Fri, 13 Feb, 22:42
Hudson               Build failed in Hudson: maven-shared » 1.5,windows #52 Fri, 13 Feb, 22:47
Hudson                 Build failed in Hudson: maven-shared » 1.5,windows #53 Sat, 14 Feb, 02:35
Hudson                   Build failed in Hudson: maven-shared » 1.5,windows #54 Sat, 14 Feb, 18:48
Hudson                     Build failed in Hudson: maven-shared » 1.5,windows #55 Sat, 14 Feb, 22:33
Hudson                       Build failed in Hudson: maven-shared » 1.5,windows #56 Sat, 14 Feb, 22:48
Hudson                         Build failed in Hudson: maven-shared » 1.5,windows #57 Sun, 15 Feb, 02:33
Hudson                           Build failed in Hudson: maven-shared » 1.5,windows #58 Sun, 15 Feb, 12:16
Hudson                             Hudson build is back to normal: maven-shared » 1.5,windows #59 Sun, 15 Feb, 12:40
Hudson Build failed in Hudson: maven-core-integration-testing » 1.5,windows #201 Fri, 13 Feb, 22:15
Hudson   Hudson build is back to normal: maven-core-integration-testing » 1.5,windows #202 Sat, 14 Feb, 02:09
Hudson Build failed in Hudson: Maven-2.0.x-with-bootstrap » 1.4,windows #85 Sat, 14 Feb, 02:18
Hudson   Build failed in Hudson: Maven-2.0.x-with-bootstrap » 1.4,windows #86 Tue, 17 Feb, 14:18
Hudson     Hudson build is back to normal: Maven-2.0.x-with-bootstrap » 1.4,windows #87 Thu, 19 Feb, 14:38
Hudson Build failed in Hudson: Maven-2.1.x-bootstrap » 1.4,windows #86 Sat, 14 Feb, 02:24
Hudson   Build failed in Hudson: Maven-2.1.x-bootstrap » 1.4,windows #87 Sat, 14 Feb, 19:04
Hudson     Build failed in Hudson: Maven-2.1.x-bootstrap » 1.4,windows #88 Sun, 15 Feb, 10:24
Hudson       Build failed in Hudson: Maven-2.1.x-bootstrap » 1.4,windows #89 Sun, 15 Feb, 18:24
Contin...@vmbuild.apache.org [continuum] BUILD FAILURE: Maven 2.1.x Branch - Maven - default maven2 buildDefinition Sat, 14 Feb, 02:54
Contin...@vmbuild.apache.org [continuum] BUILD FAILURE: Maven 2.0.x Branch - Maven - default maven2 buildDefinition Sat, 14 Feb, 02:55
Message list1 · 2 · 3 · 4 · 5 · 6 · 7 · 8 · 9 · Next »Thread · Author · Date
Box list
May 2015150
Apr 2015367
Mar 2015273
Feb 2015179
Jan 2015399
Dec 2014420
Nov 2014618
Oct 2014426
Sep 2014304
Aug 2014246
Jul 2014317
Jun 2014341
May 2014161
Apr 2014146
Mar 2014336
Feb 2014308
Jan 2014189
Dec 2013319
Nov 2013274
Oct 2013167
Sep 2013486
Aug 2013263
Jul 2013726
Jun 2013722
May 2013378
Apr 2013313
Mar 2013467
Feb 2013520
Jan 20131437
Dec 20121778
Nov 2012775
Oct 20121224
Sep 2012791
Aug 2012362
Jul 2012232
Jun 2012149
May 2012189
Apr 2012115
Mar 201257
Feb 2012155
Jan 2012170
Dec 2011244
Nov 2011187
Oct 2011139
Sep 2011190
Aug 2011276
Jul 201194
Jun 20114
Apr 201162
Mar 201176
Feb 201154
Jan 201185
Dec 201079
Nov 201061
Oct 201058
Sep 20101
Aug 201057
Jul 201037
Jun 201020
May 201075
Apr 201053
Mar 201012
Feb 201030
Jan 201071
Dec 2009104
Nov 200919
Oct 200931
Sep 2009193
Aug 2009268
Jul 2009193
Jun 2009147
May 200975
Apr 200979
Mar 2009134
Feb 2009657
Jan 200983
Dec 2008349
Nov 2008288
Oct 2008986
Sep 2008842
Aug 2008707
Jul 2008887
Jun 2008167
May 200821
Apr 2008231
Mar 2008438
Feb 2008317
Jan 2008205
Dec 2007185
Nov 2007532
Oct 2007439
Sep 2007699
Aug 20071294
Jul 2007351
Jun 20072211
May 2007273
Apr 2007262
Mar 2007534
Feb 20071648
Jan 20072359
Dec 2006575
Nov 2006357
Oct 2006642
Sep 2006660
Aug 20061662
Jul 20061320
Jun 2006473
May 20064700
Apr 20061113
Mar 20061048