maven-notifications mailing list archives

Site index · List index
Message view « Date » · « Thread »
Top « Date » · « Thread »
From Hudson <Hud...@sonatype.org>
Subject Build failed in Hudson: Maven-2.0.x-with-bootstrap » 1.4,ubuntu #80
Date Sat, 07 Feb 2009 02:36:58 GMT
See http://grid.sonatype.org/ci/job/Maven-2.0.x-with-bootstrap/./jdk=1.4,label=ubuntu/80/changes

Changes:

[Benjamin Bentmann] [MNG-4023] Profiles from parent POM are injected multiple times if parent
is part of reactor build

------------------------------------------
[...truncated 3344 lines...]
     [exec] from the specified remote repositories:
     [exec]   central (http://repo1.maven.org/maven2),
     [exec]   testing-repo (file:///tmp/maven-integration-tests-2.0.x/core-it-suite/target/test-classes/mng-2883/dependency/repo)
     [exec] 	at org.apache.maven.artifact.resolver.DefaultArtifactResolver.resolveTransitively(DefaultArtifactResolver.java:324)
     [exec] 	at org.apache.maven.artifact.resolver.DefaultArtifactResolver.resolveTransitively(DefaultArtifactResolver.java:288)
     [exec] 	at org.apache.maven.plugin.DefaultPluginManager.resolveTransitiveDependencies(DefaultPluginManager.java:1417)
     [exec] 	at org.apache.maven.plugin.DefaultPluginManager.executeMojo(DefaultPluginManager.java:407)
     [exec] 	at org.apache.maven.lifecycle.DefaultLifecycleExecutor.executeGoals(DefaultLifecycleExecutor.java:559)
     [exec] 	... 16 more
     [exec] [INFO] ------------------------------------------------------------------------
     [exec] [INFO] Total time: < 1 second
     [exec] [INFO] Finished at: Fri Feb 06 20:31:11 GMT-06:00 2009
     [exec] [INFO] Final Memory: 2M/5M
     [exec] [INFO] ------------------------------------------------------------------------
     [exec] 	at org.apache.maven.it.Verifier.executeGoals(Verifier.java:1274)
     [exec] 	at org.apache.maven.it.Verifier.executeGoal(Verifier.java:1126)
     [exec] 	at org.apache.maven.it.Verifier.executeGoal(Verifier.java:1120)
     [exec] 	at org.apache.maven.it.MavenITmng2883LegacyRepoOfflineTest.testDependencyUnresolvable(MavenITmng2883LegacyRepoOfflineTest.java:193)
     [exec] 	at org.apache.maven.it.MavenITmng2883LegacyRepoOfflineTest.testDependencyUnresolvable(MavenITmng2883LegacyRepoOfflineTest.java:193)
     [exec] 	at sun.reflect.NativeMethodAccessorImpl.invoke0(Native Method)
     [exec] 	at sun.reflect.NativeMethodAccessorImpl.invoke(NativeMethodAccessorImpl.java:39)
     [exec] 	at sun.reflect.DelegatingMethodAccessorImpl.invoke(DelegatingMethodAccessorImpl.java:25)
     [exec] 	at java.lang.reflect.Method.invoke(Method.java:324)
     [exec] 	at junit.framework.TestCase.runTest(TestCase.java:164)
     [exec] 	at org.apache.maven.it.AbstractMavenIntegrationTestCase.runTest(AbstractMavenIntegrationTestCase.java:178)
     [exec] 	at junit.framework.TestCase.runBare(TestCase.java:130)
     [exec] 	at junit.framework.TestResult$1.protect(TestResult.java:106)
     [exec] 	at junit.framework.TestResult.runProtected(TestResult.java:124)
     [exec] 	at junit.framework.TestResult.run(TestResult.java:109)
     [exec] 	at junit.framework.TestCase.run(TestCase.java:120)
     [exec] 	at junit.framework.TestSuite.runTest(TestSuite.java:230)
     [exec] 	at junit.framework.TestSuite.run(TestSuite.java:225)
     [exec] 	at junit.framework.TestSuite.runTest(TestSuite.java:230)
     [exec] 	at junit.framework.TestSuite.run(TestSuite.java:225)
     [exec] 	at sun.reflect.NativeMethodAccessorImpl.invoke0(Native Method)
     [exec] 	at sun.reflect.NativeMethodAccessorImpl.invoke(NativeMethodAccessorImpl.java:39)
     [exec] 	at sun.reflect.DelegatingMethodAccessorImpl.invoke(DelegatingMethodAccessorImpl.java:25)
     [exec] 	at java.lang.reflect.Method.invoke(Method.java:324)
     [exec] 	at org.apache.maven.surefire.junit.JUnitTestSet.execute(JUnitTestSet.java:213)
     [exec] 	at org.apache.maven.surefire.suite.AbstractDirectoryTestSuite.executeTestSet(AbstractDirectoryTestSuite.java:138)
     [exec] 	at org.apache.maven.surefire.suite.AbstractDirectoryTestSuite.execute(AbstractDirectoryTestSuite.java:125)
     [exec] 	at org.apache.maven.surefire.Surefire.run(Surefire.java:132)
     [exec] 	at sun.reflect.NativeMethodAccessorImpl.invoke0(Native Method)
     [exec] 	at sun.reflect.NativeMethodAccessorImpl.invoke(NativeMethodAccessorImpl.java:39)
     [exec] 	at sun.reflect.DelegatingMethodAccessorImpl.invoke(DelegatingMethodAccessorImpl.java:25)
     [exec] 	at java.lang.reflect.Method.invoke(Method.java:324)
     [exec] 	at org.apache.maven.surefire.booter.SurefireBooter.runSuitesInProcess(SurefireBooter.java:290)
     [exec] 	at org.apache.maven.surefire.booter.SurefireBooter.run(SurefireBooter.java:198)
     [exec] 	at org.apache.maven.plugin.surefire.SurefirePlugin.execute(SurefirePlugin.java:398)
     [exec] 	at org.apache.maven.plugin.DefaultPluginManager.executeMojo(DefaultPluginManager.java:453)
     [exec] 	at org.apache.maven.lifecycle.DefaultLifecycleExecutor.executeGoals(DefaultLifecycleExecutor.java:559)
     [exec] 	at org.apache.maven.lifecycle.DefaultLifecycleExecutor.executeGoalWithLifecycle(DefaultLifecycleExecutor.java:500)
     [exec] 	at org.apache.maven.lifecycle.DefaultLifecycleExecutor.executeGoal(DefaultLifecycleExecutor.java:479)
     [exec] 	at org.apache.maven.lifecycle.DefaultLifecycleExecutor.executeGoalAndHandleFailures(DefaultLifecycleExecutor.java:331)
     [exec] 	at org.apache.maven.lifecycle.DefaultLifecycleExecutor.executeTaskSegments(DefaultLifecycleExecutor.java:292)
     [exec] 	at org.apache.maven.lifecycle.DefaultLifecycleExecutor.execute(DefaultLifecycleExecutor.java:142)
     [exec] 	at org.apache.maven.DefaultMaven.doExecute(DefaultMaven.java:336)
     [exec] 	at org.apache.maven.DefaultMaven.execute(DefaultMaven.java:129)
     [exec] 	at org.apache.maven.cli.MavenCli.main(MavenCli.java:296)
     [exec] 	at sun.reflect.NativeMethodAccessorImpl.invoke0(Native Method)
     [exec] 	at sun.reflect.NativeMethodAccessorImpl.invoke(NativeMethodAccessorImpl.java:39)
     [exec] 	at sun.reflect.DelegatingMethodAccessorImpl.invoke(DelegatingMethodAccessorImpl.java:25)
     [exec] 	at java.lang.reflect.Method.invoke(Method.java:324)
     [exec] 	at org.codehaus.classworlds.Launcher.launchEnhanced(Launcher.java:315)
     [exec] 	at org.codehaus.classworlds.Launcher.launch(Launcher.java:255)
     [exec] 	at org.codehaus.classworlds.Launcher.mainWithExitCode(Launcher.java:430)
     [exec] 	at org.codehaus.classworlds.Launcher.main(Launcher.java:375)
     [exec] 
     [exec] testitMNG768(org.apache.maven.it.MavenITmng0768OfflineModeTest)  Time elapsed:
3.342 sec  <<< ERROR!
     [exec] org.apache.maven.it.VerificationException: Exit code was non-zero: 1; command
line and log = 
     [exec] /tmp/apache-maven-2.0.11-SNAPSHOT/bin/mvn -o -e --batch-mode -Dmaven.repo.local=/opt/repos/local-repository
org.apache.maven.its.plugins:maven-it-plugin-dependency-resolution:2.1-SNAPSHOT:compile
     [exec] + Error stacktraces are turned on.
     [exec] [INFO] 
     [exec] NOTE: Maven is executing in offline mode. Any artifacts not already in your local
     [exec] repository will be inaccessible.
     [exec] [INFO] Scanning for projects...
     [exec] [INFO] ------------------------------------------------------------------------
     [exec] [INFO] Building Maven Integration Test :: MNG-768
     [exec] [INFO]    task-segment: [org.apache.maven.its.plugins:maven-it-plugin-dependency-resolution:2.1-SNAPSHOT:compile]
     [exec] [INFO] ------------------------------------------------------------------------
     [exec] [INFO] ------------------------------------------------------------------------
     [exec] [ERROR] BUILD ERROR
     [exec] [INFO] ------------------------------------------------------------------------
     [exec] [INFO] Failed to resolve artifact.
     [exec] Missing:
     [exec] ----------
     [exec] 1) org.apache.maven.its.it0069:it:jar:1.0.3
     [exec]   Try downloading the file manually from the project website.
     [exec]   Then, install it using the command: 
     [exec]       mvn install:install-file -DgroupId=org.apache.maven.its.it0069 -DartifactId=it
-Dversion=1.0.3 -Dpackaging=jar -Dfile=/path/to/file
     [exec]   Alternatively, if you host your own repository you can deploy the file there:

     [exec]       mvn deploy:deploy-file -DgroupId=org.apache.maven.its.it0069 -DartifactId=it
-Dversion=1.0.3 -Dpackaging=jar -Dfile=/path/to/file -Durl=[url] -DrepositoryId=[id]
     [exec]   Path to dependency: 
     [exec]   	1) org.apache.maven.its.mng0768:test:jar:1.0-SNAPSHOT
     [exec]   	2) org.apache.maven.its.it0069:it:jar:1.0.3
     [exec] ----------
     [exec] 1 required artifact is missing.
     [exec] for artifact: 
     [exec]   org.apache.maven.its.mng0768:test:jar:1.0-SNAPSHOT
     [exec] from the specified remote repositories:
     [exec]   maven-core-it (file:////tmp/maven-integration-tests-2.0.x/core-it-suite/target/test-classes/mng-0768/repo),
     [exec]   Nexus (http://repository.sonatype.org:8081/content/groups/public)
     [exec] NOTE: Maven is executing in offline mode. Any artifacts not already in your local
     [exec] repository will be inaccessible.
     [exec] [INFO] ------------------------------------------------------------------------
     [exec] [INFO] Trace
     [exec] org.apache.maven.lifecycle.LifecycleExecutionException: Missing:
     [exec] ----------
     [exec] 1) org.apache.maven.its.it0069:it:jar:1.0.3
     [exec]   Try downloading the file manually from the project website.
     [exec]   Then, install it using the command: 
     [exec]       mvn install:install-file -DgroupId=org.apache.maven.its.it0069 -DartifactId=it
-Dversion=1.0.3 -Dpackaging=jar -Dfile=/path/to/file
     [exec]   Alternatively, if you host your own repository you can deploy the file there:

     [exec]       mvn deploy:deploy-file -DgroupId=org.apache.maven.its.it0069 -DartifactId=it
-Dversion=1.0.3 -Dpackaging=jar -Dfile=/path/to/file -Durl=[url] -DrepositoryId=[id]
     [exec]   Path to dependency: 
     [exec]   	1) org.apache.maven.its.mng0768:test:jar:1.0-SNAPSHOT
     [exec]   	2) org.apache.maven.its.it0069:it:jar:1.0.3
     [exec] ----------
     [exec] 1 required artifact is missing.
     [exec] for artifact: 
     [exec]   org.apache.maven.its.mng0768:test:jar:1.0-SNAPSHOT
     [exec] from the specified remote repositories:
     [exec]   maven-core-it (file:////tmp/maven-integration-tests-2.0.x/core-it-suite/target/test-classes/mng-0768/repo),
     [exec]   Nexus (http://repository.sonatype.org:8081/content/groups/public)
     [exec] 	at org.apache.maven.lifecycle.DefaultLifecycleExecutor.executeGoals(DefaultLifecycleExecutor.java:576)
     [exec] 	at org.apache.maven.lifecycle.DefaultLifecycleExecutor.executeStandaloneGoal(DefaultLifecycleExecutor.java:513)
     [exec] 	at org.apache.maven.lifecycle.DefaultLifecycleExecutor.executeGoal(DefaultLifecycleExecutor.java:483)
     [exec] 	at org.apache.maven.lifecycle.DefaultLifecycleExecutor.executeGoalAndHandleFailures(DefaultLifecycleExecutor.java:331)
     [exec] 	at org.apache.maven.lifecycle.DefaultLifecycleExecutor.executeTaskSegments(DefaultLifecycleExecutor.java:292)
     [exec] 	at org.apache.maven.lifecycle.DefaultLifecycleExecutor.execute(DefaultLifecycleExecutor.java:142)
     [exec] 	at org.apache.maven.DefaultMaven.doExecute(DefaultMaven.java:336)
     [exec] 	at org.apache.maven.DefaultMaven.execute(DefaultMaven.java:129)
     [exec] 	at org.apache.maven.cli.MavenCli.main(MavenCli.java:296)
     [exec] 	at sun.reflect.NativeMethodAccessorImpl.invoke0(Native Method)
     [exec] 	at sun.reflect.NativeMethodAccessorImpl.invoke(NativeMethodAccessorImpl.java:39)
     [exec] 	at sun.reflect.DelegatingMethodAccessorImpl.invoke(DelegatingMethodAccessorImpl.java:25)
     [exec] 	at java.lang.reflect.Method.invoke(Method.java:324)
     [exec] 	at org.codehaus.classworlds.Launcher.launchEnhanced(Launcher.java:315)
     [exec] 	at org.codehaus.classworlds.Launcher.launch(Launcher.java:255)
     [exec] 	at org.codehaus.classworlds.Launcher.mainWithExitCode(Launcher.java:430)
     [exec] 	at org.codehaus.classworlds.Launcher.main(Launcher.java:375)
     [exec] Caused by: org.apache.maven.artifact.resolver.MultipleArtifactsNotFoundException:
Missing:
     [exec] ----------
     [exec] 1) org.apache.maven.its.it0069:it:jar:1.0.3
     [exec]   Try downloading the file manually from the project website.
     [exec]   Then, install it using the command: 
     [exec]       mvn install:install-file -DgroupId=org.apache.maven.its.it0069 -DartifactId=it
-Dversion=1.0.3 -Dpackaging=jar -Dfile=/path/to/file
     [exec]   Alternatively, if you host your own repository you can deploy the file there:

     [exec]       mvn deploy:deploy-file -DgroupId=org.apache.maven.its.it0069 -DartifactId=it
-Dversion=1.0.3 -Dpackaging=jar -Dfile=/path/to/file -Durl=[url] -DrepositoryId=[id]
     [exec]   Path to dependency: 
     [exec]   	1) org.apache.maven.its.mng0768:test:jar:1.0-SNAPSHOT
     [exec]   	2) org.apache.maven.its.it0069:it:jar:1.0.3
     [exec] ----------
     [exec] 1 required artifact is missing.
     [exec] for artifact: 
     [exec]   org.apache.maven.its.mng0768:test:jar:1.0-SNAPSHOT
     [exec] from the specified remote repositories:
     [exec]   maven-core-it (file:////tmp/maven-integration-tests-2.0.x/core-it-suite/target/test-classes/mng-0768/repo),
     [exec]   Nexus (http://repository.sonatype.org:8081/content/groups/public)
     [exec] 	at org.apache.maven.artifact.resolver.DefaultArtifactResolver.resolveTransitively(DefaultArtifactResolver.java:324)
     [exec] 	at org.apache.maven.artifact.resolver.DefaultArtifactResolver.resolveTransitively(DefaultArtifactResolver.java:288)
     [exec] 	at org.apache.maven.plugin.DefaultPluginManager.resolveTransitiveDependencies(DefaultPluginManager.java:1417)
     [exec] 	at org.apache.maven.plugin.DefaultPluginManager.executeMojo(DefaultPluginManager.java:407)
     [exec] 	at org.apache.maven.lifecycle.DefaultLifecycleExecutor.executeGoals(DefaultLifecycleExecutor.java:559)
     [exec] 	... 16 more
     [exec] [INFO] ------------------------------------------------------------------------
     [exec] [INFO] Total time: < 1 second
     [exec] [INFO] Finished at: Fri Feb 06 20:34:26 GMT-06:00 2009
     [exec] [INFO] Final Memory: 1M/3M
     [exec] [INFO] ------------------------------------------------------------------------
     [exec] 	at org.apache.maven.it.Verifier.executeGoals(Verifier.java:1274)
     [exec] 	at org.apache.maven.it.Verifier.executeGoal(Verifier.java:1126)
     [exec] 	at org.apache.maven.it.Verifier.executeGoal(Verifier.java:1120)
     [exec] 	at org.apache.maven.it.MavenITmng0768OfflineModeTest.testitMNG768(MavenITmng0768OfflineModeTest.java:70)
     [exec] 	at org.apache.maven.it.MavenITmng0768OfflineModeTest.testitMNG768(MavenITmng0768OfflineModeTest.java:70)
     [exec] 	at sun.reflect.NativeMethodAccessorImpl.invoke0(Native Method)
     [exec] 	at sun.reflect.NativeMethodAccessorImpl.invoke(NativeMethodAccessorImpl.java:39)
     [exec] 	at sun.reflect.DelegatingMethodAccessorImpl.invoke(DelegatingMethodAccessorImpl.java:25)
     [exec] 	at java.lang.reflect.Method.invoke(Method.java:324)
     [exec] 	at junit.framework.TestCase.runTest(TestCase.java:164)
     [exec] 	at org.apache.maven.it.AbstractMavenIntegrationTestCase.runTest(AbstractMavenIntegrationTestCase.java:178)
     [exec] 	at junit.framework.TestCase.runBare(TestCase.java:130)
     [exec] 	at junit.framework.TestResult$1.protect(TestResult.java:106)
     [exec] 	at junit.framework.TestResult.runProtected(TestResult.java:124)
     [exec] 	at junit.framework.TestResult.run(TestResult.java:109)
     [exec] 	at junit.framework.TestCase.run(TestCase.java:120)
     [exec] 	at junit.framework.TestSuite.runTest(TestSuite.java:230)
     [exec] 	at junit.framework.TestSuite.run(TestSuite.java:225)
     [exec] 	at junit.framework.TestSuite.runTest(TestSuite.java:230)
     [exec] 	at junit.framework.TestSuite.run(TestSuite.java:225)
     [exec] 	at sun.reflect.NativeMethodAccessorImpl.invoke0(Native Method)
     [exec] 	at sun.reflect.NativeMethodAccessorImpl.invoke(NativeMethodAccessorImpl.java:39)
     [exec] 	at sun.reflect.DelegatingMethodAccessorImpl.invoke(DelegatingMethodAccessorImpl.java:25)
     [exec] 	at java.lang.reflect.Method.invoke(Method.java:324)
     [exec] 	at org.apache.maven.surefire.junit.JUnitTestSet.execute(JUnitTestSet.java:213)
     [exec] 	at org.apache.maven.surefire.suite.AbstractDirectoryTestSuite.executeTestSet(AbstractDirectoryTestSuite.java:138)
     [exec] 	at org.apache.maven.surefire.suite.AbstractDirectoryTestSuite.execute(AbstractDirectoryTestSuite.java:125)
     [exec] 	at org.apache.maven.surefire.Surefire.run(Surefire.java:132)
     [exec] 	at sun.reflect.NativeMethodAccessorImpl.invoke0(Native Method)
     [exec] 	at sun.reflect.NativeMethodAccessorImpl.invoke(NativeMethodAccessorImpl.java:39)
     [exec] 	at sun.reflect.DelegatingMethodAccessorImpl.invoke(DelegatingMethodAccessorImpl.java:25)
     [exec] 	at java.lang.reflect.Method.invoke(Method.java:324)
     [exec] 	at org.apache.maven.surefire.booter.SurefireBooter.runSuitesInProcess(SurefireBooter.java:290)
     [exec] 	at org.apache.maven.surefire.booter.SurefireBooter.run(SurefireBooter.java:198)
     [exec] 	at org.apache.maven.plugin.surefire.SurefirePlugin.execute(SurefirePlugin.java:398)
     [exec] 	at org.apache.maven.plugin.DefaultPluginManager.executeMojo(DefaultPluginManager.java:453)
     [exec] 	at org.apache.maven.lifecycle.DefaultLifecycleExecutor.executeGoals(DefaultLifecycleExecutor.java:559)
     [exec] 	at org.apache.maven.lifecycle.DefaultLifecycleExecutor.executeGoalWithLifecycle(DefaultLifecycleExecutor.java:500)
     [exec] 	at org.apache.maven.lifecycle.DefaultLifecycleExecutor.executeGoal(DefaultLifecycleExecutor.java:479)
     [exec] 	at org.apache.maven.lifecycle.DefaultLifecycleExecutor.executeGoalAndHandleFailures(DefaultLifecycleExecutor.java:331)
     [exec] 	at org.apache.maven.lifecycle.DefaultLifecycleExecutor.executeTaskSegments(DefaultLifecycleExecutor.java:292)
     [exec] 	at org.apache.maven.lifecycle.DefaultLifecycleExecutor.execute(DefaultLifecycleExecutor.java:142)
     [exec] 	at org.apache.maven.DefaultMaven.doExecute(DefaultMaven.java:336)
     [exec] 	at org.apache.maven.DefaultMaven.execute(DefaultMaven.java:129)
     [exec] 	at org.apache.maven.cli.MavenCli.main(MavenCli.java:296)
     [exec] 	at sun.reflect.NativeMethodAccessorImpl.invoke0(Native Method)
     [exec] 	at sun.reflect.NativeMethodAccessorImpl.invoke(NativeMethodAccessorImpl.java:39)
     [exec] 	at sun.reflect.DelegatingMethodAccessorImpl.invoke(DelegatingMethodAccessorImpl.java:25)
     [exec] 	at java.lang.reflect.Method.invoke(Method.java:324)
     [exec] 	at org.codehaus.classworlds.Launcher.launchEnhanced(Launcher.java:315)
     [exec] 	at org.codehaus.classworlds.Launcher.launch(Launcher.java:255)
     [exec] 	at org.codehaus.classworlds.Launcher.mainWithExitCode(Launcher.java:430)
     [exec] 	at org.codehaus.classworlds.Launcher.main(Launcher.java:375)
     [exec] 
     [exec] 
     [exec] Results :
     [exec] 
     [exec] Tests in error: 
     [exec]   testDependencyUnresolvable(org.apache.maven.it.MavenITmng2883LegacyRepoOfflineTest)
     [exec]   testitMNG768(org.apache.maven.it.MavenITmng0768OfflineModeTest)
     [exec] 
     [exec] Tests run: 314, Failures: 0, Errors: 2, Skipped: 0
     [exec] 
     [exec] [INFO] ------------------------------------------------------------------------
     [exec] [ERROR] BUILD FAILURE
     [exec] [INFO] ------------------------------------------------------------------------
     [exec] [INFO] There are test failures.
     [exec] [INFO] ------------------------------------------------------------------------
     [exec] [INFO] For more information, run Maven with the -e switch
     [exec] [INFO] ------------------------------------------------------------------------
     [exec] [INFO] Total time: 17 minutes 42 seconds
     [exec] [INFO] Finished at: Fri Feb 06 20:36:58 GMT-06:00 2009
     [exec] [INFO] Final Memory: 31M/75M
     [exec] [INFO] ------------------------------------------------------------------------

BUILD FAILED
/home/hudson/workspace/Maven-2.0.x-with-bootstrap/jdk/1.4/label/ubuntu/maven-2.0.x/build.xml:271:
exec returned: 1

Total time: 20 minutes 10 seconds


Mime
View raw message