maven-notifications mailing list archives

Site index · List index
Message view « Date » · « Thread »
Top « Date » · « Thread »
From Hudson <Hud...@sonatype.org>
Subject Build failed in Hudson: Maven-2.0.10-RC-bootstrap » 1.4,ubuntu #59
Date Sun, 01 Feb 2009 06:17:28 GMT
See http://grid.sonatype.org/ci/job/Maven-2.0.10-RC-bootstrap/./jdk=1.4,label=ubuntu/59/changes

Changes:

[Brian Fox] [maven-release-plugin] prepare for next development iteration

[Brian Fox] [maven-release-plugin] prepare release maven-2.0.10-RC8

------------------------------------------
[...truncated 412 lines...]
     [java] 17K downloaded
     [java] Downloading: http://repository.sonatype.org:8081/content/groups/public/org/codehaus/modello/modello-maven-plugin/1.0-alpha-22/modello-maven-plugin-1.0-alpha-22.jar
     [java] 15K downloaded
     [java] [INFO] [clean:clean]
     [java] [INFO] Deleting directory /home/hudson/workspace/Maven-2.0.10-RC-bootstrap/jdk/1.4/label/ubuntu/maven-2.0.10-RC/maven-repository-metadata/target
     [java] [INFO] Deleting directory /home/hudson/workspace/Maven-2.0.10-RC-bootstrap/jdk/1.4/label/ubuntu/maven-2.0.10-RC/maven-repository-metadata/target/classes
     [java] [INFO] Deleting directory /home/hudson/workspace/Maven-2.0.10-RC-bootstrap/jdk/1.4/label/ubuntu/maven-2.0.10-RC/maven-repository-metadata/target/test-classes
     [java] [INFO] Deleting directory /home/hudson/workspace/Maven-2.0.10-RC-bootstrap/jdk/1.4/label/ubuntu/maven-2.0.10-RC/maven-repository-metadata/target/site
     [java] Downloading: http://repository.sonatype.org:8081/content/groups/public/org/codehaus/modello/modello-core/1.0-alpha-22/modello-core-1.0-alpha-22.pom
     [java] 1K downloaded
     [java] Downloading: http://repository.sonatype.org:8081/content/groups/public/org/codehaus/modello/modello-plugin-converters/1.0-alpha-22/modello-plugin-converters-1.0-alpha-22.pom
     [java] 1K downloaded
     [java] Downloading: http://repository.sonatype.org:8081/content/groups/public/org/codehaus/modello/modello-plugins/1.0-alpha-22/modello-plugins-1.0-alpha-22.pom
     [java] 1K downloaded
     [java] Downloading: http://repository.sonatype.org:8081/content/groups/public/org/codehaus/modello/modello-plugin-dom4j/1.0-alpha-22/modello-plugin-dom4j-1.0-alpha-22.pom
     [java] 1K downloaded
     [java] Downloading: http://repository.sonatype.org:8081/content/groups/public/org/codehaus/modello/modello-plugin-xml/1.0-alpha-22/modello-plugin-xml-1.0-alpha-22.pom
     [java] 516b downloaded
     [java] Downloading: http://repository.sonatype.org:8081/content/groups/public/org/codehaus/modello/modello-plugin-jdom/1.0-alpha-22/modello-plugin-jdom-1.0-alpha-22.pom
     [java] 810b downloaded
     [java] Downloading: http://repository.sonatype.org:8081/content/groups/public/org/codehaus/modello/modello-plugin-stax/1.0-alpha-22/modello-plugin-stax-1.0-alpha-22.pom
     [java] 2K downloaded
     [java] Downloading: http://repository.sonatype.org:8081/content/groups/public/org/codehaus/modello/modello-plugin-xdoc/1.0-alpha-22/modello-plugin-xdoc-1.0-alpha-22.pom
     [java] 685b downloaded
     [java] Downloading: http://repository.sonatype.org:8081/content/groups/public/org/codehaus/modello/modello-plugin-xpp3/1.0-alpha-22/modello-plugin-xpp3-1.0-alpha-22.pom
     [java] 1K downloaded
     [java] Downloading: http://repository.sonatype.org:8081/content/groups/public/org/codehaus/modello/modello-plugin-xsd/1.0-alpha-22/modello-plugin-xsd-1.0-alpha-22.pom
     [java] 1K downloaded
     [java] Downloading: http://repository.sonatype.org:8081/content/groups/public/org/codehaus/modello/modello-core/1.0-alpha-22/modello-core-1.0-alpha-22.jar
     [java] 119K downloaded
     [java] Downloading: http://repository.sonatype.org:8081/content/groups/public/org/codehaus/modello/modello-plugin-converters/1.0-alpha-22/modello-plugin-converters-1.0-alpha-22.jar
     [java] 9K downloaded
     [java] Downloading: http://repository.sonatype.org:8081/content/groups/public/org/codehaus/modello/modello-plugin-dom4j/1.0-alpha-22/modello-plugin-dom4j-1.0-alpha-22.jar
     [java] 17K downloaded
     [java] Downloading: http://repository.sonatype.org:8081/content/groups/public/org/codehaus/modello/modello-plugin-xml/1.0-alpha-22/modello-plugin-xml-1.0-alpha-22.jar
     [java] 9K downloaded
     [java] Downloading: http://repository.sonatype.org:8081/content/groups/public/org/codehaus/modello/modello-plugin-jdom/1.0-alpha-22/modello-plugin-jdom-1.0-alpha-22.jar
     [java] 13K downloaded
     [java] Downloading: http://repository.sonatype.org:8081/content/groups/public/org/codehaus/modello/modello-plugin-stax/1.0-alpha-22/modello-plugin-stax-1.0-alpha-22.jar
     [java] 29K downloaded
     [java] Downloading: http://repository.sonatype.org:8081/content/groups/public/org/codehaus/modello/modello-plugin-xdoc/1.0-alpha-22/modello-plugin-xdoc-1.0-alpha-22.jar
     [java] 7K downloaded
     [java] Downloading: http://repository.sonatype.org:8081/content/groups/public/org/codehaus/modello/modello-plugin-xpp3/1.0-alpha-22/modello-plugin-xpp3-1.0-alpha-22.jar
     [java] 22K downloaded
     [java] Downloading: http://repository.sonatype.org:8081/content/groups/public/org/codehaus/modello/modello-plugin-xsd/1.0-alpha-22/modello-plugin-xsd-1.0-alpha-22.jar
     [java] 13K downloaded
     [java] [INFO] [modello:java {execution: standard}]
     [java] [INFO] outputDirectory: /home/hudson/workspace/Maven-2.0.10-RC-bootstrap/jdk/1.4/label/ubuntu/maven-2.0.10-RC/maven-repository-metadata/target/generated-sources/modello
     [java] [INFO] Working on model: src/main/mdo/metadata.mdo
     [java] [INFO] Generating current version: 1.0.0
     [java] [INFO] [modello:xpp3-reader {execution: standard}]
     [java] [INFO] outputDirectory: /home/hudson/workspace/Maven-2.0.10-RC-bootstrap/jdk/1.4/label/ubuntu/maven-2.0.10-RC/maven-repository-metadata/target/generated-sources/modello
     [java] [INFO] Working on model: src/main/mdo/metadata.mdo
     [java] [INFO] Generating current version: 1.0.0
     [java] [INFO] [modello:xpp3-writer {execution: standard}]
     [java] [INFO] outputDirectory: /home/hudson/workspace/Maven-2.0.10-RC-bootstrap/jdk/1.4/label/ubuntu/maven-2.0.10-RC/maven-repository-metadata/target/generated-sources/modello
     [java] [INFO] Working on model: src/main/mdo/metadata.mdo
     [java] [INFO] Generating current version: 1.0.0
     [java] [INFO] [remote-resources:process {execution: default}]
     [java] [INFO] [resources:resources]
     [java] [INFO] Using encoding: 'UTF-8' to copy filtered resources.
     [java] [INFO] [compiler:compile]
     [java] [INFO] Compiling 6 source files to /home/hudson/workspace/Maven-2.0.10-RC-bootstrap/jdk/1.4/label/ubuntu/maven-2.0.10-RC/maven-repository-metadata/target/classes
     [java] [INFO] [resources:testResources]
     [java] [INFO] Using encoding: 'UTF-8' to copy filtered resources.
     [java] [INFO] [compiler:testCompile]
     [java] [INFO] No sources to compile
     [java] [INFO] [surefire:test]
     [java] [INFO] Surefire report directory: /home/hudson/workspace/Maven-2.0.10-RC-bootstrap/jdk/1.4/label/ubuntu/maven-2.0.10-RC/maven-repository-metadata/target/surefire-reports
     [java] 
     [java] -------------------------------------------------------
     [java]  T E S T S
     [java] -------------------------------------------------------
     [java] There are no tests to run.
     [java] 
     [java] Results :
     [java] 
     [java] Tests run: 0, Failures: 0, Errors: 0, Skipped: 0
     [java] 
     [java] [INFO] [jar:jar]
     [java] [INFO] Building jar: /home/hudson/workspace/Maven-2.0.10-RC-bootstrap/jdk/1.4/label/ubuntu/maven-2.0.10-RC/maven-repository-metadata/target/maven-repository-metadata-2.0.10-RC9-SNAPSHOT.jar
     [java] [INFO] [install:install]
     [java] [INFO] Installing /home/hudson/workspace/Maven-2.0.10-RC-bootstrap/jdk/1.4/label/ubuntu/maven-2.0.10-RC/maven-repository-metadata/target/maven-repository-metadata-2.0.10-RC9-SNAPSHOT.jar
to /opt/repos/local-repository/org/apache/maven/maven-repository-metadata/2.0.10-RC9-SNAPSHOT/maven-repository-metadata-2.0.10-RC9-SNAPSHOT.jar
     [java] [INFO] ------------------------------------------------------------------------
     [java] [INFO] Building Maven Artifact Manager
     [java] [INFO]    task-segment: [clean, install]
     [java] [INFO] ------------------------------------------------------------------------
     [java] [INFO] [clean:clean]
     [java] [INFO] Deleting directory /home/hudson/workspace/Maven-2.0.10-RC-bootstrap/jdk/1.4/label/ubuntu/maven-2.0.10-RC/maven-artifact-manager/target
     [java] [INFO] Deleting directory /home/hudson/workspace/Maven-2.0.10-RC-bootstrap/jdk/1.4/label/ubuntu/maven-2.0.10-RC/maven-artifact-manager/target/classes
     [java] [INFO] Deleting directory /home/hudson/workspace/Maven-2.0.10-RC-bootstrap/jdk/1.4/label/ubuntu/maven-2.0.10-RC/maven-artifact-manager/target/test-classes
     [java] [INFO] Deleting directory /home/hudson/workspace/Maven-2.0.10-RC-bootstrap/jdk/1.4/label/ubuntu/maven-2.0.10-RC/maven-artifact-manager/target/site
     [java] Downloading: http://repository.sonatype.org:8081/content/groups/public/org/apache/maven/maven-repository-metadata/2.0.10-RC8/maven-repository-metadata-2.0.10-RC8.pom
     [java] Downloading: http://repository.sonatype.org:8081/content/groups/public/org/apache/maven/maven-artifact/2.0.10-RC8/maven-artifact-2.0.10-RC8.pom
     [java] Downloading: http://repository.sonatype.org:8081/content/groups/public/org/apache/maven/maven-repository-metadata/2.0.10-RC8/maven-repository-metadata-2.0.10-RC8.jar
     [java] Downloading: http://repository.sonatype.org:8081/content/groups/public/org/apache/maven/maven-artifact/2.0.10-RC8/maven-artifact-2.0.10-RC8.jar
     [java] [INFO] ------------------------------------------------------------------------
     [java] [ERROR] BUILD ERROR
     [java] [INFO] ------------------------------------------------------------------------
     [java] [INFO] Failed to resolve artifact.
     [java] 
     [java] Missing:
     [java] ----------
     [java] 1) org.apache.maven:maven-repository-metadata:jar:2.0.10-RC8
     [java] 
     [java]   Try downloading the file manually from the project website.
     [java] 
     [java]   Then, install it using the command: 
     [java]       mvn install:install-file -DgroupId=org.apache.maven -DartifactId=maven-repository-metadata
-Dversion=2.0.10-RC8 -Dpackaging=jar -Dfile=/path/to/file
     [java] 
     [java]   Alternatively, if you host your own repository you can deploy the file there:

     [java]       mvn deploy:deploy-file -DgroupId=org.apache.maven -DartifactId=maven-repository-metadata
-Dversion=2.0.10-RC8 -Dpackaging=jar -Dfile=/path/to/file -Durl=[url] -DrepositoryId=[id]
     [java] 
     [java]   Path to dependency: 
     [java]   	1) org.apache.maven:maven-artifact-manager:jar:2.0.10-RC9-SNAPSHOT
     [java]   	2) org.apache.maven:maven-repository-metadata:jar:2.0.10-RC8
     [java] 
     [java] 2) org.apache.maven:maven-artifact:jar:2.0.10-RC8
     [java] 
     [java]   Try downloading the file manually from the project website.
     [java] 
     [java]   Then, install it using the command: 
     [java]       mvn install:install-file -DgroupId=org.apache.maven -DartifactId=maven-artifact
-Dversion=2.0.10-RC8 -Dpackaging=jar -Dfile=/path/to/file
     [java] 
     [java]   Alternatively, if you host your own repository you can deploy the file there:

     [java]       mvn deploy:deploy-file -DgroupId=org.apache.maven -DartifactId=maven-artifact
-Dversion=2.0.10-RC8 -Dpackaging=jar -Dfile=/path/to/file -Durl=[url] -DrepositoryId=[id]
     [java] 
     [java]   Path to dependency: 
     [java]   	1) org.apache.maven:maven-artifact-manager:jar:2.0.10-RC9-SNAPSHOT
     [java]   	2) org.apache.maven:maven-artifact:jar:2.0.10-RC8
     [java] 
     [java] ----------
     [java] 2 required artifacts are missing.
     [java] 
     [java] for artifact: 
     [java]   org.apache.maven:maven-artifact-manager:jar:2.0.10-RC9-SNAPSHOT
     [java] 
     [java] from the specified remote repositories:
     [java]   Nexus (http://repository.sonatype.org:8081/content/groups/public)
     [java] 
     [java] 
     [java] 
     [java] [INFO] ------------------------------------------------------------------------
     [java] [INFO] Trace
     [java] org.apache.maven.lifecycle.LifecycleExecutionException: Missing:
     [java] ----------
     [java] 1) org.apache.maven:maven-repository-metadata:jar:2.0.10-RC8
     [java] 
     [java]   Try downloading the file manually from the project website.
     [java] 
     [java]   Then, install it using the command: 
     [java]       mvn install:install-file -DgroupId=org.apache.maven -DartifactId=maven-repository-metadata
-Dversion=2.0.10-RC8 -Dpackaging=jar -Dfile=/path/to/file
     [java] 
     [java]   Alternatively, if you host your own repository you can deploy the file there:

     [java]       mvn deploy:deploy-file -DgroupId=org.apache.maven -DartifactId=maven-repository-metadata
-Dversion=2.0.10-RC8 -Dpackaging=jar -Dfile=/path/to/file -Durl=[url] -DrepositoryId=[id]
     [java] 
     [java]   Path to dependency: 
     [java]   	1) org.apache.maven:maven-artifact-manager:jar:2.0.10-RC9-SNAPSHOT
     [java]   	2) org.apache.maven:maven-repository-metadata:jar:2.0.10-RC8
     [java] 
     [java] 2) org.apache.maven:maven-artifact:jar:2.0.10-RC8
     [java] 
     [java]   Try downloading the file manually from the project website.
     [java] 
     [java]   Then, install it using the command: 
     [java]       mvn install:install-file -DgroupId=org.apache.maven -DartifactId=maven-artifact
-Dversion=2.0.10-RC8 -Dpackaging=jar -Dfile=/path/to/file
     [java] 
     [java]   Alternatively, if you host your own repository you can deploy the file there:

     [java]       mvn deploy:deploy-file -DgroupId=org.apache.maven -DartifactId=maven-artifact
-Dversion=2.0.10-RC8 -Dpackaging=jar -Dfile=/path/to/file -Durl=[url] -DrepositoryId=[id]
     [java] 
     [java]   Path to dependency: 
     [java]   	1) org.apache.maven:maven-artifact-manager:jar:2.0.10-RC9-SNAPSHOT
     [java]   	2) org.apache.maven:maven-artifact:jar:2.0.10-RC8
     [java] 
     [java] ----------
     [java] 2 required artifacts are missing.
     [java] 
     [java] for artifact: 
     [java]   org.apache.maven:maven-artifact-manager:jar:2.0.10-RC9-SNAPSHOT
     [java] 
     [java] from the specified remote repositories:
     [java]   Nexus (http://repository.sonatype.org:8081/content/groups/public)
     [java] 
     [java] 
     [java] 	at org.apache.maven.lifecycle.DefaultLifecycleExecutor.executeGoals(Unknown Source)
     [java] 	at org.apache.maven.lifecycle.DefaultLifecycleExecutor.executeGoalWithLifecycle(Unknown
Source)
     [java] 	at org.apache.maven.lifecycle.DefaultLifecycleExecutor.executeGoal(Unknown Source)
     [java] 	at org.apache.maven.lifecycle.DefaultLifecycleExecutor.executeGoalAndHandleFailures(Unknown
Source)
     [java] 	at org.apache.maven.lifecycle.DefaultLifecycleExecutor.executeTaskSegments(Unknown
Source)
     [java] 	at org.apache.maven.lifecycle.DefaultLifecycleExecutor.execute(Unknown Source)
     [java] 	at org.apache.maven.DefaultMaven.doExecute(Unknown Source)
     [java] 	at org.apache.maven.DefaultMaven.execute(Unknown Source)
     [java] 	at org.apache.maven.cli.MavenCli.main(Unknown Source)
     [java] 	at org.apache.maven.cli.MavenCli.main(Unknown Source)
     [java] Caused by: org.apache.maven.artifact.resolver.MultipleArtifactsNotFoundException:
Missing:
     [java] ----------
     [java] 1) org.apache.maven:maven-repository-metadata:jar:2.0.10-RC8
     [java] 
     [java]   Try downloading the file manually from the project website.
     [java] 
     [java]   Then, install it using the command: 
     [java]       mvn install:install-file -DgroupId=org.apache.maven -DartifactId=maven-repository-metadata
-Dversion=2.0.10-RC8 -Dpackaging=jar -Dfile=/path/to/file
     [java] 
     [java]   Alternatively, if you host your own repository you can deploy the file there:

     [java]       mvn deploy:deploy-file -DgroupId=org.apache.maven -DartifactId=maven-repository-metadata
-Dversion=2.0.10-RC8 -Dpackaging=jar -Dfile=/path/to/file -Durl=[url] -DrepositoryId=[id]
     [java] 
     [java]   Path to dependency: 
     [java]   	1) org.apache.maven:maven-artifact-manager:jar:2.0.10-RC9-SNAPSHOT
     [java]   	2) org.apache.maven:maven-repository-metadata:jar:2.0.10-RC8
     [java] 
     [java] 2) org.apache.maven:maven-artifact:jar:2.0.10-RC8
     [java] 
     [java]   Try downloading the file manually from the project website.
     [java] 
     [java]   Then, install it using the command: 
     [java]       mvn install:install-file -DgroupId=org.apache.maven -DartifactId=maven-artifact
-Dversion=2.0.10-RC8 -Dpackaging=jar -Dfile=/path/to/file
     [java] 
     [java]   Alternatively, if you host your own repository you can deploy the file there:

     [java]       mvn deploy:deploy-file -DgroupId=org.apache.maven -DartifactId=maven-artifact
-Dversion=2.0.10-RC8 -Dpackaging=jar -Dfile=/path/to/file -Durl=[url] -DrepositoryId=[id]
     [java] 
     [java]   Path to dependency: 
     [java]   	1) org.apache.maven:maven-artifact-manager:jar:2.0.10-RC9-SNAPSHOT
     [java]   	2) org.apache.maven:maven-artifact:jar:2.0.10-RC8
     [java] 
     [java] ----------
     [java] 2 required artifacts are missing.
     [java] 
     [java] for artifact: 
     [java]   org.apache.maven:maven-artifact-manager:jar:2.0.10-RC9-SNAPSHOT
     [java] 
     [java] from the specified remote repositories:
     [java]   Nexus (http://repository.sonatype.org:8081/content/groups/public)
     [java] 
     [java] 
     [java] 	at org.apache.maven.artifact.resolver.DefaultArtifactResolver.resolveTransitively(Unknown
Source)
     [java] 	at org.apache.maven.artifact.resolver.DefaultArtifactResolver.resolveTransitively(Unknown
Source)
     [java] 	at org.apache.maven.plugin.DefaultPluginManager.resolveTransitiveDependencies(Unknown
Source)
     [java] 	at org.apache.maven.plugin.DefaultPluginManager.executeMojo(Unknown Source)
     [java] 	... 10 more
     [java] [INFO] ------------------------------------------------------------------------
     [java] [INFO] Total time: 20 seconds
     [java] [INFO] Finished at: Sun Feb 01 00:17:28 GMT-06:00 2009
     [java] [INFO] Final Memory: 17M/34M
     [java] [INFO] ------------------------------------------------------------------------

BUILD FAILED
/home/hudson/workspace/Maven-2.0.10-RC-bootstrap/jdk/1.4/label/ubuntu/maven-2.0.10-RC/build.xml:159:
Java returned: 1

Total time: 41 seconds


Mime
View raw message