maven-notifications mailing list archives

Site index · List index
Message view « Date » · « Thread »
Top « Date » · « Thread »
From Hudson <Hud...@sonatype.org>
Subject Build failed in Hudson: Maven-2.0.x-with-bootstrap » 1.4,windows #79
Date Fri, 06 Feb 2009 14:44:09 GMT
See http://grid.sonatype.org/ci/job/Maven-2.0.x-with-bootstrap/./jdk=1.4,label=windows/79/changes

Changes:

[brett] [MNG-3719] restore POM ordering of plugin executions declared in separate plugin elements
Submitted by: Torben S. Giesselmann
Merged from: r741518

[brett] [MNG-3808] Execution order of report plugins is arbitrary if inheritance is involved
Merged from: r741507
Submitted by: Carlos Sanchez

------------------------------------------
[...truncated 3605 lines...]
     [exec] mng0773SettingsProfileReactorPollution(itMNG773)............OK (1.1 s)
     [exec] mng0768OfflineMode(itMNG768)................................OK (7.9 s)
     [exec] mng0761MissingSnapshotDistRepo(itMNG761)....................OK (2.5 s)
     [exec] mng0731LegacyRepoLayout(itMNG731)...........................OK (2.6 s)
     [exec] mng0680ParentBasedir(itMNG680)..............................OK (2.2 s)
     [exec] mng0674PluginParameterAlias(itMNG674).......................OK (2.9 s)
     [exec] mng0666IgnoreLegacyPom(itMNG666)............................OK (1.8 s)
     [exec] mng0557UserSettingsCliOption(itMNG557)......................OK (2.0 s)
     [exec] mng0553SettingsAuthzEncryption(it0553)......................SKIPPED - version
2.0.11-SNAPSHOT not in range (2.1.0-M1,3.0-alpha-1)
     [exec] mng0522PluginMgmtConfig(itMNG522)...........................OK (2.8 s)
     [exec] mng0507ArtifactRelocation(itMNG507).........................OK (2.8 s)
     [exec] mng0505VersionRange(itMNG505)...............................OK (2.4 s)
     [exec] mng0496IgnoreUnknownPluginParameters(itMNG496)..............OK (3.0 s)
     [exec] mng0479OverrideCentralRepo(itMNG479)........................OK (5.2 s)
     [exec] mng0471CustomLifecycle(itMNG471)............................OK (4.4 s)
     [exec] mng0469ReportConfig(itReportConfigOverridesBuildDefaults)...OK (2.2 s)
     [exec] mng0469ReportConfig(itBuildConfigDominantDuringBuild).......OK (2.4 s)
     [exec] mng0469ReportConfig(itBuildConfigIrrelevantForReports)......OK (3.2 s)
     [exec] mng0377PluginLookupFromPrefix(itMNG377).....................OK (3.4 s)
     [exec] mng0294MergeGlobalAndUserSettings(itMNG294).................OK (3.3 s)
     [exec] mng0282NonReactorExecWhenProjectIndependent(itMNG282).......OK (1.8 s)
     [exec] mng0249ResolveDepsFromReactor(itMNG0249)....................OK (3.1 s)
     [exec] mng0095ReactorFailureBehavior(itFailFast)...................OK (3.2 s)
     [exec] mng0095ReactorFailureBehavior(itFailNever)..................OK (3.6 s)
     [exec] mng0095ReactorFailureBehavior(itFailAtEnd)..................OK (3.4 s)
     [exec] 0144LifecycleExecutionOrder(it0144).........................OK (5.7 s)
     [exec] 0143TransitiveDependencyScopes(itCompileScope)..............OK (1.8 s)
     [exec] 0143TransitiveDependencyScopes(itProvidedScope).............OK (1.9 s)
     [exec] 0143TransitiveDependencyScopes(itRuntimeScope)..............OK (1.8 s)
     [exec] 0143TransitiveDependencyScopes(itTestScope).................OK (1.9 s)
     [exec] 0142DirectDependencyScopes(it0142)..........................OK (1.9 s)
     [exec] 0140(it0140)................................................OK (2.2 s)
     [exec] 0139(it0139)................................................OK (2.1 s)
     [exec] 0138PluginLifecycle(it0138).................................OK (3.7 s)
     [exec] 0137EarLifecycle(it0137)....................................OK (5.0 s)
     [exec] 0136RarLifecycle(it0136)....................................OK (5.9 s)
     [exec] 0135EjbLifecycle(it0135)....................................OK (5.1 s)
     [exec] 0134WarLifecycle(it0134)....................................OK (5.5 s)
     [exec] 0133JarLifecycle(it0133)....................................OK (4.1 s)
     [exec] 0132PomLifecycle(it0132)....................................OK (4.2 s)
     [exec] 0131SiteLifecycle(it0131)...................................OK (2.5 s)
     [exec] 0130CleanLifecycle(it0130)..................................OK (2.8 s)
     [exec] 0113ServerAuthzAvailableToWagonMgrInPlugin(it0113)..........OK (2.5 s)
     [exec] 0090(it0090)................................................OK (2.4 s)
     [exec] 0087(it0087)................................................OK (3.3 s)
     [exec] 0086(it0086)................................................OK (3.9 s)
     [exec] 0085(it0085)................................................OK (3.0 s)
     [exec] 0072(it0072)................................................OK (2.2 s)
     [exec] 0071(it0071)................................................OK (2.6 s)
     [exec] 0064(it0064)................................................OK (2.6 s)
     [exec] 0063(it0063)................................................OK (3.2 s)
     [exec] 0056(it0056)................................................OK (3.0 s)
     [exec] 0052(it0052)................................................OK (5.3 s)
     [exec] 0051(it0051)................................................OK (4.9 s)
     [exec] 0041(it0041)................................................OK (2.2 s)
     [exec] 0040(it0040)................................................OK (1.9 s)
     [exec] 0039(it0039)................................................OK (1.8 s)
     [exec] 0038(it0038)................................................OK (2.2 s)
     [exec] 0037(it0037)................................................OK (1.7 s)
     [exec] 0036(it0036)................................................OK (1.6 s)
     [exec] 0032(it0032)................................................OK (1.2 s)
     [exec] 0030(it0030)................................................OK (8.8 s)
     [exec] 0025(it0025)................................................OK (2.1 s)
     [exec] 0024(it0024)................................................OK (1.8 s)
     [exec] 0023(it0023)................................................OK (1.8 s)
     [exec] 0021(it0021)................................................OK (2.0 s)
     [exec] 0019(it0019)................................................OK (3.0 s)
     [exec] 0018(it0018)................................................OK (3.1 s)
     [exec] 0012(it0012)................................................OK (2.0 s)
     [exec] 0011(it0011)................................................OK (2.0 s)
     [exec] 0010(it0010)................................................OK (2.0 s)
     [exec] 0009(it0009)................................................OK (1.9 s)
     [exec] 0008(it0008)................................................OK (2.2 s)
     [exec] 0007(it0007)................................................OK (1.2 s)
     [exec] Tests run: 313, Failures: 0, Errors: 1, Skipped: 0, Time elapsed: 1,017.683 sec
<<< FAILURE!
     [exec] testitMNG3805(org.apache.maven.it.MavenITmng3805ExtensionClassPathOrderingTest)
 Time elapsed: 2.662 sec  <<< ERROR!
     [exec] org.apache.maven.it.VerificationException: Exit code was non-zero: 1; command
line and log = 
     [exec] C:\tmp\apache-maven-2.0.11-SNAPSHOT\bin\mvn -e --batch-mode -Dmaven.repo.local=C:\opt\repos\local-repository
validate
     [exec] + Error stacktraces are turned on.
     [exec] [INFO] Scanning for projects...
     [exec] Downloading: http://repository.sonatype.org:8081/content/groups/public/org/apache/maven/its/mng3805/wagon-a/0.1/wagon-a-0.1.pom
     [exec] Downloading: file:///C:\tmp\maven-integration-tests-2.0.x\core-it-suite\target\test-classes\mng-3805/repo/org/apache/maven/its/mng3805/wagon-a/0.1/wagon-a-0.1.pom
     [exec] 2K downloaded
     [exec] Downloading: http://repository.sonatype.org:8081/content/groups/public/org/apache/maven/its/mng3805/dep-a/0.1/dep-a-0.1.pom
     [exec] Downloading: file:///C:\tmp\maven-integration-tests-2.0.x\core-it-suite\target\test-classes\mng-3805/repo/org/apache/maven/its/mng3805/dep-a/0.1/dep-a-0.1.pom
     [exec] 1K downloaded
     [exec] Downloading: http://repository.sonatype.org:8081/content/groups/public/org/apache/maven/its/mng3805/dep-b/0.1/dep-b-0.1.pom
     [exec] Downloading: file:///C:\tmp\maven-integration-tests-2.0.x\core-it-suite\target\test-classes\mng-3805/repo/org/apache/maven/its/mng3805/dep-b/0.1/dep-b-0.1.pom
     [exec] 1K downloaded
     [exec] Downloading: http://repository.sonatype.org:8081/content/groups/public/org/apache/maven/its/mng3805/dep-c/0.1/dep-c-0.1.pom
     [exec] Downloading: file:///C:\tmp\maven-integration-tests-2.0.x\core-it-suite\target\test-classes\mng-3805/repo/org/apache/maven/its/mng3805/dep-c/0.1/dep-c-0.1.pom
     [exec] 1K downloaded
     [exec] Downloading: http://repository.sonatype.org:8081/content/groups/public/org/apache/maven/its/mng3805/dep-d/0.1/dep-d-0.1.pom
     [exec] Downloading: file:///C:\tmp\maven-integration-tests-2.0.x\core-it-suite\target\test-classes\mng-3805/repo/org/apache/maven/its/mng3805/dep-d/0.1/dep-d-0.1.pom
     [exec] 1K downloaded
     [exec] Downloading: http://repository.sonatype.org:8081/content/groups/public/org/apache/maven/its/mng3805/wagon-a/0.1/wagon-a-0.1.jar
     [exec] Downloading: file:///C:\tmp\maven-integration-tests-2.0.x\core-it-suite\target\test-classes\mng-3805/repo/org/apache/maven/its/mng3805/wagon-a/0.1/wagon-a-0.1.jar
     [exec] 8K downloaded
     [exec] Downloading: http://repository.sonatype.org:8081/content/groups/public/org/apache/maven/its/mng3805/dep-a/0.1/dep-a-0.1.jar
     [exec] Downloading: file:///C:\tmp\maven-integration-tests-2.0.x\core-it-suite\target\test-classes\mng-3805/repo/org/apache/maven/its/mng3805/dep-a/0.1/dep-a-0.1.jar
     [exec] 4K downloaded
     [exec] Downloading: http://repository.sonatype.org:8081/content/groups/public/org/apache/maven/its/mng3805/dep-b/0.1/dep-b-0.1.jar
     [exec] Downloading: file:///C:\tmp\maven-integration-tests-2.0.x\core-it-suite\target\test-classes\mng-3805/repo/org/apache/maven/its/mng3805/dep-b/0.1/dep-b-0.1.jar
     [exec] 4K downloaded
     [exec] Downloading: http://repository.sonatype.org:8081/content/groups/public/org/apache/maven/its/mng3805/dep-c/0.1/dep-c-0.1.jar
     [exec] Downloading: file:///C:\tmp\maven-integration-tests-2.0.x\core-it-suite\target\test-classes\mng-3805/repo/org/apache/maven/its/mng3805/dep-c/0.1/dep-c-0.1.jar
     [exec] 4K downloaded
     [exec] Downloading: http://repository.sonatype.org:8081/content/groups/public/org/apache/maven/its/mng3805/dep-d/0.1/dep-d-0.1.jar
     [exec] Downloading: file:///C:\tmp\maven-integration-tests-2.0.x\core-it-suite\target\test-classes\mng-3805/repo/org/apache/maven/its/mng3805/dep-d/0.1/dep-d-0.1.jar
     [exec] 4K downloaded
     [exec] WAGON_VERSION: 1.0-beta-2
     [exec] [INFO] ------------------------------------------------------------------------
     [exec] [INFO] Building Maven Integration Test :: MNG-3805
     [exec] [INFO]    task-segment: [validate]
     [exec] [INFO] ------------------------------------------------------------------------
     [exec] [INFO] snapshot org.apache.maven.its.plugins:maven-it-plugin-uses-wagon:2.1-SNAPSHOT:
checking for updates from central
     [exec] [INFO] snapshot org.apache.maven.its.plugins:maven-it-plugin-uses-wagon:2.1-SNAPSHOT:
checking for updates from central
     [exec] [INFO] snapshot org.apache.maven.its.plugins:maven-it-plugin-uses-wagon:2.1-SNAPSHOT:
checking for updates from maven-core-it
     [exec] [INFO] snapshot org.apache.maven.its.plugins:maven-it-plugins:2.1-SNAPSHOT: checking
for updates from central
     [exec] [INFO] snapshot org.apache.maven.its.plugins:maven-it-plugins:2.1-SNAPSHOT: checking
for updates from central
     [exec] [INFO] snapshot org.apache.maven.its:core-integration-testing:2.1-SNAPSHOT: checking
for updates from central
     [exec] [INFO] snapshot org.apache.maven.its:core-integration-testing:2.1-SNAPSHOT: checking
for updates from central
     [exec] [INFO] [ituses-wagon:load-resource {execution: load-resource}]
     [exec] [INFO] [MAVEN-CORE-IT-LOG] Looking up wagon for protocol coreit
     [exec] [INFO] ------------------------------------------------------------------------
     [exec] [ERROR] BUILD ERROR
     [exec] [INFO] ------------------------------------------------------------------------
     [exec] [INFO] Failed to load wagon for protocol coreit
     [exec] 
     [exec] Embedded error: Cannot find wagon which supports the requested protocol: coreit
     [exec] Component descriptor cannot be found in the component repository: org.apache.maven.wagon.Wagoncoreit.
     [exec] [INFO] ------------------------------------------------------------------------
     [exec] [INFO] Trace
     [exec] org.apache.maven.lifecycle.LifecycleExecutionException: Failed to load wagon for
protocol coreit
     [exec] 	at org.apache.maven.lifecycle.DefaultLifecycleExecutor.executeGoals(DefaultLifecycleExecutor.java:584)
     [exec] 	at org.apache.maven.lifecycle.DefaultLifecycleExecutor.executeGoalWithLifecycle(DefaultLifecycleExecutor.java:500)
     [exec] 	at org.apache.maven.lifecycle.DefaultLifecycleExecutor.executeGoal(DefaultLifecycleExecutor.java:479)
     [exec] 	at org.apache.maven.lifecycle.DefaultLifecycleExecutor.executeGoalAndHandleFailures(DefaultLifecycleExecutor.java:331)
     [exec] 	at org.apache.maven.lifecycle.DefaultLifecycleExecutor.executeTaskSegments(DefaultLifecycleExecutor.java:292)
     [exec] 	at org.apache.maven.lifecycle.DefaultLifecycleExecutor.execute(DefaultLifecycleExecutor.java:142)
     [exec] 	at org.apache.maven.DefaultMaven.doExecute(DefaultMaven.java:336)
     [exec] 	at org.apache.maven.DefaultMaven.execute(DefaultMaven.java:129)
     [exec] 	at org.apache.maven.cli.MavenCli.main(MavenCli.java:296)
     [exec] 	at sun.reflect.NativeMethodAccessorImpl.invoke0(Native Method)
     [exec] 	at sun.reflect.NativeMethodAccessorImpl.invoke(NativeMethodAccessorImpl.java:39)
     [exec] 	at sun.reflect.DelegatingMethodAccessorImpl.invoke(DelegatingMethodAccessorImpl.java:25)
     [exec] 	at java.lang.reflect.Method.invoke(Method.java:324)
     [exec] 	at org.codehaus.classworlds.Launcher.launchEnhanced(Launcher.java:315)
     [exec] 	at org.codehaus.classworlds.Launcher.launch(Launcher.java:255)
     [exec] 	at org.codehaus.classworlds.Launcher.mainWithExitCode(Launcher.java:430)
     [exec] 	at org.codehaus.classworlds.Launcher.main(Launcher.java:375)
     [exec] Caused by: org.apache.maven.plugin.MojoExecutionException: Failed to load wagon
for protocol coreit
     [exec] 	at org.apache.maven.plugin.coreit.LoadResourceMojo.execute(LoadResourceMojo.java:99)
     [exec] 	at org.apache.maven.plugin.DefaultPluginManager.executeMojo(DefaultPluginManager.java:453)
     [exec] 	at org.apache.maven.lifecycle.DefaultLifecycleExecutor.executeGoals(DefaultLifecycleExecutor.java:559)
     [exec] 	... 16 more
     [exec] Caused by: org.apache.maven.wagon.UnsupportedProtocolException: Cannot find wagon
which supports the requested protocol: coreit
     [exec] 	at org.apache.maven.artifact.manager.DefaultWagonManager.getWagon(DefaultWagonManager.java:136)
     [exec] 	at org.apache.maven.plugin.coreit.LoadResourceMojo.execute(LoadResourceMojo.java:95)
     [exec] 	... 18 more
     [exec] Caused by: org.codehaus.plexus.component.repository.exception.ComponentLookupException:
Component descriptor cannot be found in the component repository: org.apache.maven.wagon.Wagoncoreit.
     [exec] 	at org.codehaus.plexus.DefaultPlexusContainer.lookup(DefaultPlexusContainer.java:323)
     [exec] 	at org.codehaus.plexus.DefaultPlexusContainer.lookup(DefaultPlexusContainer.java:440)
     [exec] 	at org.apache.maven.artifact.manager.DefaultWagonManager.getWagon(DefaultWagonManager.java:132)
     [exec] 	... 19 more
     [exec] [INFO] ------------------------------------------------------------------------
     [exec] [INFO] Total time: 1 second
     [exec] [INFO] Finished at: Fri Feb 06 08:29:42 CST 2009
     [exec] [INFO] Final Memory: 3M/6M
     [exec] [INFO] ------------------------------------------------------------------------
     [exec] 
     [exec] 	at org.apache.maven.it.Verifier.executeGoals(Verifier.java:1274)
     [exec] 	at org.apache.maven.it.Verifier.executeGoal(Verifier.java:1126)
     [exec] 	at org.apache.maven.it.Verifier.executeGoal(Verifier.java:1120)
     [exec] 	at org.apache.maven.it.MavenITmng3805ExtensionClassPathOrderingTest.testitMNG3805(MavenITmng3805ExtensionClassPathOrderingTest.java:55)
     [exec] 	at org.apache.maven.it.MavenITmng3805ExtensionClassPathOrderingTest.testitMNG3805(MavenITmng3805ExtensionClassPathOrderingTest.java:55)
     [exec] 	at sun.reflect.NativeMethodAccessorImpl.invoke0(Native Method)
     [exec] 	at sun.reflect.NativeMethodAccessorImpl.invoke(NativeMethodAccessorImpl.java:39)
     [exec] 	at sun.reflect.DelegatingMethodAccessorImpl.invoke(DelegatingMethodAccessorImpl.java:25)
     [exec] 	at java.lang.reflect.Method.invoke(Method.java:324)
     [exec] 	at junit.framework.TestCase.runTest(TestCase.java:164)
     [exec] 	at org.apache.maven.it.AbstractMavenIntegrationTestCase.runTest(AbstractMavenIntegrationTestCase.java:178)
     [exec] 	at junit.framework.TestCase.runBare(TestCase.java:130)
     [exec] 	at junit.framework.TestResult$1.protect(TestResult.java:106)
     [exec] 	at junit.framework.TestResult.runProtected(TestResult.java:124)
     [exec] 	at junit.framework.TestResult.run(TestResult.java:109)
     [exec] 	at junit.framework.TestCase.run(TestCase.java:120)
     [exec] 	at junit.framework.TestSuite.runTest(TestSuite.java:230)
     [exec] 	at junit.framework.TestSuite.run(TestSuite.java:225)
     [exec] 	at junit.framework.TestSuite.runTest(TestSuite.java:230)
     [exec] 	at junit.framework.TestSuite.run(TestSuite.java:225)
     [exec] 	at sun.reflect.NativeMethodAccessorImpl.invoke0(Native Method)
     [exec] 	at sun.reflect.NativeMethodAccessorImpl.invoke(NativeMethodAccessorImpl.java:39)
     [exec] 	at sun.reflect.DelegatingMethodAccessorImpl.invoke(DelegatingMethodAccessorImpl.java:25)
     [exec] 	at java.lang.reflect.Method.invoke(Method.java:324)
     [exec] 	at org.apache.maven.surefire.junit.JUnitTestSet.execute(JUnitTestSet.java:213)
     [exec] 	at org.apache.maven.surefire.suite.AbstractDirectoryTestSuite.executeTestSet(AbstractDirectoryTestSuite.java:138)
     [exec] 	at org.apache.maven.surefire.suite.AbstractDirectoryTestSuite.execute(AbstractDirectoryTestSuite.java:125)
     [exec] 	at org.apache.maven.surefire.Surefire.run(Surefire.java:132)
     [exec] 	at sun.reflect.NativeMethodAccessorImpl.invoke0(Native Method)
     [exec] 	at sun.reflect.NativeMethodAccessorImpl.invoke(NativeMethodAccessorImpl.java:39)
     [exec] 	at sun.reflect.DelegatingMethodAccessorImpl.invoke(DelegatingMethodAccessorImpl.java:25)
     [exec] 	at java.lang.reflect.Method.invoke(Method.java:324)
     [exec] 	at org.apache.maven.surefire.booter.SurefireBooter.runSuitesInProcess(SurefireBooter.java:290)
     [exec] 	at org.apache.maven.surefire.booter.SurefireBooter.run(SurefireBooter.java:198)
     [exec] 	at org.apache.maven.plugin.surefire.SurefirePlugin.execute(SurefirePlugin.java:398)
     [exec] 	at org.apache.maven.plugin.DefaultPluginManager.executeMojo(DefaultPluginManager.java:453)
     [exec] 	at org.apache.maven.lifecycle.DefaultLifecycleExecutor.executeGoals(DefaultLifecycleExecutor.java:559)
     [exec] 	at org.apache.maven.lifecycle.DefaultLifecycleExecutor.executeGoalWithLifecycle(DefaultLifecycleExecutor.java:500)
     [exec] 	at org.apache.maven.lifecycle.DefaultLifecycleExecutor.executeGoal(DefaultLifecycleExecutor.java:479)
     [exec] 	at org.apache.maven.lifecycle.DefaultLifecycleExecutor.executeGoalAndHandleFailures(DefaultLifecycleExecutor.java:331)
     [exec] 	at org.apache.maven.lifecycle.DefaultLifecycleExecutor.executeTaskSegments(DefaultLifecycleExecutor.java:292)
     [exec] 	at org.apache.maven.lifecycle.DefaultLifecycleExecutor.execute(DefaultLifecycleExecutor.java:142)
     [exec] 	at org.apache.maven.DefaultMaven.doExecute(DefaultMaven.java:336)
     [exec] 	at org.apache.maven.DefaultMaven.execute(DefaultMaven.java:129)
     [exec] 	at org.apache.maven.cli.MavenCli.main(MavenCli.java:296)
     [exec] 	at sun.reflect.NativeMethodAccessorImpl.invoke0(Native Method)
     [exec] 	at sun.reflect.NativeMethodAccessorImpl.invoke(NativeMethodAccessorImpl.java:39)
     [exec] 	at sun.reflect.DelegatingMethodAccessorImpl.invoke(DelegatingMethodAccessorImpl.java:25)
     [exec] 	at java.lang.reflect.Method.invoke(Method.java:324)
     [exec] 	at org.codehaus.classworlds.Launcher.launchEnhanced(Launcher.java:315)
     [exec] 	at org.codehaus.classworlds.Launcher.launch(Launcher.java:255)
     [exec] 	at org.codehaus.classworlds.Launcher.mainWithExitCode(Launcher.java:430)
     [exec] 	at org.codehaus.classworlds.Launcher.main(Launcher.java:375)
     [exec] 
     [exec] 
     [exec] Results :
     [exec] 
     [exec] Tests in error: 
     [exec]   testitMNG3805(org.apache.maven.it.MavenITmng3805ExtensionClassPathOrderingTest)
     [exec] 
     [exec] Tests run: 313, Failures: 0, Errors: 1, Skipped: 0
     [exec] 
     [exec] [INFO] ------------------------------------------------------------------------
     [exec] [ERROR] BUILD FAILURE
     [exec] [INFO] ------------------------------------------------------------------------
     [exec] [INFO] There are test failures.
     [exec] [INFO] ------------------------------------------------------------------------
     [exec] [INFO] For more information, run Maven with the -e switch
     [exec] [INFO] ------------------------------------------------------------------------
     [exec] [INFO] Total time: 18 minutes 53 seconds
     [exec] [INFO] Finished at: Fri Feb 06 08:44:17 CST 2009
     [exec] [INFO] Final Memory: 29M/76M
     [exec] [INFO] ------------------------------------------------------------------------

BUILD FAILED
H:\home_hudson\.hudson\workspace\Maven-2.0.x-with-bootstrap\jdk\1.4\label\windows\maven-2.0.x\build.xml:244:
exec returned: 1

Total time: 24 minutes 49 seconds


Mime
View raw message