maven-notifications mailing list archives

Site index · List index
Message view « Date » · « Thread »
Top « Date » · « Thread »
From Hudson <Hud...@sonatype.org>
Subject Build failed in Hudson: Maven-2.1.x-bootstrap » 1.4,osx #105
Date Tue, 24 Feb 2009 06:25:55 GMT
See http://grid.sonatype.org/ci/job/Maven-2.1.x-bootstrap/./jdk=1.4,label=osx/105/changes

Changes:

[Brett Porter] [MNG-553] change enc to encrypt to avoid confusion with "encoding"

------------------------------------------
[...truncated 2236 lines...]
     [java] [INFO] Maven Toolchains ...................................... SUCCESS [2.902s]
     [java] [INFO] Maven Distribution .................................... SUCCESS [23.981s]
     [java] [INFO] ------------------------------------------------------------------------
     [java] [INFO] ------------------------------------------------------------------------
     [java] [INFO] BUILD SUCCESSFUL
     [java] [INFO] ------------------------------------------------------------------------
     [java] [INFO] Total time: 1 minute 11 seconds
     [java] [INFO] Finished at: Tue Feb 24 00:25:26 CST 2009
     [java] [INFO] Final Memory: 40M/73M
     [java] [INFO] ------------------------------------------------------------------------

maven-assembly:
     [echo] 
     [echo]     The new Maven distribution was created as part of the MAVEN-COMPILE step,
above.
     [echo]     This goal just validates the presence of that distribution.
     [echo]     

extract-assembly:
     [echo] Extracting assembly to /tmp ...
   [delete] Deleting directory /tmp/apache-maven-2.1.0-SNAPSHOT
    [mkdir] Created dir: /tmp/apache-maven-2.1.0-SNAPSHOT
    [unzip] Expanding: http://grid.sonatype.org/ci/job/Maven-2.1.x-bootstrap/./jdk=1.4,label=osx/ws/maven-2.1.x/apache-maven/target/apache-maven-2.1.0-SNAPSHOT-bin.zip
 into /tmp

all:

its-setup:

its-win32:

its-unix:
     [echo] Retrieving integration tests
     [exec] + Error stacktraces are turned on.
     [exec] [INFO] Scanning for projects...
     [exec] [INFO] ------------------------------------------------------------------------
     [exec] [INFO] Building Maven Integration-Test Importer
     [exec] [INFO]    task-segment: [process-resources]
     [exec] [INFO] ------------------------------------------------------------------------
     [exec] Downloading: http://repository.sonatype.org:8081/content/groups/public/org/apache/maven/plugins/maven-scm-plugin/1.1/maven-scm-plugin-1.1.pom
     [exec] 14K downloaded  (maven-scm-plugin-1.1.pom)                                   
    
     [exec] Downloading: http://repository.sonatype.org:8081/content/groups/public/org/apache/maven/plugins/maven-scm-plugin/1.1/maven-scm-plugin-1.1.jar
     [exec] 48K downloaded  (maven-scm-plugin-1.1.jar)                                   
    
     [exec] [INFO] [resources:resources]
     [exec] [INFO] Using default encoding to copy filtered resources.
     [exec] [INFO] ------------------------------------------------------------------------
     [exec] [INFO] BUILD SUCCESSFUL
     [exec] [INFO] ------------------------------------------------------------------------
     [exec] [INFO] Total time: 1 second
     [exec] [INFO] Finished at: Tue Feb 24 00:25:30 CST 2009
     [exec] [INFO] Final Memory: 4M/7M
     [exec] [INFO] ------------------------------------------------------------------------
     [exec] + Error stacktraces are turned on.
     [exec] [INFO] Scanning for projects...
     [exec] [INFO] ------------------------------------------------------------------------
     [exec] [INFO] Building Maven Integration-Test Importer
     [exec] [INFO]    task-segment: [package]
     [exec] [INFO] ------------------------------------------------------------------------
     [exec] Downloading: http://repository.sonatype.org:8081/content/groups/public/org/apache/maven/plugins/maven-surefire-plugin/2.4.3/maven-surefire-plugin-2.4.3.pom
     [exec] 6K downloaded  (maven-surefire-plugin-2.4.3.pom)                             
          
     [exec] Downloading: http://repository.sonatype.org:8081/content/groups/public/org/apache/maven/surefire/surefire/2.4.3/surefire-2.4.3.pom
     [exec] 7K downloaded  (surefire-2.4.3.pom)                                        
     [exec] Downloading: http://repository.sonatype.org:8081/content/groups/public/org/apache/maven/plugins/maven-surefire-plugin/2.4.3/maven-surefire-plugin-2.4.3.jar
     [exec] 22K downloaded  (maven-surefire-plugin-2.4.3.jar)                            
           
     [exec] Downloading: http://repository.sonatype.org:8081/content/groups/public/org/apache/maven/plugins/maven-jar-plugin/2.2/maven-jar-plugin-2.2.pom
     [exec] Downloading: http://repository.sonatype.org:8081/content/groups/public/org/apache/maven/plugins/maven-jar-plugin/2.2/maven-jar-plugin-2.2.jar
     [exec] 26K downloaded  (maven-jar-plugin-2.2.jar)                                   
    
     [exec] [INFO] [resources:resources]
     [exec] [INFO] Using default encoding to copy filtered resources.
     [exec] [INFO] [compiler:compile]
     [exec] [INFO] No sources to compile
     [exec] [INFO] [resources:testResources]
     [exec] [INFO] Using default encoding to copy filtered resources.
     [exec] [INFO] [compiler:testCompile]
     [exec] [INFO] No sources to compile
     [exec] Downloading: http://repository.sonatype.org:8081/content/groups/public/org/apache/maven/surefire/surefire-booter/2.4.3/surefire-booter-2.4.3.pom
     [exec] 1K downloaded  (surefire-booter-2.4.3.pom)                                   
    
     [exec] Downloading: http://repository.sonatype.org:8081/content/groups/public/org/apache/maven/surefire/surefire-api/2.4.3/surefire-api-2.4.3.pom
     [exec] 2K downloaded  (surefire-api-2.4.3.pom)                                      
 
     [exec] Downloading: http://repository.sonatype.org:8081/content/groups/public/org/apache/maven/maven-core/2.0.6/maven-core-2.0.6.pom
     [exec] Downloading: http://repository.sonatype.org:8081/content/groups/public/org/apache/maven/maven-plugin-parameter-documenter/2.0.6/maven-plugin-parameter-documenter-2.0.6.pom
     [exec] 1K downloaded  (maven-plugin-parameter-documenter-2.0.6.pom)                 
                      
     [exec] Downloading: http://repository.sonatype.org:8081/content/groups/public/org/apache/maven/reporting/maven-reporting-api/2.0.6/maven-reporting-api-2.0.6.pom
     [exec] Downloading: http://repository.sonatype.org:8081/content/groups/public/org/apache/maven/reporting/maven-reporting/2.0.6/maven-reporting-2.0.6.pom
     [exec] Downloading: http://repository.sonatype.org:8081/content/groups/public/org/apache/maven/maven-error-diagnostics/2.0.6/maven-error-diagnostics-2.0.6.pom
     [exec] Downloading: http://repository.sonatype.org:8081/content/groups/public/org/apache/maven/maven-plugin-descriptor/2.0.6/maven-plugin-descriptor-2.0.6.pom
     [exec] Downloading: http://repository.sonatype.org:8081/content/groups/public/org/apache/maven/maven-monitor/2.0.6/maven-monitor-2.0.6.pom
     [exec] Downloading: http://repository.sonatype.org:8081/content/groups/public/org/apache/maven/maven-toolchain/1.0/maven-toolchain-1.0.pom
     [exec] 3K downloaded  (maven-toolchain-1.0.pom)                                     
  
     [exec] Downloading: http://repository.sonatype.org:8081/content/groups/public/org/apache/maven/surefire/surefire-booter/2.4.3/surefire-booter-2.4.3.jar
     [exec] 261K downloaded  (surefire-booter-2.4.3.jar)                                 
      
     [exec] Downloading: http://repository.sonatype.org:8081/content/groups/public/org/apache/maven/surefire/surefire-api/2.4.3/surefire-api-2.4.3.jar
     [exec] 503K downloaded  (surefire-api-2.4.3.jar)                                    
   
     [exec] [INFO] [surefire:test]
     [exec] [INFO] No tests to run.
     [exec] Downloading: http://repository.sonatype.org:8081/content/groups/public/org/apache/maven/maven-archiver/2.3/maven-archiver-2.3.pom
     [exec] Downloading: http://repository.sonatype.org:8081/content/groups/public/org/codehaus/plexus/plexus-archiver/1.0-alpha-9/plexus-archiver-1.0-alpha-9.pom
     [exec] Downloading: http://repository.sonatype.org:8081/content/groups/public/org/codehaus/plexus/plexus-container-default/1.0-alpha-15/plexus-container-default-1.0-alpha-15.pom
     [exec] 1K downloaded  (plexus-container-default-1.0-alpha-15.pom)                   
                    
     [exec] Downloading: http://repository.sonatype.org:8081/content/groups/public/org/codehaus/plexus/plexus-io/1.0-alpha-1/plexus-io-1.0-alpha-1.pom
     [exec] Downloading: http://repository.sonatype.org:8081/content/groups/public/org/codehaus/plexus/plexus-utils/1.4.9/plexus-utils-1.4.9.pom
     [exec] Downloading: http://repository.sonatype.org:8081/content/groups/public/org/apache/maven/maven-archiver/2.3/maven-archiver-2.3.jar
     [exec] Downloading: http://repository.sonatype.org:8081/content/groups/public/org/codehaus/plexus/plexus-utils/1.4.9/plexus-utils-1.4.9.jar
     [exec] 17K downloaded  (maven-archiver-2.3.jar)                                     
  
     [exec] 199K downloaded  (plexus-utils-1.4.9.jar)                                    
   
     [exec] Downloading: http://repository.sonatype.org:8081/content/groups/public/org/codehaus/plexus/plexus-archiver/1.0-alpha-9/plexus-archiver-1.0-alpha-9.jar
     [exec] 153K downloaded  (plexus-archiver-1.0-alpha-9.jar)                           
            
     [exec] Downloading: http://repository.sonatype.org:8081/content/groups/public/org/codehaus/plexus/plexus-io/1.0-alpha-1/plexus-io-1.0-alpha-1.jar
     [exec] 11K downloaded  (plexus-io-1.0-alpha-1.jar)                                  
     
     [exec] [INFO] [jar:jar]
     [exec] [INFO] Building jar: http://grid.sonatype.org/ci/job/Maven-2.1.x-bootstrap/./jdk=1.4,label=osx/ws/maven-2.1.x/maven-integration-tests/target/classes/target/maven-integration-tests-2.1.x.jar

     [exec] Downloading: http://repository.sonatype.org:8081/content/groups/public/org/apache/maven/scm/maven-scm-manager-plexus/1.1/maven-scm-manager-plexus-1.1.pom
     [exec] 2K downloaded  (maven-scm-manager-plexus-1.1.pom)                            
           
     [exec] Downloading: http://repository.sonatype.org:8081/content/groups/public/org/apache/maven/scm/maven-scm-managers/1.1/maven-scm-managers-1.1.pom
     [exec] 1K downloaded  (maven-scm-managers-1.1.pom)                                  
     
     [exec] Downloading: http://repository.sonatype.org:8081/content/groups/public/org/apache/maven/scm/maven-scm/1.1/maven-scm-1.1.pom
     [exec] 19K downloaded  (maven-scm-1.1.pom)                                        
     [exec] Downloading: http://repository.sonatype.org:8081/content/groups/public/org/apache/maven/scm/maven-scm-api/1.1/maven-scm-api-1.1.pom
     [exec] 1K downloaded  (maven-scm-api-1.1.pom)                                       

     [exec] Downloading: http://repository.sonatype.org:8081/content/groups/public/org/apache/maven/scm/maven-scm-providers-standard/1.1/maven-scm-providers-standard-1.1.pom
     [exec] 3K downloaded  (maven-scm-providers-standard-1.1.pom)                        
               
     [exec] Downloading: http://repository.sonatype.org:8081/content/groups/public/org/apache/maven/scm/maven-scm-providers/1.1/maven-scm-providers-1.1.pom
     [exec] 3K downloaded  (maven-scm-providers-1.1.pom)                                 
      
     [exec] Downloading: http://repository.sonatype.org:8081/content/groups/public/org/apache/maven/scm/maven-scm-provider-accurev/1.1/maven-scm-provider-accurev-1.1.pom
     [exec] 4K downloaded  (maven-scm-provider-accurev-1.1.pom)                          
             
     [exec] Downloading: http://repository.sonatype.org:8081/content/groups/public/org/apache/maven/scm/maven-scm-provider-bazaar/1.1/maven-scm-provider-bazaar-1.1.pom
     [exec] 1K downloaded  (maven-scm-provider-bazaar-1.1.pom)                           
            
     [exec] Downloading: http://repository.sonatype.org:8081/content/groups/public/org/apache/maven/scm/maven-scm-provider-clearcase/1.1/maven-scm-provider-clearcase-1.1.pom
     [exec] 2K downloaded  (maven-scm-provider-clearcase-1.1.pom)                        
               
     [exec] Downloading: http://repository.sonatype.org:8081/content/groups/public/org/apache/maven/scm/maven-scm-provider-cvsexe/1.1/maven-scm-provider-cvsexe-1.1.pom
     [exec] 2K downloaded  (maven-scm-provider-cvsexe-1.1.pom)                           
            
     [exec] Downloading: http://repository.sonatype.org:8081/content/groups/public/org/apache/maven/scm/maven-scm-providers-cvs/1.1/maven-scm-providers-cvs-1.1.pom
     [exec] 1K downloaded  (maven-scm-providers-cvs-1.1.pom)                             
          
     [exec] Downloading: http://repository.sonatype.org:8081/content/groups/public/org/apache/maven/scm/maven-scm-provider-cvs-commons/1.1/maven-scm-provider-cvs-commons-1.1.pom
     [exec] 2K downloaded  (maven-scm-provider-cvs-commons-1.1.pom)                      
                 
     [exec] Downloading: http://repository.sonatype.org:8081/content/groups/public/org/apache/maven/scm/maven-scm-provider-cvsjava/1.1/maven-scm-provider-cvsjava-1.1.pom
     [exec] 2K downloaded  (maven-scm-provider-cvsjava-1.1.pom)                          
             
     [exec] Downloading: http://repository.sonatype.org:8081/content/groups/public/org/netbeans/lib/cvsclient/20060125/cvsclient-20060125.pom
     [exec] Downloading: http://repository.sonatype.org:8081/content/groups/public/ch/ethz/ganymed/ganymed-ssh2/build210/ganymed-ssh2-build210.pom
     [exec] Downloading: http://repository.sonatype.org:8081/content/groups/public/org/apache/maven/scm/maven-scm-provider-gitexe/1.1/maven-scm-provider-gitexe-1.1.pom
     [exec] 2K downloaded  (maven-scm-provider-gitexe-1.1.pom)                           
            
     [exec] Downloading: http://repository.sonatype.org:8081/content/groups/public/org/apache/maven/scm/maven-scm-providers-git/1.1/maven-scm-providers-git-1.1.pom
     [exec] 1K downloaded  (maven-scm-providers-git-1.1.pom)                             
          
     [exec] Downloading: http://repository.sonatype.org:8081/content/groups/public/org/apache/maven/scm/maven-scm-provider-git-commons/1.1/maven-scm-provider-git-commons-1.1.pom
     [exec] 2K downloaded  (maven-scm-provider-git-commons-1.1.pom)                      
                 
     [exec] Downloading: http://repository.sonatype.org:8081/content/groups/public/org/apache/maven/scm/maven-scm-provider-hg/1.1/maven-scm-provider-hg-1.1.pom
     [exec] 2K downloaded  (maven-scm-provider-hg-1.1.pom)                               
        
     [exec] Downloading: http://repository.sonatype.org:8081/content/groups/public/org/apache/maven/scm/maven-scm-provider-perforce/1.1/maven-scm-provider-perforce-1.1.pom
     [exec] 2K downloaded  (maven-scm-provider-perforce-1.1.pom)                         
              
     [exec] Downloading: http://repository.sonatype.org:8081/content/groups/public/org/apache/maven/scm/maven-scm-provider-starteam/1.1/maven-scm-provider-starteam-1.1.pom
     [exec] 2K downloaded  (maven-scm-provider-starteam-1.1.pom)                         
              
     [exec] Downloading: http://repository.sonatype.org:8081/content/groups/public/org/apache/maven/scm/maven-scm-provider-svnexe/1.1/maven-scm-provider-svnexe-1.1.pom
     [exec] 2K downloaded  (maven-scm-provider-svnexe-1.1.pom)                           
            
     [exec] Downloading: http://repository.sonatype.org:8081/content/groups/public/org/apache/maven/scm/maven-scm-providers-svn/1.1/maven-scm-providers-svn-1.1.pom
     [exec] 1K downloaded  (maven-scm-providers-svn-1.1.pom)                             
          
     [exec] Downloading: http://repository.sonatype.org:8081/content/groups/public/org/apache/maven/scm/maven-scm-provider-svn-commons/1.1/maven-scm-provider-svn-commons-1.1.pom
     [exec] 1K downloaded  (maven-scm-provider-svn-commons-1.1.pom)                      
                 
     [exec] Downloading: http://repository.sonatype.org:8081/content/groups/public/org/apache/maven/scm/maven-scm-provider-synergy/1.1/maven-scm-provider-synergy-1.1.pom
     [exec] 1K downloaded  (maven-scm-provider-synergy-1.1.pom)                          
             
     [exec] Downloading: http://repository.sonatype.org:8081/content/groups/public/org/apache/maven/scm/maven-scm-provider-vss/1.1/maven-scm-provider-vss-1.1.pom
     [exec] 2K downloaded  (maven-scm-provider-vss-1.1.pom)                              
         
     [exec] Downloading: http://repository.sonatype.org:8081/content/groups/public/org/apache/maven/scm/maven-scm-provider-local/1.1/maven-scm-provider-local-1.1.pom
     [exec] 2K downloaded  (maven-scm-provider-local-1.1.pom)                            
           
     [exec] Downloading: http://repository.sonatype.org:8081/content/groups/public/org/apache/maven/scm/maven-scm-manager-plexus/1.1/maven-scm-manager-plexus-1.1.jar
     [exec] Downloading: http://repository.sonatype.org:8081/content/groups/public/org/netbeans/lib/cvsclient/20060125/cvsclient-20060125.jar
     [exec] Downloading: http://repository.sonatype.org:8081/content/groups/public/ch/ethz/ganymed/ganymed-ssh2/build210/ganymed-ssh2-build210.jar
     [exec] 9K downloaded  (maven-scm-manager-plexus-1.1.jar)                            
           
     [exec] Downloading: http://repository.sonatype.org:8081/content/groups/public/org/apache/maven/scm/maven-scm-api/1.1/maven-scm-api-1.1.jar
     [exec] 80K downloaded  (maven-scm-api-1.1.jar)                                      
 
     [exec] 239K downloaded  (ganymed-ssh2-build210.jar)                                 
      
     [exec] Downloading: http://repository.sonatype.org:8081/content/groups/public/org/apache/maven/scm/maven-scm-provider-accurev/1.1/maven-scm-provider-accurev-1.1.jar
     [exec] 25K downloaded  (maven-scm-provider-accurev-1.1.jar)                         
              
     [exec] Downloading: http://repository.sonatype.org:8081/content/groups/public/org/apache/maven/scm/maven-scm-provider-bazaar/1.1/maven-scm-provider-bazaar-1.1.jar
     [exec] 45K downloaded  (maven-scm-provider-bazaar-1.1.jar)                          
             
     [exec] 604K downloaded  (cvsclient-20060125.jar)                                    
   
     [exec] Downloading: http://repository.sonatype.org:8081/content/groups/public/org/apache/maven/scm/maven-scm-provider-clearcase/1.1/maven-scm-provider-clearcase-1.1.jar
     [exec] 58K downloaded  (maven-scm-provider-clearcase-1.1.jar)                       
                
     [exec] Downloading: http://repository.sonatype.org:8081/content/groups/public/org/apache/maven/scm/maven-scm-provider-cvsexe/1.1/maven-scm-provider-cvsexe-1.1.jar
     [exec] 25K downloaded  (maven-scm-provider-cvsexe-1.1.jar)                          
             
     [exec] Downloading: http://repository.sonatype.org:8081/content/groups/public/org/apache/maven/scm/maven-scm-provider-cvs-commons/1.1/maven-scm-provider-cvs-commons-1.1.jar
     [exec] 68K downloaded  (maven-scm-provider-cvs-commons-1.1.jar)                     
                  
     [exec] Downloading: http://repository.sonatype.org:8081/content/groups/public/org/apache/maven/scm/maven-scm-provider-cvsjava/1.1/maven-scm-provider-cvsjava-1.1.jar
     [exec] 39K downloaded  (maven-scm-provider-cvsjava-1.1.jar)                         
              
     [exec] Downloading: http://repository.sonatype.org:8081/content/groups/public/org/apache/maven/scm/maven-scm-provider-gitexe/1.1/maven-scm-provider-gitexe-1.1.jar
     [exec] 44K downloaded  (maven-scm-provider-gitexe-1.1.jar)                          
             
     [exec] Downloading: http://repository.sonatype.org:8081/content/groups/public/org/apache/maven/scm/maven-scm-provider-git-commons/1.1/maven-scm-provider-git-commons-1.1.jar
     [exec] 34K downloaded  (maven-scm-provider-git-commons-1.1.jar)                     
                  
     [exec] Downloading: http://repository.sonatype.org:8081/content/groups/public/org/apache/maven/scm/maven-scm-provider-hg/1.1/maven-scm-provider-hg-1.1.jar
     [exec] 50K downloaded  (maven-scm-provider-hg-1.1.jar)                              
         
     [exec] Downloading: http://repository.sonatype.org:8081/content/groups/public/org/apache/maven/scm/maven-scm-provider-perforce/1.1/maven-scm-provider-perforce-1.1.jar
     [exec] 63K downloaded  (maven-scm-provider-perforce-1.1.jar)                        
               
     [exec] Downloading: http://repository.sonatype.org:8081/content/groups/public/org/apache/maven/scm/maven-scm-provider-starteam/1.1/maven-scm-provider-starteam-1.1.jar
     [exec] 67K downloaded  (maven-scm-provider-starteam-1.1.jar)                        
               
     [exec] Downloading: http://repository.sonatype.org:8081/content/groups/public/org/apache/maven/scm/maven-scm-provider-svnexe/1.1/maven-scm-provider-svnexe-1.1.jar
     [exec] 57K downloaded  (maven-scm-provider-svnexe-1.1.jar)                          
             
     [exec] Downloading: http://repository.sonatype.org:8081/content/groups/public/org/apache/maven/scm/maven-scm-provider-svn-commons/1.1/maven-scm-provider-svn-commons-1.1.jar
     [exec] 36K downloaded  (maven-scm-provider-svn-commons-1.1.jar)                     
                  
     [exec] Downloading: http://repository.sonatype.org:8081/content/groups/public/org/apache/maven/scm/maven-scm-provider-synergy/1.1/maven-scm-provider-synergy-1.1.jar
     [exec] 49K downloaded  (maven-scm-provider-synergy-1.1.jar)                         
              
     [exec] Downloading: http://repository.sonatype.org:8081/content/groups/public/org/apache/maven/scm/maven-scm-provider-vss/1.1/maven-scm-provider-vss-1.1.jar
     [exec] 53K downloaded  (maven-scm-provider-vss-1.1.jar)                             
          
     [exec] Downloading: http://repository.sonatype.org:8081/content/groups/public/org/apache/maven/scm/maven-scm-provider-local/1.1/maven-scm-provider-local-1.1.jar
     [exec] 39K downloaded  (maven-scm-provider-local-1.1.jar)                           
            
     [exec] [INFO] [scm:update {execution: scm}]
     [exec] [INFO] Executing: /bin/sh -c cd /tmp/maven-integration-tests-2.1.x &&
svn --non-interactive update /tmp/maven-integration-tests-2.1.x
     [exec] [INFO] Working directory: /tmp/maven-integration-tests-2.1.x
     [exec] [ERROR] Provider message:
     [exec] [ERROR] The svn command failed.
     [exec] [ERROR] Command output:
     [exec] [ERROR] svn: Can't open file '/tmp/maven-integration-tests-2.1.x/core-it-support/maven-it-sample/src/test/java/org/apache/maven/it/.svn/text-base/MavenITmngXXXXDescriptionOfProblemTest.java.svn-base':
No such file or directory
     [exec] 
     [exec] [INFO] ------------------------------------------------------------------------
     [exec] [ERROR] BUILD ERROR
     [exec] [INFO] ------------------------------------------------------------------------
     [exec] [INFO] Command failed.The svn command failed.
     [exec] [INFO] ------------------------------------------------------------------------
     [exec] [INFO] Trace
     [exec] org.apache.maven.lifecycle.LifecycleExecutionException: Command failed.The svn
command failed.
     [exec] 	at org.apache.maven.lifecycle.DefaultLifecycleExecutor.executeGoals(DefaultLifecycleExecutor.java:702)
     [exec] 	at org.apache.maven.lifecycle.DefaultLifecycleExecutor.executeGoalWithLifecycle(DefaultLifecycleExecutor.java:539)
     [exec] 	at org.apache.maven.lifecycle.DefaultLifecycleExecutor.executeGoal(DefaultLifecycleExecutor.java:518)
     [exec] 	at org.apache.maven.lifecycle.DefaultLifecycleExecutor.executeGoalAndHandleFailures(DefaultLifecycleExecutor.java:370)
     [exec] 	at org.apache.maven.lifecycle.DefaultLifecycleExecutor.executeTaskSegments(DefaultLifecycleExecutor.java:331)
     [exec] 	at org.apache.maven.lifecycle.DefaultLifecycleExecutor.execute(DefaultLifecycleExecutor.java:181)
     [exec] 	at org.apache.maven.DefaultMaven.doExecute(DefaultMaven.java:346)
     [exec] 	at org.apache.maven.DefaultMaven.execute(DefaultMaven.java:133)
     [exec] 	at org.apache.maven.cli.MavenCli.main(MavenCli.java:356)
     [exec] 	at sun.reflect.NativeMethodAccessorImpl.invoke0(Native Method)
     [exec] 	at sun.reflect.NativeMethodAccessorImpl.invoke(NativeMethodAccessorImpl.java:39)
     [exec] 	at sun.reflect.DelegatingMethodAccessorImpl.invoke(DelegatingMethodAccessorImpl.java:25)
     [exec] 	at java.lang.reflect.Method.invoke(Method.java:324)
     [exec] 	at org.codehaus.classworlds.Launcher.launchEnhanced(Launcher.java:315)
     [exec] 	at org.codehaus.classworlds.Launcher.launch(Launcher.java:255)
     [exec] 	at org.codehaus.classworlds.Launcher.mainWithExitCode(Launcher.java:430)
     [exec] 	at org.codehaus.classworlds.Launcher.main(Launcher.java:375)
     [exec] Caused by: org.apache.maven.plugin.MojoExecutionException: Command failed.The
svn command failed.
     [exec] 	at org.apache.maven.scm.plugin.AbstractScmMojo.checkResult(AbstractScmMojo.java:400)
     [exec] 	at org.apache.maven.scm.plugin.UpdateMojo.execute(UpdateMojo.java:93)
     [exec] 	at org.apache.maven.plugin.DefaultPluginManager.executeMojo(DefaultPluginManager.java:457)
     [exec] 	at org.apache.maven.lifecycle.DefaultLifecycleExecutor.executeGoals(DefaultLifecycleExecutor.java:677)
     [exec] 	... 16 more
     [exec] [INFO] ------------------------------------------------------------------------
     [exec] [INFO] Total time: 23 seconds
     [exec] [INFO] Finished at: Tue Feb 24 00:25:54 CST 2009
     [exec] [INFO] Final Memory: 13M/27M
     [exec] [INFO] ------------------------------------------------------------------------

BUILD FAILED
http://grid.sonatype.org/ci/job/Maven-2.1.x-bootstrap/./jdk=1.4,label=osx/ws/maven-2.1.x/build.xml
:280: exec returned: 1

Total time: 2 minutes 4 seconds


Mime
View raw message