maven-notifications mailing list archives

Site index · List index
Message view « Date » · « Thread »
Top « Date » · « Thread »
From Hudson <Hud...@sonatype.org>
Subject Build failed in Hudson: Maven-2.1.x-bootstrap » 1.4,osx #75
Date Sat, 07 Feb 2009 10:42:15 GMT
See http://grid.sonatype.org/ci/job/Maven-2.1.x-bootstrap/./jdk=1.4,label=osx/75/changes

Changes:

[Benjamin Bentmann] o Enabled exception stack traces for Maven invocations
o Removed superfluos whitespace

------------------------------------------
[...truncated 3326 lines...]
     [exec] 	at org.apache.maven.lifecycle.DefaultLifecycleExecutor.executeTaskSegments(DefaultLifecycleExecutor.java:331)
     [exec] 	at org.apache.maven.lifecycle.DefaultLifecycleExecutor.execute(DefaultLifecycleExecutor.java:181)
     [exec] 	at org.apache.maven.DefaultMaven.doExecute(DefaultMaven.java:345)
     [exec] 	at org.apache.maven.DefaultMaven.execute(DefaultMaven.java:132)
     [exec] 	at org.apache.maven.cli.MavenCli.main(MavenCli.java:299)
     [exec] 	at sun.reflect.NativeMethodAccessorImpl.invoke0(Native Method)
     [exec] 	at sun.reflect.NativeMethodAccessorImpl.invoke(NativeMethodAccessorImpl.java:39)
     [exec] 	at sun.reflect.DelegatingMethodAccessorImpl.invoke(DelegatingMethodAccessorImpl.java:25)
     [exec] 	at java.lang.reflect.Method.invoke(Method.java:324)
     [exec] 	at org.codehaus.classworlds.Launcher.launchEnhanced(Launcher.java:315)
     [exec] 	at org.codehaus.classworlds.Launcher.launch(Launcher.java:255)
     [exec] 	at org.codehaus.classworlds.Launcher.mainWithExitCode(Launcher.java:430)
     [exec] 	at org.codehaus.classworlds.Launcher.main(Launcher.java:375)
     [exec] 
     [exec] testitMNG3396(org.apache.maven.it.MavenITmng3396DependencyManagementForOverConstrainedRangesTest)
 Time elapsed: 25.166 sec  <<< ERROR!
     [exec] org.apache.maven.it.VerificationException: Exit code was non-zero: 1; command
line and log = 
     [exec] /tmp/apache-maven-2.1.0-M2-SNAPSHOT/bin/mvn -e --batch-mode -Dmaven.repo.local=/opt/repos/local-repository
org.apache.maven.plugins:maven-clean-plugin:clean install
     [exec] + Error stacktraces are turned on.
     [exec] [INFO] Scanning for projects...
     [exec] [INFO] Reactor build order: 
     [exec] [INFO]   Maven Integration Test :: mng3396
     [exec] [INFO]   Maven Integration Test :: mng3396 :: A
     [exec] [INFO]   Maven Integration Test :: mng3396 :: plugin
     [exec] [INFO] ------------------------------------------------------------------------
     [exec] [INFO] Building Maven Integration Test :: mng3396
     [exec] [INFO]    task-segment: [org.apache.maven.plugins:maven-clean-plugin:clean, install]
     [exec] [INFO] ------------------------------------------------------------------------
     [exec] [INFO] [clean:clean]
     [exec] [INFO] [site:attach-descriptor]
     [exec] [INFO] [install:install]
     [exec] [INFO] Installing /private/tmp/maven-integration-tests-2.1.x/core-it-suite/target/test-classes/mng-3396/plugin/pom.xml
to /opt/repos/local-repository/org/apache/maven/its/mng3396/plugin-parent/1/plugin-parent-1.pom
     [exec] [INFO] ------------------------------------------------------------------------
     [exec] [INFO] Building Maven Integration Test :: mng3396 :: A
     [exec] [INFO]    task-segment: [org.apache.maven.plugins:maven-clean-plugin:clean, install]
     [exec] [INFO] ------------------------------------------------------------------------
     [exec] [INFO] [clean:clean]
     [exec] [INFO] [resources:resources]
     [exec] [WARNING] Using platform encoding (MacRoman actually) to copy filtered resources,
i.e. build is platform dependent!
     [exec] [INFO] skip non existing resourceDirectory /private/tmp/maven-integration-tests-2.1.x/core-it-suite/target/test-classes/mng-3396/plugin/a/src/main/resources
     [exec] [INFO] [compiler:compile]
     [exec] [INFO] No sources to compile
     [exec] [INFO] [resources:testResources]
     [exec] [WARNING] Using platform encoding (MacRoman actually) to copy filtered resources,
i.e. build is platform dependent!
     [exec] [INFO] skip non existing resourceDirectory /private/tmp/maven-integration-tests-2.1.x/core-it-suite/target/test-classes/mng-3396/plugin/a/src/test/resources
     [exec] [INFO] [compiler:testCompile]
     [exec] [INFO] No sources to compile
     [exec] [INFO] [surefire:test]
     [exec] [INFO] No tests to run.
     [exec] [INFO] [jar:jar]
     [exec] [WARNING] JAR will be empty - no content was marked for inclusion!
     [exec] [INFO] Building jar: /private/tmp/maven-integration-tests-2.1.x/core-it-suite/target/test-classes/mng-3396/plugin/a/target/A-3.0.jar
     [exec] [INFO] [install:install]
     [exec] [INFO] Installing /private/tmp/maven-integration-tests-2.1.x/core-it-suite/target/test-classes/mng-3396/plugin/a/target/A-3.0.jar
to /opt/repos/local-repository/org/apache/maven/its/mng3396/A/3.0/A-3.0.jar
     [exec] [INFO] ------------------------------------------------------------------------
     [exec] [INFO] Building Maven Integration Test :: mng3396 :: plugin
     [exec] [INFO]    task-segment: [org.apache.maven.plugins:maven-clean-plugin:clean, install]
     [exec] [INFO] ------------------------------------------------------------------------
     [exec] [INFO] [clean:clean]
     [exec] Downloading: http://repository.sonatype.org:8081/content/groups/public/org/apache/maven/its/mng3396/B/1.0/B-1.0.pom
     [exec] Downloading: http://repository.sonatype.org:8081/content/groups/public/org/apache/maven/its/mng3396/B/1.0/B-1.0.jar
     [exec] [INFO] ------------------------------------------------------------------------
     [exec] [ERROR] BUILD ERROR
     [exec] [INFO] ------------------------------------------------------------------------
     [exec] [INFO] Failed to resolve artifact.
     [exec] Missing:
     [exec] ----------
     [exec] 1) org.apache.maven.its.mng3396:B:jar:1.0
     [exec]   Try downloading the file manually from the project website.
     [exec]   Then, install it using the command: 
     [exec]       mvn install:install-file -DgroupId=org.apache.maven.its.mng3396 -DartifactId=B
-Dversion=1.0 -Dpackaging=jar -Dfile=/path/to/file
     [exec]   Alternatively, if you host your own repository you can deploy the file there:

     [exec]       mvn deploy:deploy-file -DgroupId=org.apache.maven.its.mng3396 -DartifactId=B
-Dversion=1.0 -Dpackaging=jar -Dfile=/path/to/file -Durl=[url] -DrepositoryId=[id]
     [exec]   Path to dependency: 
     [exec]   	1) org.apache.maven.its.mng3396:plugin:maven-plugin:1.0
     [exec]   	2) org.apache.maven.its.mng3396:B:jar:1.0
     [exec] ----------
     [exec] 1 required artifact is missing.
     [exec] for artifact: 
     [exec]   org.apache.maven.its.mng3396:plugin:maven-plugin:1.0
     [exec] from the specified remote repositories:
     [exec]   Nexus (http://repository.sonatype.org:8081/content/groups/public)
     [exec] [INFO] ------------------------------------------------------------------------
     [exec] [INFO] Trace
     [exec] org.apache.maven.lifecycle.LifecycleExecutionException: Missing:
     [exec] ----------
     [exec] 1) org.apache.maven.its.mng3396:B:jar:1.0
     [exec]   Try downloading the file manually from the project website.
     [exec]   Then, install it using the command: 
     [exec]       mvn install:install-file -DgroupId=org.apache.maven.its.mng3396 -DartifactId=B
-Dversion=1.0 -Dpackaging=jar -Dfile=/path/to/file
     [exec]   Alternatively, if you host your own repository you can deploy the file there:

     [exec]       mvn deploy:deploy-file -DgroupId=org.apache.maven.its.mng3396 -DartifactId=B
-Dversion=1.0 -Dpackaging=jar -Dfile=/path/to/file -Durl=[url] -DrepositoryId=[id]
     [exec]   Path to dependency: 
     [exec]   	1) org.apache.maven.its.mng3396:plugin:maven-plugin:1.0
     [exec]   	2) org.apache.maven.its.mng3396:B:jar:1.0
     [exec] ----------
     [exec] 1 required artifact is missing.
     [exec] for artifact: 
     [exec]   org.apache.maven.its.mng3396:plugin:maven-plugin:1.0
     [exec] from the specified remote repositories:
     [exec]   Nexus (http://repository.sonatype.org:8081/content/groups/public)
     [exec] 	at org.apache.maven.lifecycle.DefaultLifecycleExecutor.executeGoals(DefaultLifecycleExecutor.java:694)
     [exec] 	at org.apache.maven.lifecycle.DefaultLifecycleExecutor.executeGoalWithLifecycle(DefaultLifecycleExecutor.java:539)
     [exec] 	at org.apache.maven.lifecycle.DefaultLifecycleExecutor.executeGoal(DefaultLifecycleExecutor.java:518)
     [exec] 	at org.apache.maven.lifecycle.DefaultLifecycleExecutor.executeGoalAndHandleFailures(DefaultLifecycleExecutor.java:370)
     [exec] 	at org.apache.maven.lifecycle.DefaultLifecycleExecutor.executeTaskSegments(DefaultLifecycleExecutor.java:331)
     [exec] 	at org.apache.maven.lifecycle.DefaultLifecycleExecutor.execute(DefaultLifecycleExecutor.java:181)
     [exec] 	at org.apache.maven.DefaultMaven.doExecute(DefaultMaven.java:345)
     [exec] 	at org.apache.maven.DefaultMaven.execute(DefaultMaven.java:132)
     [exec] 	at org.apache.maven.cli.MavenCli.main(MavenCli.java:299)
     [exec] 	at sun.reflect.NativeMethodAccessorImpl.invoke0(Native Method)
     [exec] 	at sun.reflect.NativeMethodAccessorImpl.invoke(NativeMethodAccessorImpl.java:39)
     [exec] 	at sun.reflect.DelegatingMethodAccessorImpl.invoke(DelegatingMethodAccessorImpl.java:25)
     [exec] 	at java.lang.reflect.Method.invoke(Method.java:324)
     [exec] 	at org.codehaus.classworlds.Launcher.launchEnhanced(Launcher.java:315)
     [exec] 	at org.codehaus.classworlds.Launcher.launch(Launcher.java:255)
     [exec] 	at org.codehaus.classworlds.Launcher.mainWithExitCode(Launcher.java:430)
     [exec] 	at org.codehaus.classworlds.Launcher.main(Launcher.java:375)
     [exec] Caused by: org.apache.maven.artifact.resolver.MultipleArtifactsNotFoundException:
Missing:
     [exec] ----------
     [exec] 1) org.apache.maven.its.mng3396:B:jar:1.0
     [exec]   Try downloading the file manually from the project website.
     [exec]   Then, install it using the command: 
     [exec]       mvn install:install-file -DgroupId=org.apache.maven.its.mng3396 -DartifactId=B
-Dversion=1.0 -Dpackaging=jar -Dfile=/path/to/file
     [exec]   Alternatively, if you host your own repository you can deploy the file there:

     [exec]       mvn deploy:deploy-file -DgroupId=org.apache.maven.its.mng3396 -DartifactId=B
-Dversion=1.0 -Dpackaging=jar -Dfile=/path/to/file -Durl=[url] -DrepositoryId=[id]
     [exec]   Path to dependency: 
     [exec]   	1) org.apache.maven.its.mng3396:plugin:maven-plugin:1.0
     [exec]   	2) org.apache.maven.its.mng3396:B:jar:1.0
     [exec] ----------
     [exec] 1 required artifact is missing.
     [exec] for artifact: 
     [exec]   org.apache.maven.its.mng3396:plugin:maven-plugin:1.0
     [exec] from the specified remote repositories:
     [exec]   Nexus (http://repository.sonatype.org:8081/content/groups/public)
     [exec] 	at org.apache.maven.artifact.resolver.DefaultArtifactResolver.resolveTransitively(DefaultArtifactResolver.java:324)
     [exec] 	at org.apache.maven.artifact.resolver.DefaultArtifactResolver.resolveTransitively(DefaultArtifactResolver.java:288)
     [exec] 	at org.apache.maven.plugin.DefaultPluginManager.resolveTransitiveDependencies(DefaultPluginManager.java:1441)
     [exec] 	at org.apache.maven.plugin.DefaultPluginManager.executeMojo(DefaultPluginManager.java:412)
     [exec] 	at org.apache.maven.lifecycle.DefaultLifecycleExecutor.executeGoals(DefaultLifecycleExecutor.java:677)
     [exec] 	... 16 more
     [exec] [INFO] ------------------------------------------------------------------------
     [exec] [INFO] Total time: 10 seconds
     [exec] [INFO] Finished at: Sat Feb 07 04:32:51 CST 2009
     [exec] [INFO] Final Memory: 14M/26M
     [exec] [INFO] ------------------------------------------------------------------------
     [exec] 	at org.apache.maven.it.Verifier.executeGoals(Verifier.java:1274)
     [exec] 	at org.apache.maven.it.Verifier.executeGoal(Verifier.java:1126)
     [exec] 	at org.apache.maven.it.Verifier.executeGoal(Verifier.java:1120)
     [exec] 	at org.apache.maven.it.MavenITmng3396DependencyManagementForOverConstrainedRangesTest.testitMNG3396(MavenITmng3396DependencyManagementForOverConstrainedRangesTest.java:61)
     [exec] 	at org.apache.maven.it.MavenITmng3396DependencyManagementForOverConstrainedRangesTest.testitMNG3396(MavenITmng3396DependencyManagementForOverConstrainedRangesTest.java:61)
     [exec] 	at sun.reflect.NativeMethodAccessorImpl.invoke0(Native Method)
     [exec] 	at sun.reflect.NativeMethodAccessorImpl.invoke(NativeMethodAccessorImpl.java:39)
     [exec] 	at sun.reflect.DelegatingMethodAccessorImpl.invoke(DelegatingMethodAccessorImpl.java:25)
     [exec] 	at java.lang.reflect.Method.invoke(Method.java:324)
     [exec] 	at junit.framework.TestCase.runTest(TestCase.java:164)
     [exec] 	at org.apache.maven.it.AbstractMavenIntegrationTestCase.runTest(AbstractMavenIntegrationTestCase.java:178)
     [exec] 	at junit.framework.TestCase.runBare(TestCase.java:130)
     [exec] 	at junit.framework.TestResult$1.protect(TestResult.java:106)
     [exec] 	at junit.framework.TestResult.runProtected(TestResult.java:124)
     [exec] 	at junit.framework.TestResult.run(TestResult.java:109)
     [exec] 	at junit.framework.TestCase.run(TestCase.java:120)
     [exec] 	at junit.framework.TestSuite.runTest(TestSuite.java:230)
     [exec] 	at junit.framework.TestSuite.run(TestSuite.java:225)
     [exec] 	at junit.framework.TestSuite.runTest(TestSuite.java:230)
     [exec] 	at junit.framework.TestSuite.run(TestSuite.java:225)
     [exec] 	at sun.reflect.NativeMethodAccessorImpl.invoke0(Native Method)
     [exec] 	at sun.reflect.NativeMethodAccessorImpl.invoke(NativeMethodAccessorImpl.java:39)
     [exec] 	at sun.reflect.DelegatingMethodAccessorImpl.invoke(DelegatingMethodAccessorImpl.java:25)
     [exec] 	at java.lang.reflect.Method.invoke(Method.java:324)
     [exec] 	at org.apache.maven.surefire.junit.JUnitTestSet.execute(JUnitTestSet.java:213)
     [exec] 	at org.apache.maven.surefire.suite.AbstractDirectoryTestSuite.executeTestSet(AbstractDirectoryTestSuite.java:138)
     [exec] 	at org.apache.maven.surefire.suite.AbstractDirectoryTestSuite.execute(AbstractDirectoryTestSuite.java:125)
     [exec] 	at org.apache.maven.surefire.Surefire.run(Surefire.java:132)
     [exec] 	at sun.reflect.NativeMethodAccessorImpl.invoke0(Native Method)
     [exec] 	at sun.reflect.NativeMethodAccessorImpl.invoke(NativeMethodAccessorImpl.java:39)
     [exec] 	at sun.reflect.DelegatingMethodAccessorImpl.invoke(DelegatingMethodAccessorImpl.java:25)
     [exec] 	at java.lang.reflect.Method.invoke(Method.java:324)
     [exec] 	at org.apache.maven.surefire.booter.SurefireBooter.runSuitesInProcess(SurefireBooter.java:290)
     [exec] 	at org.apache.maven.surefire.booter.SurefireBooter.run(SurefireBooter.java:198)
     [exec] 	at org.apache.maven.plugin.surefire.SurefirePlugin.execute(SurefirePlugin.java:398)
     [exec] 	at org.apache.maven.plugin.DefaultPluginManager.executeMojo(DefaultPluginManager.java:460)
     [exec] 	at org.apache.maven.lifecycle.DefaultLifecycleExecutor.executeGoals(DefaultLifecycleExecutor.java:677)
     [exec] 	at org.apache.maven.lifecycle.DefaultLifecycleExecutor.executeGoalWithLifecycle(DefaultLifecycleExecutor.java:539)
     [exec] 	at org.apache.maven.lifecycle.DefaultLifecycleExecutor.executeGoal(DefaultLifecycleExecutor.java:518)
     [exec] 	at org.apache.maven.lifecycle.DefaultLifecycleExecutor.executeGoalAndHandleFailures(DefaultLifecycleExecutor.java:370)
     [exec] 	at org.apache.maven.lifecycle.DefaultLifecycleExecutor.executeTaskSegments(DefaultLifecycleExecutor.java:331)
     [exec] 	at org.apache.maven.lifecycle.DefaultLifecycleExecutor.execute(DefaultLifecycleExecutor.java:181)
     [exec] 	at org.apache.maven.DefaultMaven.doExecute(DefaultMaven.java:345)
     [exec] 	at org.apache.maven.DefaultMaven.execute(DefaultMaven.java:132)
     [exec] 	at org.apache.maven.cli.MavenCli.main(MavenCli.java:299)
     [exec] 	at sun.reflect.NativeMethodAccessorImpl.invoke0(Native Method)
     [exec] 	at sun.reflect.NativeMethodAccessorImpl.invoke(NativeMethodAccessorImpl.java:39)
     [exec] 	at sun.reflect.DelegatingMethodAccessorImpl.invoke(DelegatingMethodAccessorImpl.java:25)
     [exec] 	at java.lang.reflect.Method.invoke(Method.java:324)
     [exec] 	at org.codehaus.classworlds.Launcher.launchEnhanced(Launcher.java:315)
     [exec] 	at org.codehaus.classworlds.Launcher.launch(Launcher.java:255)
     [exec] 	at org.codehaus.classworlds.Launcher.mainWithExitCode(Launcher.java:430)
     [exec] 	at org.codehaus.classworlds.Launcher.main(Launcher.java:375)
     [exec] 
     [exec] 
     [exec] Results :
     [exec] 
     [exec] Failed tests: 
     [exec]   testShouldNotRepeatedlyUpdateOnResourceNotFoundException(org.apache.maven.it.MavenITmng3415JunkRepositoryMetadataTest)
     [exec] 
     [exec] Tests in error: 
     [exec]   testitMNG3396(org.apache.maven.it.MavenITmng3396DependencyManagementForOverConstrainedRangesTest)
     [exec] 
     [exec] Tests run: 315, Failures: 1, Errors: 1, Skipped: 0
     [exec] 
     [exec] [INFO] ------------------------------------------------------------------------
     [exec] [ERROR] BUILD FAILURE
     [exec] [INFO] ------------------------------------------------------------------------
     [exec] [INFO] There are test failures.
     [exec] [INFO] ------------------------------------------------------------------------
     [exec] [INFO] Trace
     [exec] org.apache.maven.BuildFailureException: There are test failures.
     [exec] 	at org.apache.maven.lifecycle.DefaultLifecycleExecutor.executeGoals(DefaultLifecycleExecutor.java:698)
     [exec] 	at org.apache.maven.lifecycle.DefaultLifecycleExecutor.executeGoalWithLifecycle(DefaultLifecycleExecutor.java:539)
     [exec] 	at org.apache.maven.lifecycle.DefaultLifecycleExecutor.executeGoal(DefaultLifecycleExecutor.java:518)
     [exec] 	at org.apache.maven.lifecycle.DefaultLifecycleExecutor.executeGoalAndHandleFailures(DefaultLifecycleExecutor.java:370)
     [exec] 	at org.apache.maven.lifecycle.DefaultLifecycleExecutor.executeTaskSegments(DefaultLifecycleExecutor.java:331)
     [exec] 	at org.apache.maven.lifecycle.DefaultLifecycleExecutor.execute(DefaultLifecycleExecutor.java:181)
     [exec] 	at org.apache.maven.DefaultMaven.doExecute(DefaultMaven.java:345)
     [exec] 	at org.apache.maven.DefaultMaven.execute(DefaultMaven.java:132)
     [exec] 	at org.apache.maven.cli.MavenCli.main(MavenCli.java:299)
     [exec] 	at sun.reflect.NativeMethodAccessorImpl.invoke0(Native Method)
     [exec] 	at sun.reflect.NativeMethodAccessorImpl.invoke(NativeMethodAccessorImpl.java:39)
     [exec] 	at sun.reflect.DelegatingMethodAccessorImpl.invoke(DelegatingMethodAccessorImpl.java:25)
     [exec] 	at java.lang.reflect.Method.invoke(Method.java:324)
     [exec] 	at org.codehaus.classworlds.Launcher.launchEnhanced(Launcher.java:315)
     [exec] 	at org.codehaus.classworlds.Launcher.launch(Launcher.java:255)
     [exec] 	at org.codehaus.classworlds.Launcher.mainWithExitCode(Launcher.java:430)
     [exec] 	at org.codehaus.classworlds.Launcher.main(Launcher.java:375)
     [exec] Caused by: org.apache.maven.plugin.MojoFailureException: There are test failures.
     [exec] 	at org.apache.maven.plugin.surefire.SurefirePlugin.execute(SurefirePlugin.java:425)
     [exec] 	at org.apache.maven.plugin.DefaultPluginManager.executeMojo(DefaultPluginManager.java:460)
     [exec] 	at org.apache.maven.lifecycle.DefaultLifecycleExecutor.executeGoals(DefaultLifecycleExecutor.java:677)
     [exec] 	... 16 more
     [exec] [INFO] ------------------------------------------------------------------------
     [exec] [INFO] Total time: 23 minutes 16 seconds
     [exec] [INFO] Finished at: Sat Feb 07 04:42:14 CST 2009
     [exec] [INFO] Final Memory: 30M/59M
     [exec] [INFO] ------------------------------------------------------------------------

BUILD FAILED
http://grid.sonatype.org/ci/job/Maven-2.1.x-bootstrap/./jdk=1.4,label=osx/ws/maven-2.1.x/build.xml
:282: exec returned: 1

Total time: 25 minutes 26 seconds


Mime
View raw message