maven-notifications mailing list archives

Site index · List index
Message view « Date » · « Thread »
Top « Date » · « Thread »
From Hudson <Hud...@sonatype.org>
Subject Build failed in Hudson: Maven-2.1.x-bootstrap » 1.4,windows #72
Date Fri, 06 Feb 2009 14:44:33 GMT
See http://grid.sonatype.org/ci/job/Maven-2.1.x-bootstrap/./jdk=1.4,label=windows/72/changes

Changes:

[brett] [MNG-3719] restore POM ordering of plugin executions declared in separate plugin elements
Submitted by: Torben S. Giesselmann

[brett] [MNG-3808] Execution order of report plugins is arbitrary if inheritance is involved
Submitted by: Carlos Sanchez

------------------------------------------
[...truncated 4139 lines...]
     [exec] 	at java.lang.reflect.Method.invoke(Method.java:324)
     [exec] 	at org.apache.maven.surefire.booter.SurefireBooter.runSuitesInProcess(SurefireBooter.java:290)
     [exec] 	at org.apache.maven.surefire.booter.SurefireBooter.run(SurefireBooter.java:198)
     [exec] 	at org.apache.maven.plugin.surefire.SurefirePlugin.execute(SurefirePlugin.java:398)
     [exec] 	at org.apache.maven.plugin.DefaultPluginManager.executeMojo(DefaultPluginManager.java:460)
     [exec] 	at org.apache.maven.lifecycle.DefaultLifecycleExecutor.executeGoals(DefaultLifecycleExecutor.java:677)
     [exec] 	at org.apache.maven.lifecycle.DefaultLifecycleExecutor.executeGoalWithLifecycle(DefaultLifecycleExecutor.java:539)
     [exec] 	at org.apache.maven.lifecycle.DefaultLifecycleExecutor.executeGoal(DefaultLifecycleExecutor.java:518)
     [exec] 	at org.apache.maven.lifecycle.DefaultLifecycleExecutor.executeGoalAndHandleFailures(DefaultLifecycleExecutor.java:370)
     [exec] 	at org.apache.maven.lifecycle.DefaultLifecycleExecutor.executeTaskSegments(DefaultLifecycleExecutor.java:331)
     [exec] 	at org.apache.maven.lifecycle.DefaultLifecycleExecutor.execute(DefaultLifecycleExecutor.java:181)
     [exec] 	at org.apache.maven.DefaultMaven.doExecute(DefaultMaven.java:345)
     [exec] 	at org.apache.maven.DefaultMaven.execute(DefaultMaven.java:132)
     [exec] 	at org.apache.maven.cli.MavenCli.main(MavenCli.java:299)
     [exec] 	at sun.reflect.NativeMethodAccessorImpl.invoke0(Native Method)
     [exec] 	at sun.reflect.NativeMethodAccessorImpl.invoke(NativeMethodAccessorImpl.java:39)
     [exec] 	at sun.reflect.DelegatingMethodAccessorImpl.invoke(DelegatingMethodAccessorImpl.java:25)
     [exec] 	at java.lang.reflect.Method.invoke(Method.java:324)
     [exec] 	at org.codehaus.classworlds.Launcher.launchEnhanced(Launcher.java:315)
     [exec] 	at org.codehaus.classworlds.Launcher.launch(Launcher.java:255)
     [exec] 	at org.codehaus.classworlds.Launcher.mainWithExitCode(Launcher.java:430)
     [exec] 	at org.codehaus.classworlds.Launcher.main(Launcher.java:375)
     [exec] 
     [exec] testitMNG3899(org.apache.maven.it.MavenITmng3899ExtensionInheritanceTest)  Time
elapsed: 0.336 sec  <<< ERROR!
     [exec] java.io.IOException: File C:\opt\repos\local-repository\org\apache\maven\its\mng3899\a\0.2\a-0.2.jar
unable to be deleted.
     [exec] 	at org.apache.maven.it.util.FileUtils.forceDelete(FileUtils.java:1198)
     [exec] 	at org.apache.maven.it.util.FileUtils.cleanDirectory(FileUtils.java:1410)
     [exec] 	at org.apache.maven.it.util.FileUtils.deleteDirectory(FileUtils.java:1361)
     [exec] 	at org.apache.maven.it.util.FileUtils.forceDelete(FileUtils.java:1186)
     [exec] 	at org.apache.maven.it.util.FileUtils.cleanDirectory(FileUtils.java:1410)
     [exec] 	at org.apache.maven.it.util.FileUtils.deleteDirectory(FileUtils.java:1361)
     [exec] 	at org.apache.maven.it.util.FileUtils.forceDelete(FileUtils.java:1186)
     [exec] 	at org.apache.maven.it.util.FileUtils.cleanDirectory(FileUtils.java:1410)
     [exec] 	at org.apache.maven.it.util.FileUtils.deleteDirectory(FileUtils.java:1361)
     [exec] 	at org.apache.maven.it.Verifier.deleteArtifacts(Verifier.java:823)
     [exec] 	at org.apache.maven.it.MavenITmng3899ExtensionInheritanceTest.testitMNG3899(MavenITmng3899ExtensionInheritanceTest.java:54)
     [exec] 	at org.apache.maven.it.MavenITmng3899ExtensionInheritanceTest.testitMNG3899(MavenITmng3899ExtensionInheritanceTest.java:54)
     [exec] 	at sun.reflect.NativeMethodAccessorImpl.invoke0(Native Method)
     [exec] 	at sun.reflect.NativeMethodAccessorImpl.invoke(NativeMethodAccessorImpl.java:39)
     [exec] 	at sun.reflect.DelegatingMethodAccessorImpl.invoke(DelegatingMethodAccessorImpl.java:25)
     [exec] 	at java.lang.reflect.Method.invoke(Method.java:324)
     [exec] 	at junit.framework.TestCase.runTest(TestCase.java:164)
     [exec] 	at org.apache.maven.it.AbstractMavenIntegrationTestCase.runTest(AbstractMavenIntegrationTestCase.java:178)
     [exec] 	at junit.framework.TestCase.runBare(TestCase.java:130)
     [exec] 	at junit.framework.TestResult$1.protect(TestResult.java:106)
     [exec] 	at junit.framework.TestResult.runProtected(TestResult.java:124)
     [exec] 	at junit.framework.TestResult.run(TestResult.java:109)
     [exec] 	at junit.framework.TestCase.run(TestCase.java:120)
     [exec] 	at junit.framework.TestSuite.runTest(TestSuite.java:230)
     [exec] 	at junit.framework.TestSuite.run(TestSuite.java:225)
     [exec] 	at junit.framework.TestSuite.runTest(TestSuite.java:230)
     [exec] 	at junit.framework.TestSuite.run(TestSuite.java:225)
     [exec] 	at sun.reflect.NativeMethodAccessorImpl.invoke0(Native Method)
     [exec] 	at sun.reflect.NativeMethodAccessorImpl.invoke(NativeMethodAccessorImpl.java:39)
     [exec] 	at sun.reflect.DelegatingMethodAccessorImpl.invoke(DelegatingMethodAccessorImpl.java:25)
     [exec] 	at java.lang.reflect.Method.invoke(Method.java:324)
     [exec] 	at org.apache.maven.surefire.junit.JUnitTestSet.execute(JUnitTestSet.java:213)
     [exec] 	at org.apache.maven.surefire.suite.AbstractDirectoryTestSuite.executeTestSet(AbstractDirectoryTestSuite.java:138)
     [exec] 	at org.apache.maven.surefire.suite.AbstractDirectoryTestSuite.execute(AbstractDirectoryTestSuite.java:125)
     [exec] 	at org.apache.maven.surefire.Surefire.run(Surefire.java:132)
     [exec] 	at sun.reflect.NativeMethodAccessorImpl.invoke0(Native Method)
     [exec] 	at sun.reflect.NativeMethodAccessorImpl.invoke(NativeMethodAccessorImpl.java:39)
     [exec] 	at sun.reflect.DelegatingMethodAccessorImpl.invoke(DelegatingMethodAccessorImpl.java:25)
     [exec] 	at java.lang.reflect.Method.invoke(Method.java:324)
     [exec] 	at org.apache.maven.surefire.booter.SurefireBooter.runSuitesInProcess(SurefireBooter.java:290)
     [exec] 	at org.apache.maven.surefire.booter.SurefireBooter.run(SurefireBooter.java:198)
     [exec] 	at org.apache.maven.plugin.surefire.SurefirePlugin.execute(SurefirePlugin.java:398)
     [exec] 	at org.apache.maven.plugin.DefaultPluginManager.executeMojo(DefaultPluginManager.java:460)
     [exec] 	at org.apache.maven.lifecycle.DefaultLifecycleExecutor.executeGoals(DefaultLifecycleExecutor.java:677)
     [exec] 	at org.apache.maven.lifecycle.DefaultLifecycleExecutor.executeGoalWithLifecycle(DefaultLifecycleExecutor.java:539)
     [exec] 	at org.apache.maven.lifecycle.DefaultLifecycleExecutor.executeGoal(DefaultLifecycleExecutor.java:518)
     [exec] 	at org.apache.maven.lifecycle.DefaultLifecycleExecutor.executeGoalAndHandleFailures(DefaultLifecycleExecutor.java:370)
     [exec] 	at org.apache.maven.lifecycle.DefaultLifecycleExecutor.executeTaskSegments(DefaultLifecycleExecutor.java:331)
     [exec] 	at org.apache.maven.lifecycle.DefaultLifecycleExecutor.execute(DefaultLifecycleExecutor.java:181)
     [exec] 	at org.apache.maven.DefaultMaven.doExecute(DefaultMaven.java:345)
     [exec] 	at org.apache.maven.DefaultMaven.execute(DefaultMaven.java:132)
     [exec] 	at org.apache.maven.cli.MavenCli.main(MavenCli.java:299)
     [exec] 	at sun.reflect.NativeMethodAccessorImpl.invoke0(Native Method)
     [exec] 	at sun.reflect.NativeMethodAccessorImpl.invoke(NativeMethodAccessorImpl.java:39)
     [exec] 	at sun.reflect.DelegatingMethodAccessorImpl.invoke(DelegatingMethodAccessorImpl.java:25)
     [exec] 	at java.lang.reflect.Method.invoke(Method.java:324)
     [exec] 	at org.codehaus.classworlds.Launcher.launchEnhanced(Launcher.java:315)
     [exec] 	at org.codehaus.classworlds.Launcher.launch(Launcher.java:255)
     [exec] 	at org.codehaus.classworlds.Launcher.mainWithExitCode(Launcher.java:430)
     [exec] 	at org.codehaus.classworlds.Launcher.main(Launcher.java:375)
     [exec] 
     [exec] testitMNG3743(org.apache.maven.it.MavenITmng3743ForkWithPluginManagementTest)
 Time elapsed: 14.004 sec  <<< ERROR!
     [exec] org.apache.maven.it.VerificationException: Exit code was non-zero: 1; command
line and log = 
     [exec] C:\tmp\apache-maven-2.1.0-M2-SNAPSHOT\bin\mvn -e --batch-mode -Dmaven.repo.local=C:\opt\repos\local-repository
org.apache.maven.plugins:maven-clean-plugin:clean site
     [exec] + Error stacktraces are turned on.
     [exec] [INFO] Scanning for projects...
     [exec] [INFO] ------------------------------------------------------------------------
     [exec] [INFO] Building Integration Test Project for MNG-3743
     [exec] [INFO]    task-segment: [org.apache.maven.plugins:maven-clean-plugin:clean, site]
     [exec] [INFO] ------------------------------------------------------------------------
     [exec] [INFO] [clean:clean]
     [exec] [INFO] Preparing mng3743-report:report
     [exec] [INFO] artifact org.apache.maven.its.mng3743:maven-mng3743-check-plugin: checking
for updates from central
     [exec] [INFO] Reloading plugin container for: org.apache.maven.its.mng3743:maven-mng3743-report-plugin.
The plugin artifact has changed.
     [exec] [INFO] [mng3743-check:check]
     [exec] [INFO] MNG-3743 check succeeded.
     [exec] [INFO] [site:site]
     [exec] [INFO] artifact org.apache.maven.skins:maven-default-skin: checking for updates
from central
     [exec] [INFO] Generating "mng3743" report.
     [exec] [FATAL ERROR] org.apache.maven.plugins.site.SiteMojo#execute() caused a linkage
error (java.lang.NoClassDefFoundError) and may be out-of-date. Check the realms:
     [exec] [FATAL ERROR] Plugin realm = app0.child-container[org.apache.maven.plugins:maven-site-plugin]
     [exec] urls[0] = file:/C:/opt/repos/local-repository/org/apache/maven/plugins/maven-site-plugin/2.0-beta-7/maven-site-plugin-2.0-beta-7.jar
     [exec] urls[1] = file:/C:/opt/repos/local-repository/org/codehaus/plexus/plexus-utils/1.5.1/plexus-utils-1.5.1.jar
     [exec] urls[2] = file:/C:/opt/repos/local-repository/org/apache/maven/doxia/doxia-module-xhtml/1.0-alpha-11/doxia-module-xhtml-1.0-alpha-11.jar
     [exec] urls[3] = file:/C:/opt/repos/local-repository/org/apache/maven/doxia/doxia-core/1.0-alpha-11/doxia-core-1.0-alpha-11.jar
     [exec] urls[4] = file:/C:/opt/repos/local-repository/org/apache/maven/doxia/doxia-decoration-model/1.0-alpha-11/doxia-decoration-model-1.0-alpha-11.jar
     [exec] urls[5] = file:/C:/opt/repos/local-repository/org/apache/maven/doxia/doxia-site-renderer/1.0-alpha-11/doxia-site-renderer-1.0-alpha-11.jar
     [exec] urls[6] = file:/C:/opt/repos/local-repository/org/codehaus/plexus/plexus-i18n/1.0-beta-7/plexus-i18n-1.0-beta-7.jar
     [exec] urls[7] = file:/C:/opt/repos/local-repository/org/codehaus/plexus/plexus-velocity/1.1.7/plexus-velocity-1.1.7.jar
     [exec] urls[8] = file:/C:/opt/repos/local-repository/org/apache/velocity/velocity/1.5/velocity-1.5.jar
     [exec] urls[9] = file:/C:/opt/repos/local-repository/commons-collections/commons-collections/3.2/commons-collections-3.2.jar
     [exec] urls[10] = file:/C:/opt/repos/local-repository/commons-lang/commons-lang/2.1/commons-lang-2.1.jar
     [exec] urls[11] = file:/C:/opt/repos/local-repository/oro/oro/2.0.8/oro-2.0.8.jar
     [exec] urls[12] = file:/C:/opt/repos/local-repository/org/apache/maven/doxia/doxia-module-apt/1.0-alpha-11/doxia-module-apt-1.0-alpha-11.jar
     [exec] urls[13] = file:/C:/opt/repos/local-repository/org/apache/maven/doxia/doxia-module-fml/1.0-alpha-11/doxia-module-fml-1.0-alpha-11.jar
     [exec] urls[14] = file:/C:/opt/repos/local-repository/org/apache/maven/doxia/doxia-module-xdoc/1.0-alpha-11/doxia-module-xdoc-1.0-alpha-11.jar
     [exec] urls[15] = file:/C:/opt/repos/local-repository/org/apache/maven/shared/maven-doxia-tools/1.0.1/maven-doxia-tools-1.0.1.jar
     [exec] urls[16] = file:/C:/opt/repos/local-repository/commons-io/commons-io/1.4/commons-io-1.4.jar
     [exec] urls[17] = file:/C:/opt/repos/local-repository/org/codehaus/plexus/plexus-archiver/1.0-alpha-7/plexus-archiver-1.0-alpha-7.jar
     [exec] urls[18] = file:/C:/opt/repos/local-repository/org/mortbay/jetty/jetty/6.1.5/jetty-6.1.5.jar
     [exec] urls[19] = file:/C:/opt/repos/local-repository/org/mortbay/jetty/jetty-util/6.1.5/jetty-util-6.1.5.jar
     [exec] urls[20] = file:/C:/opt/repos/local-repository/org/mortbay/jetty/servlet-api-2.5/6.1.5/servlet-api-2.5-6.1.5.jar
     [exec] [FATAL ERROR] Container realm = plexus.core
     [exec] urls[0] = file:/C:/tmp/apache-maven-2.1.0-M2-SNAPSHOT/lib/maven-2.1.0-M2-SNAPSHOT-uber.jar
     [exec] urls[1] = file:/C:/opt/repos/local-repository/org/apache/maven/its/mng3743/mng3743-lifecycle/1/mng3743-lifecycle-1.jar
     [exec] urls[2] = file:/C:/opt/repos/local-repository/org/codehaus/plexus/plexus-utils/1.1/plexus-utils-1.1.jar
     [exec] [INFO] ------------------------------------------------------------------------
     [exec] [ERROR] FATAL ERROR
     [exec] [INFO] ------------------------------------------------------------------------
     [exec] [INFO] org/apache/maven/plugin/logging/Log
     [exec] [INFO] ------------------------------------------------------------------------
     [exec] [INFO] Trace
     [exec] java.lang.NoClassDefFoundError: org/apache/maven/plugin/logging/Log
     [exec] 	at jar.ForkingReport.executeReport(ForkingReport.java:53)
     [exec] 	at org.apache.maven.reporting.AbstractMavenReport.generate(AbstractMavenReport.java:90)
     [exec] 	at org.apache.maven.plugins.site.ReportDocumentRenderer.renderDocument(ReportDocumentRenderer.java:139)
     [exec] 	at org.apache.maven.doxia.siterenderer.DefaultSiteRenderer.renderModule(DefaultSiteRenderer.java:269)
     [exec] 	at org.apache.maven.doxia.siterenderer.DefaultSiteRenderer.render(DefaultSiteRenderer.java:101)
     [exec] 	at org.apache.maven.plugins.site.SiteMojo.renderLocale(SiteMojo.java:133)
     [exec] 	at org.apache.maven.plugins.site.SiteMojo.execute(SiteMojo.java:100)
     [exec] 	at org.apache.maven.plugin.DefaultPluginManager.executeMojo(DefaultPluginManager.java:460)
     [exec] 	at org.apache.maven.lifecycle.DefaultLifecycleExecutor.executeGoals(DefaultLifecycleExecutor.java:677)
     [exec] 	at org.apache.maven.lifecycle.DefaultLifecycleExecutor.executeGoalWithLifecycle(DefaultLifecycleExecutor.java:539)
     [exec] 	at org.apache.maven.lifecycle.DefaultLifecycleExecutor.executeGoal(DefaultLifecycleExecutor.java:518)
     [exec] 	at org.apache.maven.lifecycle.DefaultLifecycleExecutor.executeGoalAndHandleFailures(DefaultLifecycleExecutor.java:370)
     [exec] 	at org.apache.maven.lifecycle.DefaultLifecycleExecutor.executeTaskSegments(DefaultLifecycleExecutor.java:331)
     [exec] 	at org.apache.maven.lifecycle.DefaultLifecycleExecutor.execute(DefaultLifecycleExecutor.java:181)
     [exec] 	at org.apache.maven.DefaultMaven.doExecute(DefaultMaven.java:345)
     [exec] 	at org.apache.maven.DefaultMaven.execute(DefaultMaven.java:132)
     [exec] 	at org.apache.maven.cli.MavenCli.main(MavenCli.java:299)
     [exec] 	at sun.reflect.NativeMethodAccessorImpl.invoke0(Native Method)
     [exec] 	at sun.reflect.NativeMethodAccessorImpl.invoke(NativeMethodAccessorImpl.java:39)
     [exec] 	at sun.reflect.DelegatingMethodAccessorImpl.invoke(DelegatingMethodAccessorImpl.java:25)
     [exec] 	at java.lang.reflect.Method.invoke(Method.java:324)
     [exec] 	at org.codehaus.classworlds.Launcher.launchEnhanced(Launcher.java:315)
     [exec] 	at org.codehaus.classworlds.Launcher.launch(Launcher.java:255)
     [exec] 	at org.codehaus.classworlds.Launcher.mainWithExitCode(Launcher.java:430)
     [exec] 	at org.codehaus.classworlds.Launcher.main(Launcher.java:375)
     [exec] [INFO] ------------------------------------------------------------------------
     [exec] [INFO] Total time: 4 seconds
     [exec] [INFO] Finished at: Fri Feb 06 08:30:31 CST 2009
     [exec] [INFO] Final Memory: 12M/22M
     [exec] [INFO] ------------------------------------------------------------------------
     [exec] 
     [exec] 	at org.apache.maven.it.Verifier.executeGoals(Verifier.java:1274)
     [exec] 	at org.apache.maven.it.Verifier.executeGoal(Verifier.java:1126)
     [exec] 	at org.apache.maven.it.Verifier.executeGoal(Verifier.java:1120)
     [exec] 	at org.apache.maven.it.MavenITmng3743ForkWithPluginManagementTest.testitMNG3743(MavenITmng3743ForkWithPluginManagementTest.java:57)
     [exec] 	at org.apache.maven.it.MavenITmng3743ForkWithPluginManagementTest.testitMNG3743(MavenITmng3743ForkWithPluginManagementTest.java:57)
     [exec] 	at sun.reflect.NativeMethodAccessorImpl.invoke0(Native Method)
     [exec] 	at sun.reflect.NativeMethodAccessorImpl.invoke(NativeMethodAccessorImpl.java:39)
     [exec] 	at sun.reflect.DelegatingMethodAccessorImpl.invoke(DelegatingMethodAccessorImpl.java:25)
     [exec] 	at java.lang.reflect.Method.invoke(Method.java:324)
     [exec] 	at junit.framework.TestCase.runTest(TestCase.java:164)
     [exec] 	at org.apache.maven.it.AbstractMavenIntegrationTestCase.runTest(AbstractMavenIntegrationTestCase.java:178)
     [exec] 	at junit.framework.TestCase.runBare(TestCase.java:130)
     [exec] 	at junit.framework.TestResult$1.protect(TestResult.java:106)
     [exec] 	at junit.framework.TestResult.runProtected(TestResult.java:124)
     [exec] 	at junit.framework.TestResult.run(TestResult.java:109)
     [exec] 	at junit.framework.TestCase.run(TestCase.java:120)
     [exec] 	at junit.framework.TestSuite.runTest(TestSuite.java:230)
     [exec] 	at junit.framework.TestSuite.run(TestSuite.java:225)
     [exec] 	at junit.framework.TestSuite.runTest(TestSuite.java:230)
     [exec] 	at junit.framework.TestSuite.run(TestSuite.java:225)
     [exec] 	at sun.reflect.NativeMethodAccessorImpl.invoke0(Native Method)
     [exec] 	at sun.reflect.NativeMethodAccessorImpl.invoke(NativeMethodAccessorImpl.java:39)
     [exec] 	at sun.reflect.DelegatingMethodAccessorImpl.invoke(DelegatingMethodAccessorImpl.java:25)
     [exec] 	at java.lang.reflect.Method.invoke(Method.java:324)
     [exec] 	at org.apache.maven.surefire.junit.JUnitTestSet.execute(JUnitTestSet.java:213)
     [exec] 	at org.apache.maven.surefire.suite.AbstractDirectoryTestSuite.executeTestSet(AbstractDirectoryTestSuite.java:138)
     [exec] 	at org.apache.maven.surefire.suite.AbstractDirectoryTestSuite.execute(AbstractDirectoryTestSuite.java:125)
     [exec] 	at org.apache.maven.surefire.Surefire.run(Surefire.java:132)
     [exec] 	at sun.reflect.NativeMethodAccessorImpl.invoke0(Native Method)
     [exec] 	at sun.reflect.NativeMethodAccessorImpl.invoke(NativeMethodAccessorImpl.java:39)
     [exec] 	at sun.reflect.DelegatingMethodAccessorImpl.invoke(DelegatingMethodAccessorImpl.java:25)
     [exec] 	at java.lang.reflect.Method.invoke(Method.java:324)
     [exec] 	at org.apache.maven.surefire.booter.SurefireBooter.runSuitesInProcess(SurefireBooter.java:290)
     [exec] 	at org.apache.maven.surefire.booter.SurefireBooter.run(SurefireBooter.java:198)
     [exec] 	at org.apache.maven.plugin.surefire.SurefirePlugin.execute(SurefirePlugin.java:398)
     [exec] 	at org.apache.maven.plugin.DefaultPluginManager.executeMojo(DefaultPluginManager.java:460)
     [exec] 	at org.apache.maven.lifecycle.DefaultLifecycleExecutor.executeGoals(DefaultLifecycleExecutor.java:677)
     [exec] 	at org.apache.maven.lifecycle.DefaultLifecycleExecutor.executeGoalWithLifecycle(DefaultLifecycleExecutor.java:539)
     [exec] 	at org.apache.maven.lifecycle.DefaultLifecycleExecutor.executeGoal(DefaultLifecycleExecutor.java:518)
     [exec] 	at org.apache.maven.lifecycle.DefaultLifecycleExecutor.executeGoalAndHandleFailures(DefaultLifecycleExecutor.java:370)
     [exec] 	at org.apache.maven.lifecycle.DefaultLifecycleExecutor.executeTaskSegments(DefaultLifecycleExecutor.java:331)
     [exec] 	at org.apache.maven.lifecycle.DefaultLifecycleExecutor.execute(DefaultLifecycleExecutor.java:181)
     [exec] 	at org.apache.maven.DefaultMaven.doExecute(DefaultMaven.java:345)
     [exec] 	at org.apache.maven.DefaultMaven.execute(DefaultMaven.java:132)
     [exec] 	at org.apache.maven.cli.MavenCli.main(MavenCli.java:299)
     [exec] 	at sun.reflect.NativeMethodAccessorImpl.invoke0(Native Method)
     [exec] 	at sun.reflect.NativeMethodAccessorImpl.invoke(NativeMethodAccessorImpl.java:39)
     [exec] 	at sun.reflect.DelegatingMethodAccessorImpl.invoke(DelegatingMethodAccessorImpl.java:25)
     [exec] 	at java.lang.reflect.Method.invoke(Method.java:324)
     [exec] 	at org.codehaus.classworlds.Launcher.launchEnhanced(Launcher.java:315)
     [exec] 	at org.codehaus.classworlds.Launcher.launch(Launcher.java:255)
     [exec] 	at org.codehaus.classworlds.Launcher.mainWithExitCode(Launcher.java:430)
     [exec] 	at org.codehaus.classworlds.Launcher.main(Launcher.java:375)
     [exec] 
     [exec] 
     [exec] Results :
     [exec] 
     [exec] Tests in error: 
     [exec]   testitMNG3906(org.apache.maven.it.MavenITmng3906MergedPluginClassPathOrderingTest)
     [exec]   testitMNG3899(org.apache.maven.it.MavenITmng3899ExtensionInheritanceTest)
     [exec]   testitMNG3743(org.apache.maven.it.MavenITmng3743ForkWithPluginManagementTest)
     [exec] 
     [exec] Tests run: 313, Failures: 0, Errors: 3, Skipped: 0
     [exec] 
     [exec] [INFO] ------------------------------------------------------------------------
     [exec] [ERROR] BUILD FAILURE
     [exec] [INFO] ------------------------------------------------------------------------
     [exec] [INFO] There are test failures.
     [exec] [INFO] ------------------------------------------------------------------------
     [exec] [INFO] For more information, run Maven with the -e switch
     [exec] [INFO] ------------------------------------------------------------------------
     [exec] [INFO] Total time: 19 minutes 44 seconds
     [exec] [INFO] Finished at: Fri Feb 06 08:44:39 CST 2009
     [exec] [INFO] Final Memory: 28M/67M
     [exec] [INFO] ------------------------------------------------------------------------

BUILD FAILED
H:\home_hudson\.hudson\workspace\Maven-2.1.x-bootstrap\jdk\1.4\label\windows\maven-2.1.x\build.xml:252:
exec returned: 1

Total time: 25 minutes 25 seconds


Mime
View raw message