maven-notifications mailing list archives

Site index · List index
Message view « Date » · « Thread »
Top « Date » · « Thread »
From Hudson <Hud...@sonatype.org>
Subject Build failed in Hudson: wagon » 1.5,windows #22
Date Thu, 19 Feb 2009 14:46:45 GMT
See http://grid.sonatype.org/ci/job/wagon/./jdk=1.5,label=windows/22/changes

Changes:

[Brett Porter] [maven-release-plugin] prepare for next development iteration

[Brett Porter] [maven-release-plugin] prepare release wagon-1.0-beta-5

[Brett Porter] use staged parent for release

------------------------------------------
started
Building remotely on vista2
Updating http://svn.apache.org/repos/asf/maven/wagon/trunk
U         wagon-provider-test\pom.xml
U         wagon-providers\wagon-ftp\pom.xml
U         wagon-providers\wagon-http-lightweight\pom.xml
U         wagon-providers\wagon-ssh\pom.xml
U         wagon-providers\wagon-ssh-external\pom.xml
U         wagon-providers\wagon-file\pom.xml
U         wagon-providers\wagon-http\pom.xml
U         wagon-providers\wagon-ssh-common-test\pom.xml
U         wagon-providers\pom.xml
U         wagon-providers\wagon-scm\pom.xml
U         wagon-providers\wagon-webdav-jackrabbit\pom.xml
U         wagon-providers\wagon-http-shared\pom.xml
U         wagon-providers\wagon-ssh-common\pom.xml
U         pom.xml
U         wagon-provider-api\pom.xml
At revision 745887
[trunk] $ \opt\maven\apache-maven-2.1.0-M1\bin\mvn.bat -Dlabel=windows -Djdk=1.5 clean install
-B -U -e -fae -Dmaven.repo.local=/opt/repos/wagon
+ Error stacktraces are turned on.
[INFO] Scanning for projects...
Downloading: http://repository.sonatype.org:8081/content/groups/public/org/apache/maven/maven-parent/11/maven-parent-11.pom
Downloading: http://repository.sonatype.org:8081/content/groups/public/org/apache/maven/maven-parent/11/maven-parent-11.pom
[INFO] ------------------------------------------------------------------------
[ERROR] FATAL ERROR
[INFO] ------------------------------------------------------------------------
[INFO] Failed to resolve artifact.

GroupId: org.apache.maven
ArtifactId: maven-parent
Version: 11

Reason: Unable to download the artifact from any repository

  org.apache.maven:maven-parent:pom:11

from the specified remote repositories:
  Nexus (http://repository.sonatype.org:8081/content/groups/public)



[INFO] ------------------------------------------------------------------------
[INFO] Trace
org.apache.maven.reactor.MavenExecutionException: Cannot find parent: org.apache.maven:maven-parent
for project: org.apache.maven.wagon:wagon:pom:1.0-SNAPSHOT for project org.apache.maven.wagon:wagon:pom:1.0-SNAPSHOT
	at org.apache.maven.DefaultMaven.getProjects(DefaultMaven.java:378)
	at org.apache.maven.DefaultMaven.doExecute(DefaultMaven.java:292)
	at org.apache.maven.DefaultMaven.execute(DefaultMaven.java:129)
	at org.apache.maven.cli.MavenCli.main(MavenCli.java:302)
	at sun.reflect.NativeMethodAccessorImpl.invoke0(Native Method)
	at sun.reflect.NativeMethodAccessorImpl.invoke(NativeMethodAccessorImpl.java:39)
	at sun.reflect.DelegatingMethodAccessorImpl.invoke(DelegatingMethodAccessorImpl.java:25)
	at java.lang.reflect.Method.invoke(Method.java:585)
	at org.codehaus.classworlds.Launcher.launchEnhanced(Launcher.java:315)
	at org.codehaus.classworlds.Launcher.launch(Launcher.java:255)
	at org.codehaus.classworlds.Launcher.mainWithExitCode(Launcher.java:430)
	at org.codehaus.classworlds.Launcher.main(Launcher.java:375)
Caused by: org.apache.maven.project.ProjectBuildingException: Cannot find parent: org.apache.maven:maven-parent
for project: org.apache.maven.wagon:wagon:pom:1.0-SNAPSHOT for project org.apache.maven.wagon:wagon:pom:1.0-SNAPSHOT
	at org.apache.maven.project.DefaultMavenProjectBuilder.assembleLineage(DefaultMavenProjectBuilder.java:1398)
	at org.apache.maven.project.DefaultMavenProjectBuilder.buildInternal(DefaultMavenProjectBuilder.java:824)
	at org.apache.maven.project.DefaultMavenProjectBuilder.buildFromSourceFileInternal(DefaultMavenProjectBuilder.java:509)
	at org.apache.maven.project.DefaultMavenProjectBuilder.build(DefaultMavenProjectBuilder.java:201)
	at org.apache.maven.DefaultMaven.getProject(DefaultMaven.java:578)
	at org.apache.maven.DefaultMaven.collectProjects(DefaultMaven.java:461)
	at org.apache.maven.DefaultMaven.getProjects(DefaultMaven.java:365)
	... 11 more
Caused by: org.apache.maven.project.ProjectBuildingException: POM 'org.apache.maven:maven-parent'
not found in repository: Unable to download the artifact from any repository

  org.apache.maven:maven-parent:pom:11

from the specified remote repositories:
  Nexus (http://repository.sonatype.org:8081/content/groups/public)

 for project org.apache.maven:maven-parent
	at org.apache.maven.project.DefaultMavenProjectBuilder.findModelFromRepository(DefaultMavenProjectBuilder.java:606)
	at org.apache.maven.project.DefaultMavenProjectBuilder.assembleLineage(DefaultMavenProjectBuilder.java:1394)
	... 17 more
Caused by: org.apache.maven.artifact.resolver.ArtifactNotFoundException: Unable to download
the artifact from any repository

  org.apache.maven:maven-parent:pom:11

from the specified remote repositories:
  Nexus (http://repository.sonatype.org:8081/content/groups/public)


	at org.apache.maven.artifact.resolver.DefaultArtifactResolver.resolve(DefaultArtifactResolver.java:212)
	at org.apache.maven.artifact.resolver.DefaultArtifactResolver.resolve(DefaultArtifactResolver.java:74)
	at org.apache.maven.project.DefaultMavenProjectBuilder.findModelFromRepository(DefaultMavenProjectBuilder.java:559)
	... 18 more
Caused by: org.apache.maven.wagon.ResourceDoesNotExistException: Unable to download the artifact
from any repository
	at org.apache.maven.artifact.manager.DefaultWagonManager.getArtifact(DefaultWagonManager.java:350)
	at org.apache.maven.artifact.resolver.DefaultArtifactResolver.resolve(DefaultArtifactResolver.java:200)
	... 20 more
[INFO] ------------------------------------------------------------------------
[INFO] Total time: < 1 second
[INFO] Finished at: Thu Feb 19 06:46:32 PST 2009
[INFO] Final Memory: 1M/2M
[INFO] ------------------------------------------------------------------------


Mime
View raw message