maven-notifications mailing list archives

Site index · List index
Message view « Date » · « Thread »
Top « Date » · « Thread »
From Apache Hudson Server <hud...@hudson.zones.apache.org>
Subject Build failed in Hudson: Maven-2.1.x-with-bootstrap #298
Date Wed, 04 Feb 2009 17:21:20 GMT
See http://hudson.zones.apache.org/hudson/job/Maven-2.1.x-with-bootstrap/298/changes

Changes:

[sisbell] Fixed broken poms.

------------------------------------------
[...truncated 2024 lines...]
     [java] -------------------------------------------------------
     [java] Running org.apache.maven.AppTest
     [java] Tests run: 1, Failures: 0, Errors: 0, Skipped: 0, Time elapsed: 0.034 sec
     [java] 
     [java] Results :
     [java] 
     [java] Tests run: 1, Failures: 0, Errors: 0, Skipped: 0
     [java] 
     [java] [INFO] [jar:jar]
     [java] [INFO] Building jar: /zonestorage/hudson/home/hudson/hudson/jobs/Maven-2.1.x-with-bootstrap/workspace/trunk/maven-embedder/target/embedder-test-project1/target/embedder-test-project-1.0-SNAPSHOT.jar
     [java] [INFO] Scanning for projects...
     [java] [INFO] ------------------------------------------------------------------------
     [java] [INFO] Building Maven Quick Start Archetype
     [java] [INFO] 
     [java] [INFO] Id: org.apache.maven:embedder-test-project:jar:1.0-SNAPSHOT
     [java] [INFO] task-segment: [validate]
     [java] [INFO] ------------------------------------------------------------------------
     [java] [INFO] Scanning for projects...
     [java] [INFO] ------------------------------------------------------------------------
     [java] [INFO] Building Maven Quick Start Archetype
     [java] [INFO] 
     [java] [INFO] Id: org.apache.maven:embedder-test-project:jar:1.0-SNAPSHOT
     [java] [INFO] task-segment: [validate]
     [java] [INFO] ------------------------------------------------------------------------
     [java] [INFO] Scanning for projects...
     [java] [INFO] ------------------------------------------------------------------------
     [java] [INFO] Building Maven Quick Start Archetype
     [java] [INFO] 
     [java] [INFO] Id: org.apache.maven:embedder-test-project:jar:1.0-SNAPSHOT
     [java] [INFO] task-segment: [package]
     [java] [INFO] ------------------------------------------------------------------------
     [java] [INFO] [resources:resources]
     [java] [INFO] Using default encoding to copy filtered resources.
     [java] [INFO] [compiler:compile]
     [java] [INFO] Compiling 1 source file to /zonestorage/hudson/home/hudson/hudson/jobs/Maven-2.1.x-with-bootstrap/workspace/trunk/maven-embedder/target/embedder-test-project-caching/target/classes
     [java] [INFO] [resources:testResources]
     [java] [INFO] Using default encoding to copy filtered resources.
     [java] [INFO] [compiler:testCompile]
     [java] [INFO] Compiling 1 source file to /zonestorage/hudson/home/hudson/hudson/jobs/Maven-2.1.x-with-bootstrap/workspace/trunk/maven-embedder/target/embedder-test-project-caching/target/test-classes
     [java] [INFO] [surefire:test]
     [java] [INFO] Surefire report directory: /zonestorage/hudson/home/hudson/hudson/jobs/Maven-2.1.x-with-bootstrap/workspace/trunk/maven-embedder/target/embedder-test-project-caching/target/surefire-reports
     [java] 
     [java] -------------------------------------------------------
     [java]  T E S T S
     [java] -------------------------------------------------------
     [java] Running org.apache.maven.AppTest
     [java] Tests run: 1, Failures: 0, Errors: 0, Skipped: 0, Time elapsed: 0.066 sec
     [java] 
     [java] Results :
     [java] Tests run: 1, Failures: 0, Errors: 0, Skipped: 0
     [java] 
     [java] [INFO] [jar:jar]
     [java] [INFO] Building jar: /zonestorage/hudson/home/hudson/hudson/jobs/Maven-2.1.x-with-bootstrap/workspace/trunk/maven-embedder/target/embedder-test-project-caching/target/embedder-test-project-1.0-SNAPSHOT.jar
     [java] [INFO] Scanning for projects...
     [java] [INFO] ------------------------------------------------------------------------
     [java] [INFO] Building Maven Quick Start Archetype
     [java] [INFO] 
     [java] [INFO] Id: org.apache.maven:embedder-test-project:jar:1.0-SNAPSHOT
     [java] [INFO] task-segment: [package]
     [java] [INFO] ------------------------------------------------------------------------
     [java] [INFO] [resources:resources]
     [java] [INFO] Using default encoding to copy filtered resources.
     [java] [INFO] [compiler:compile]
     [java] [INFO] Nothing to compile - all classes are up to date
     [java] [INFO] [resources:testResources]
     [java] [INFO] Using default encoding to copy filtered resources.
     [java] [INFO] [compiler:testCompile]
     [java] [INFO] Nothing to compile - all classes are up to date
     [java] [INFO] [surefire:test]
     [java] [INFO] Surefire report directory: /zonestorage/hudson/home/hudson/hudson/jobs/Maven-2.1.x-with-bootstrap/workspace/trunk/maven-embedder/target/embedder-test-project-caching/target/surefire-reports
     [java] 
     [java] -------------------------------------------------------
     [java]  T E S T S
     [java] -------------------------------------------------------
     [java] Running org.apache.maven.AppTest
     [java] Tests run: 1, Failures: 0, Errors: 0, Skipped: 0, Time elapsed: 0.038 sec
     [java] 
     [java] Results :
     [java] 
     [java] Tests run: 1, Failures: 0, Errors: 0, Skipped: 0
     [java] 
     [java] [INFO] [jar:jar]
     [java] Tests run: 17, Failures: 0, Errors: 0, Skipped: 0, Time elapsed: 11.674 sec
     [java] Running org.apache.maven.embedder.MavenEmbedderExampleTest
     [java] Tests run: 2, Failures: 0, Errors: 0, Skipped: 0, Time elapsed: 0.194 sec
     [java] Running org.apache.maven.cli.CLIRequestUtilsTest
     [java] key=value
     [java] []
     [java] Tests run: 2, Failures: 0, Errors: 0, Skipped: 0, Time elapsed: 0.181 sec
     [java] 
     [java] Results :
     [java] 
     [java] Tests run: 58, Failures: 0, Errors: 0, Skipped: 0
     [java] 
     [java] [INFO] [jar:jar]
     [java] [INFO] Building jar: /zonestorage/hudson/home/hudson/hudson/jobs/Maven-2.1.x-with-bootstrap/workspace/trunk/maven-embedder/target/maven-embedder-3.0-SNAPSHOT.jar
     [java] [INFO] [install:install]
     [java] [INFO] Installing /zonestorage/hudson/home/hudson/hudson/jobs/Maven-2.1.x-with-bootstrap/workspace/trunk/maven-embedder/target/maven-embedder-3.0-SNAPSHOT.jar
to /export/home/hudson/.m2/repository/org/apache/maven/maven-embedder/3.0-SNAPSHOT/maven-embedder-3.0-SNAPSHOT.jar
     [java] [INFO] ------------------------------------------------------------------------
     [java] [INFO] Building Maven Distribution
     [java] [INFO] 
     [java] [INFO] Id: org.apache.maven:apache-maven:jar:3.0-SNAPSHOT
     [java] [INFO] task-segment: [clean, install]
     [java] [INFO] ------------------------------------------------------------------------
     [java] [INFO] [clean:clean]
     [java] [INFO] snapshot org.apache.maven:maven-embedder:3.0-SNAPSHOT: checking for updates
from apache.snapshots
     [java] url = http://people.apache.org/repo/m2-snapshot-repository
     [java] Downloading: http://people.apache.org/repo/m2-snapshot-repository/org/apache/maven/mercury/mercury-event/1.0.0-alpha-4-SNAPSHOT/mercury-event-1.0.0-alpha-4-SNAPSHOT.jar
     [java] [INFO] 
     [java] [INFO] 
     [java] [INFO] ------------------------------------------------------------------------
     [java] [INFO] Reactor Summary:
     [java] [INFO] ------------------------------------------------------------------------
     [java] [INFO] Apache Maven .......................................... SUCCESS [6.227s]
     [java] [INFO] Maven Lifecycle Model ................................. SUCCESS [8.609s]
     [java] [INFO] Maven Reporting API ................................... SUCCESS [2.946s]
     [java] [INFO] Maven Model ........................................... SUCCESS [7.272s]
     [java] [INFO] Maven Compat .......................................... SUCCESS [27.902s]
     [java] [INFO] Maven Plugin API ...................................... SUCCESS [5.686s]
     [java] [INFO] Maven Project Builder ................................. SUCCESS [6.339s]
     [java] [INFO] Maven Mercury ......................................... SUCCESS [10.022s]
     [java] [INFO] Maven Project ......................................... SUCCESS [22.176s]
     [java] [INFO] Maven Core ............................................ SUCCESS [25.451s]
     [java] [INFO] Maven Toolchains ...................................... SUCCESS [4.134s]
     [java] [INFO] Maven Embedder ........................................ SUCCESS [49.762s]
     [java] [INFO] Maven Distribution .................................... FAILED [3.772s]
     [java] [INFO] ------------------------------------------------------------------------
     [java] [ERROR] 
     [java] Missing:
     [java] ----------
     [java] 1) org.apache.maven.mercury:mercury-event:jar:1.0.0-alpha-4-SNAPSHOT
     [java] 
     [java]   Try downloading the file manually from the project website.
     [java] 
     [java]   Then, install it using the command: 
     [java]       mvn install:install-file -DgroupId=org.apache.maven.mercury -DartifactId=mercury-event
-Dversion=1.0.0-alpha-4-SNAPSHOT -Dpackaging=jar -Dfile=/path/to/file
     [java] 
     [java]   Alternatively, if you host your own repository you can deploy the file there:

     [java]       mvn deploy:deploy-file -DgroupId=org.apache.maven.mercury -DartifactId=mercury-event
-Dversion=1.0.0-alpha-4-SNAPSHOT -Dpackaging=jar -Dfile=/path/to/file -Durl=[url] -DrepositoryId=[id]
     [java] 
     [java]   Path to dependency: 
     [java]   	1) org.apache.maven:apache-maven:jar:3.0-SNAPSHOT
     [java]   	2) org.sonatype.mercury:mercury-mp3-cli:jar:1.0-alpha-1
     [java]   	3) org.sonatype.mercury:mercury-mp3-delta:jar:1.0-alpha-1
     [java]   	4) org.sonatype.mercury:mercury-mp3-api:jar:1.0-alpha-1
     [java]   	5) org.apache.maven.mercury:mercury-event:jar:1.0.0-alpha-4-SNAPSHOT
     [java] 
     [java] ----------
     [java] 1 required artifact is missing.
     [java] 
     [java] for artifact: 
     [java]   org.apache.maven:apache-maven:jar:3.0-SNAPSHOT
     [java] 
     [java] from the specified remote repositories:
     [java]   central (http://repo1.maven.org/maven2),
     [java]   apache.snapshots (http://people.apache.org/repo/m2-snapshot-repository)
     [java] 
     [java] 
     [java] While building project with id: org.apache.maven:apache-maven:jar:3.0-SNAPSHOT
     [java] Project File: /zonestorage/hudson/home/hudson/hudson/jobs/Maven-2.1.x-with-bootstrap/workspace/trunk/apache-maven/pom.xml
     [java] 
     [java] Error stacktrace:
     [java] org.apache.maven.lifecycle.LifecycleExecutionException: Missing:
     [java] ----------
     [java] 1) org.apache.maven.mercury:mercury-event:jar:1.0.0-alpha-4-SNAPSHOT
     [java] 
     [java]   Try downloading the file manually from the project website.
     [java] 
     [java]   Then, install it using the command: 
     [java]       mvn install:install-file -DgroupId=org.apache.maven.mercury -DartifactId=mercury-event
-Dversion=1.0.0-alpha-4-SNAPSHOT -Dpackaging=jar -Dfile=/path/to/file
     [java] 
     [java]   Alternatively, if you host your own repository you can deploy the file there:

     [java]       mvn deploy:deploy-file -DgroupId=org.apache.maven.mercury -DartifactId=mercury-event
-Dversion=1.0.0-alpha-4-SNAPSHOT -Dpackaging=jar -Dfile=/path/to/file -Durl=[url] -DrepositoryId=[id]
     [java] 
     [java]   Path to dependency: 
     [java]   	1) org.apache.maven:apache-maven:jar:3.0-SNAPSHOT
     [java]   	2) org.sonatype.mercury:mercury-mp3-cli:jar:1.0-alpha-1
     [java]   	3) org.sonatype.mercury:mercury-mp3-delta:jar:1.0-alpha-1
     [java]   	4) org.sonatype.mercury:mercury-mp3-api:jar:1.0-alpha-1
     [java]   	5) org.apache.maven.mercury:mercury-event:jar:1.0.0-alpha-4-SNAPSHOT
     [java] 
     [java] ----------
     [java] 1 required artifact is missing.
     [java] 
     [java] for artifact: 
     [java]   org.apache.maven:apache-maven:jar:3.0-SNAPSHOT
     [java] 
     [java] from the specified remote repositories:
     [java]   central (http://repo1.maven.org/maven2),
     [java]   apache.snapshots (http://people.apache.org/repo/m2-snapshot-repository)
     [java] 
     [java] 	at org.apache.maven.lifecycle.DefaultLifecycleExecutor.executeGoalAndHandleFailures(DefaultLifecycleExecutor.java:521)
     [java] 	at org.apache.maven.lifecycle.DefaultLifecycleExecutor.executeTaskSegmentForProject(DefaultLifecycleExecutor.java:259)
     [java] 	at org.apache.maven.lifecycle.DefaultLifecycleExecutor.executeTaskSegments(DefaultLifecycleExecutor.java:201)
     [java] 	at org.apache.maven.lifecycle.DefaultLifecycleExecutor.execute(DefaultLifecycleExecutor.java:164)
     [java] 	at org.apache.maven.DefaultMaven.execute(DefaultMaven.java:207)
     [java] 	at org.apache.maven.embedder.MavenEmbedder.execute(MavenEmbedder.java:881)
     [java] 	at org.apache.maven.cli.MavenCli.doMain(MavenCli.java:168)
     [java] 	at org.apache.maven.cli.MavenCli.main(MavenCli.java:63)
     [java] 	at org.apache.maven.cli.MavenCli.main(MavenCli.java:52)
     [java] Caused by: org.apache.maven.artifact.resolver.MultipleArtifactsNotFoundException:
Missing:
     [java] ----------
     [java] 1) org.apache.maven.mercury:mercury-event:jar:1.0.0-alpha-4-SNAPSHOT
     [java] 
     [java]   Try downloading the file manually from the project website.
     [java] 
     [java]   Then, install it using the command: 
     [java]       mvn install:install-file -DgroupId=org.apache.maven.mercury -DartifactId=mercury-event
-Dversion=1.0.0-alpha-4-SNAPSHOT -Dpackaging=jar -Dfile=/path/to/file
     [java] 
     [java]   Alternatively, if you host your own repository you can deploy the file there:

     [java]       mvn deploy:deploy-file -DgroupId=org.apache.maven.mercury -DartifactId=mercury-event
-Dversion=1.0.0-alpha-4-SNAPSHOT -Dpackaging=jar -Dfile=/path/to/file -Durl=[url] -DrepositoryId=[id]
     [java] 
     [java]   Path to dependency: 
     [java]   	1) org.apache.maven:apache-maven:jar:3.0-SNAPSHOT
     [java]   	2) org.sonatype.mercury:mercury-mp3-cli:jar:1.0-alpha-1
     [java]   	3) org.sonatype.mercury:mercury-mp3-delta:jar:1.0-alpha-1
     [java]   	4) org.sonatype.mercury:mercury-mp3-api:jar:1.0-alpha-1
     [java]   	5) org.apache.maven.mercury:mercury-event:jar:1.0.0-alpha-4-SNAPSHOT
     [java] 
     [java] ----------
     [java] 1 required artifact is missing.
     [java] 
     [java] for artifact: 
     [java]   org.apache.maven:apache-maven:jar:3.0-SNAPSHOT
     [java] 
     [java] from the specified remote repositories:
     [java]   central (http://repo1.maven.org/maven2),
     [java]   apache.snapshots (http://people.apache.org/repo/m2-snapshot-repository)
     [java] 
     [java] 	at org.apache.maven.artifact.resolver.DefaultArtifactResolver.resolveTransitively(DefaultArtifactResolver.java:400)
     [java] 	at org.apache.maven.artifact.resolver.DefaultArtifactResolver.resolveTransitively(DefaultArtifactResolver.java:321)
     [java] 	at org.apache.maven.artifact.resolver.DefaultArtifactResolver.resolveTransitively(DefaultArtifactResolver.java:289)
     [java] 	at org.apache.maven.plugin.DefaultPluginManager.resolveTransitiveDependencies(DefaultPluginManager.java:1503)
     [java] 	at org.apache.maven.plugin.DefaultPluginManager.executeMojo(DefaultPluginManager.java:541)
     [java] 	at org.apache.maven.lifecycle.DefaultLifecycleExecutor.executeGoalAndHandleFailures(DefaultLifecycleExecutor.java:492)
     [java] 	... 8 more
     [java] 
     [java] [INFO] ------------------------------------------------------------------------
     [java] [INFO] BUILD FAILED
     [java] [INFO] ------------------------------------------------------------------------
     [java] [INFO] Total time: 3 minutes 25 seconds
     [java] [INFO] Finished at: Wed Feb 04 17:21:19 UTC 2009
     [java] [INFO] Final Memory: 41M/194M
     [java] [INFO] ------------------------------------------------------------------------

BUILD FAILED
/zonestorage/hudson/home/hudson/hudson/jobs/Maven-2.1.x-with-bootstrap/workspace/trunk/build.xml:194:
Java returned: 1

Total time: 4 minutes 42 seconds


Mime
View raw message