maven-notifications mailing list archives

Site index · List index
Message view « Date » · « Thread »
Top « Date » · « Thread »
From Hudson <Hud...@sonatype.org>
Subject Build failed in Hudson: Maven-2.1.x-bootstrap » 1.4,osx #68
Date Fri, 30 Jan 2009 19:28:43 GMT
See http://grid.sonatype.org/ci/job/Maven-2.1.x-bootstrap/./jdk=1.4,label=osx/68/changes

Changes:

[Benjamin Bentmann] [MNG-4016] Properties with the prefix project/pom are not interpolated
from the properties section

------------------------------------------
[...truncated 5033 lines...]
     [exec]   central (http://repo1.maven.org/maven2)
     [exec]  for project org.apache.maven.its.plugins:maven-it-plugin-uses-wagon
     [exec] 	at org.apache.maven.plugin.DefaultPluginManager.checkRequiredMavenVersion(DefaultPluginManager.java:286)
     [exec] 	at org.apache.maven.plugin.DefaultPluginManager.verifyVersionedPlugin(DefaultPluginManager.java:202)
     [exec] 	at org.apache.maven.plugin.DefaultPluginManager.verifyPlugin(DefaultPluginManager.java:181)
     [exec] 	at org.apache.maven.lifecycle.DefaultLifecycleExecutor.verifyPlugin(DefaultLifecycleExecutor.java:1514)
     [exec] 	... 17 more
     [exec] Caused by: org.apache.maven.project.ProjectBuildingException: POM 'org.apache.maven.its.plugins:maven-it-plugin-uses-wagon'
not found in repository: Unable to download the artifact from any repository
     [exec]   org.apache.maven.its.plugins:maven-it-plugin-uses-wagon:pom:2.1-SNAPSHOT
     [exec] from the specified remote repositories:
     [exec]   central (http://repo1.maven.org/maven2)
     [exec]  for project org.apache.maven.its.plugins:maven-it-plugin-uses-wagon
     [exec] 	at org.apache.maven.project.DefaultMavenProjectBuilder.findModelFromRepository(DefaultMavenProjectBuilder.java:605)
     [exec] 	at org.apache.maven.project.DefaultMavenProjectBuilder.buildFromRepository(DefaultMavenProjectBuilder.java:251)
     [exec] 	at org.apache.maven.plugin.DefaultPluginManager.checkRequiredMavenVersion(DefaultPluginManager.java:270)
     [exec] 	... 20 more
     [exec] Caused by: org.apache.maven.artifact.resolver.ArtifactNotFoundException: Unable
to download the artifact from any repository
     [exec]   org.apache.maven.its.plugins:maven-it-plugin-uses-wagon:pom:2.1-SNAPSHOT
     [exec] from the specified remote repositories:
     [exec]   central (http://repo1.maven.org/maven2)
     [exec] 	at org.apache.maven.artifact.resolver.DefaultArtifactResolver.resolve(DefaultArtifactResolver.java:212)
     [exec] 	at org.apache.maven.artifact.resolver.DefaultArtifactResolver.resolve(DefaultArtifactResolver.java:74)
     [exec] 	at org.apache.maven.project.DefaultMavenProjectBuilder.findModelFromRepository(DefaultMavenProjectBuilder.java:558)
     [exec] 	... 22 more
     [exec] Caused by: org.apache.maven.wagon.ResourceDoesNotExistException: Unable to download
the artifact from any repository
     [exec] 	at org.apache.maven.artifact.manager.DefaultWagonManager.getArtifact(DefaultWagonManager.java:349)
     [exec] 	at org.apache.maven.artifact.resolver.DefaultArtifactResolver.resolve(DefaultArtifactResolver.java:200)
     [exec] 	... 24 more
     [exec] [INFO] ------------------------------------------------------------------------
     [exec] [INFO] Total time: < 1 second
     [exec] [INFO] Finished at: Fri Jan 30 13:26:14 CST 2009
     [exec] [INFO] Final Memory: 1M/3M
     [exec] [INFO] ------------------------------------------------------------------------
     [exec] 	at org.apache.maven.it.Verifier.executeGoals(Verifier.java:1274)
     [exec] 	at org.apache.maven.it.Verifier.executeGoal(Verifier.java:1126)
     [exec] 	at org.apache.maven.it.Verifier.executeGoal(Verifier.java:1120)
     [exec] 	at org.apache.maven.it.MavenITmng0553SettingsAuthzEncryptionTest.testit0553(MavenITmng0553SettingsAuthzEncryptionTest.java:55)
     [exec] 	at org.apache.maven.it.MavenITmng0553SettingsAuthzEncryptionTest.testit0553(MavenITmng0553SettingsAuthzEncryptionTest.java:55)
     [exec] 	at sun.reflect.NativeMethodAccessorImpl.invoke0(Native Method)
     [exec] 	at sun.reflect.NativeMethodAccessorImpl.invoke(NativeMethodAccessorImpl.java:39)
     [exec] 	at sun.reflect.DelegatingMethodAccessorImpl.invoke(DelegatingMethodAccessorImpl.java:25)
     [exec] 	at java.lang.reflect.Method.invoke(Method.java:324)
     [exec] 	at junit.framework.TestCase.runTest(TestCase.java:164)
     [exec] 	at org.apache.maven.it.AbstractMavenIntegrationTestCase.runTest(AbstractMavenIntegrationTestCase.java:164)
     [exec] 	at junit.framework.TestCase.runBare(TestCase.java:130)
     [exec] 	at junit.framework.TestResult$1.protect(TestResult.java:106)
     [exec] 	at junit.framework.TestResult.runProtected(TestResult.java:124)
     [exec] 	at junit.framework.TestResult.run(TestResult.java:109)
     [exec] 	at junit.framework.TestCase.run(TestCase.java:120)
     [exec] 	at junit.framework.TestSuite.runTest(TestSuite.java:230)
     [exec] 	at junit.framework.TestSuite.run(TestSuite.java:225)
     [exec] 	at junit.framework.TestSuite.runTest(TestSuite.java:230)
     [exec] 	at junit.framework.TestSuite.run(TestSuite.java:225)
     [exec] 	at sun.reflect.NativeMethodAccessorImpl.invoke0(Native Method)
     [exec] 	at sun.reflect.NativeMethodAccessorImpl.invoke(NativeMethodAccessorImpl.java:39)
     [exec] 	at sun.reflect.DelegatingMethodAccessorImpl.invoke(DelegatingMethodAccessorImpl.java:25)
     [exec] 	at java.lang.reflect.Method.invoke(Method.java:324)
     [exec] 	at org.apache.maven.surefire.junit.JUnitTestSet.execute(JUnitTestSet.java:213)
     [exec] 	at org.apache.maven.surefire.suite.AbstractDirectoryTestSuite.executeTestSet(AbstractDirectoryTestSuite.java:138)
     [exec] 	at org.apache.maven.surefire.suite.AbstractDirectoryTestSuite.execute(AbstractDirectoryTestSuite.java:125)
     [exec] 	at org.apache.maven.surefire.Surefire.run(Surefire.java:132)
     [exec] 	at sun.reflect.NativeMethodAccessorImpl.invoke0(Native Method)
     [exec] 	at sun.reflect.NativeMethodAccessorImpl.invoke(NativeMethodAccessorImpl.java:39)
     [exec] 	at sun.reflect.DelegatingMethodAccessorImpl.invoke(DelegatingMethodAccessorImpl.java:25)
     [exec] 	at java.lang.reflect.Method.invoke(Method.java:324)
     [exec] 	at org.apache.maven.surefire.booter.SurefireBooter.runSuitesInProcess(SurefireBooter.java:290)
     [exec] 	at org.apache.maven.surefire.booter.SurefireBooter.run(SurefireBooter.java:198)
     [exec] 	at org.apache.maven.plugin.surefire.SurefirePlugin.execute(SurefirePlugin.java:398)
     [exec] 	at org.apache.maven.plugin.DefaultPluginManager.executeMojo(DefaultPluginManager.java:460)
     [exec] 	at org.apache.maven.lifecycle.DefaultLifecycleExecutor.executeGoals(DefaultLifecycleExecutor.java:677)
     [exec] 	at org.apache.maven.lifecycle.DefaultLifecycleExecutor.executeGoalWithLifecycle(DefaultLifecycleExecutor.java:539)
     [exec] 	at org.apache.maven.lifecycle.DefaultLifecycleExecutor.executeGoal(DefaultLifecycleExecutor.java:518)
     [exec] 	at org.apache.maven.lifecycle.DefaultLifecycleExecutor.executeGoalAndHandleFailures(DefaultLifecycleExecutor.java:370)
     [exec] 	at org.apache.maven.lifecycle.DefaultLifecycleExecutor.executeTaskSegments(DefaultLifecycleExecutor.java:331)
     [exec] 	at org.apache.maven.lifecycle.DefaultLifecycleExecutor.execute(DefaultLifecycleExecutor.java:181)
     [exec] 	at org.apache.maven.DefaultMaven.doExecute(DefaultMaven.java:345)
     [exec] 	at org.apache.maven.DefaultMaven.execute(DefaultMaven.java:132)
     [exec] 	at org.apache.maven.cli.MavenCli.main(MavenCli.java:291)
     [exec] 	at sun.reflect.NativeMethodAccessorImpl.invoke0(Native Method)
     [exec] 	at sun.reflect.NativeMethodAccessorImpl.invoke(NativeMethodAccessorImpl.java:39)
     [exec] 	at sun.reflect.DelegatingMethodAccessorImpl.invoke(DelegatingMethodAccessorImpl.java:25)
     [exec] 	at java.lang.reflect.Method.invoke(Method.java:324)
     [exec] 	at org.codehaus.classworlds.Launcher.launchEnhanced(Launcher.java:315)
     [exec] 	at org.codehaus.classworlds.Launcher.launch(Launcher.java:255)
     [exec] 	at org.codehaus.classworlds.Launcher.mainWithExitCode(Launcher.java:430)
     [exec] 	at org.codehaus.classworlds.Launcher.main(Launcher.java:375)
     [exec] 
     [exec] testit0113(org.apache.maven.it.MavenIT0113ServerAuthzAvailableToWagonMgrInPluginTest)
 Time elapsed: 1.055 sec  <<< ERROR!
     [exec] org.apache.maven.it.VerificationException: Exit code was non-zero: 1; command
line and log = 
     [exec] /tmp/apache-maven-2.1.0-M2-SNAPSHOT/bin/mvn --settings settings.xml -e --batch-mode
-Dmaven.repo.local=/opt/repos/local-repository validate
     [exec] + Error stacktraces are turned on.
     [exec] [INFO] Scanning for projects...
     [exec] [INFO] ------------------------------------------------------------------------
     [exec] [INFO] Building test
     [exec] [INFO]    task-segment: [validate]
     [exec] [INFO] ------------------------------------------------------------------------
     [exec] [INFO] ------------------------------------------------------------------------
     [exec] [ERROR] BUILD ERROR
     [exec] [INFO] ------------------------------------------------------------------------
     [exec] [INFO] Failed to resolve artifact.
     [exec] GroupId: org.apache.maven.its.plugins
     [exec] ArtifactId: maven-it-plugin-uses-wagon
     [exec] Version: 2.1-SNAPSHOT
     [exec] Reason: Unable to download the artifact from any repository
     [exec]   org.apache.maven.its.plugins:maven-it-plugin-uses-wagon:pom:2.1-SNAPSHOT
     [exec] from the specified remote repositories:
     [exec]   central (http://repo1.maven.org/maven2)
     [exec] [INFO] ------------------------------------------------------------------------
     [exec] [INFO] Trace
     [exec] org.apache.maven.lifecycle.LifecycleExecutionException: Unable to build project
for plugin 'org.apache.maven.its.plugins:maven-it-plugin-uses-wagon': POM 'org.apache.maven.its.plugins:maven-it-plugin-uses-wagon'
not found in repository: Unable to download the artifact from any repository
     [exec]   org.apache.maven.its.plugins:maven-it-plugin-uses-wagon:pom:2.1-SNAPSHOT
     [exec] from the specified remote repositories:
     [exec]   central (http://repo1.maven.org/maven2)
     [exec]  for project org.apache.maven.its.plugins:maven-it-plugin-uses-wagon
     [exec] 	at org.apache.maven.lifecycle.DefaultLifecycleExecutor.verifyPlugin(DefaultLifecycleExecutor.java:1531)
     [exec] 	at org.apache.maven.lifecycle.DefaultLifecycleExecutor.bindPluginToLifecycle(DefaultLifecycleExecutor.java:1478)
     [exec] 	at org.apache.maven.lifecycle.DefaultLifecycleExecutor.constructLifecycleMappings(DefaultLifecycleExecutor.java:1244)
     [exec] 	at org.apache.maven.lifecycle.DefaultLifecycleExecutor.executeGoal(DefaultLifecycleExecutor.java:517)
     [exec] 	at org.apache.maven.lifecycle.DefaultLifecycleExecutor.executeGoalAndHandleFailures(DefaultLifecycleExecutor.java:370)
     [exec] 	at org.apache.maven.lifecycle.DefaultLifecycleExecutor.executeTaskSegments(DefaultLifecycleExecutor.java:331)
     [exec] 	at org.apache.maven.lifecycle.DefaultLifecycleExecutor.execute(DefaultLifecycleExecutor.java:181)
     [exec] 	at org.apache.maven.DefaultMaven.doExecute(DefaultMaven.java:345)
     [exec] 	at org.apache.maven.DefaultMaven.execute(DefaultMaven.java:132)
     [exec] 	at org.apache.maven.cli.MavenCli.main(MavenCli.java:291)
     [exec] 	at sun.reflect.NativeMethodAccessorImpl.invoke0(Native Method)
     [exec] 	at sun.reflect.NativeMethodAccessorImpl.invoke(NativeMethodAccessorImpl.java:39)
     [exec] 	at sun.reflect.DelegatingMethodAccessorImpl.invoke(DelegatingMethodAccessorImpl.java:25)
     [exec] 	at java.lang.reflect.Method.invoke(Method.java:324)
     [exec] 	at org.codehaus.classworlds.Launcher.launchEnhanced(Launcher.java:315)
     [exec] 	at org.codehaus.classworlds.Launcher.launch(Launcher.java:255)
     [exec] 	at org.codehaus.classworlds.Launcher.mainWithExitCode(Launcher.java:430)
     [exec] 	at org.codehaus.classworlds.Launcher.main(Launcher.java:375)
     [exec] Caused by: org.apache.maven.plugin.InvalidPluginException: Unable to build project
for plugin 'org.apache.maven.its.plugins:maven-it-plugin-uses-wagon': POM 'org.apache.maven.its.plugins:maven-it-plugin-uses-wagon'
not found in repository: Unable to download the artifact from any repository
     [exec]   org.apache.maven.its.plugins:maven-it-plugin-uses-wagon:pom:2.1-SNAPSHOT
     [exec] from the specified remote repositories:
     [exec]   central (http://repo1.maven.org/maven2)
     [exec]  for project org.apache.maven.its.plugins:maven-it-plugin-uses-wagon
     [exec] 	at org.apache.maven.plugin.DefaultPluginManager.checkRequiredMavenVersion(DefaultPluginManager.java:286)
     [exec] 	at org.apache.maven.plugin.DefaultPluginManager.verifyVersionedPlugin(DefaultPluginManager.java:202)
     [exec] 	at org.apache.maven.plugin.DefaultPluginManager.verifyPlugin(DefaultPluginManager.java:181)
     [exec] 	at org.apache.maven.lifecycle.DefaultLifecycleExecutor.verifyPlugin(DefaultLifecycleExecutor.java:1514)
     [exec] 	... 17 more
     [exec] Caused by: org.apache.maven.project.ProjectBuildingException: POM 'org.apache.maven.its.plugins:maven-it-plugin-uses-wagon'
not found in repository: Unable to download the artifact from any repository
     [exec]   org.apache.maven.its.plugins:maven-it-plugin-uses-wagon:pom:2.1-SNAPSHOT
     [exec] from the specified remote repositories:
     [exec]   central (http://repo1.maven.org/maven2)
     [exec]  for project org.apache.maven.its.plugins:maven-it-plugin-uses-wagon
     [exec] 	at org.apache.maven.project.DefaultMavenProjectBuilder.findModelFromRepository(DefaultMavenProjectBuilder.java:605)
     [exec] 	at org.apache.maven.project.DefaultMavenProjectBuilder.buildFromRepository(DefaultMavenProjectBuilder.java:251)
     [exec] 	at org.apache.maven.plugin.DefaultPluginManager.checkRequiredMavenVersion(DefaultPluginManager.java:270)
     [exec] 	... 20 more
     [exec] Caused by: org.apache.maven.artifact.resolver.ArtifactNotFoundException: Unable
to download the artifact from any repository
     [exec]   org.apache.maven.its.plugins:maven-it-plugin-uses-wagon:pom:2.1-SNAPSHOT
     [exec] from the specified remote repositories:
     [exec]   central (http://repo1.maven.org/maven2)
     [exec] 	at org.apache.maven.artifact.resolver.DefaultArtifactResolver.resolve(DefaultArtifactResolver.java:212)
     [exec] 	at org.apache.maven.artifact.resolver.DefaultArtifactResolver.resolve(DefaultArtifactResolver.java:74)
     [exec] 	at org.apache.maven.project.DefaultMavenProjectBuilder.findModelFromRepository(DefaultMavenProjectBuilder.java:558)
     [exec] 	... 22 more
     [exec] Caused by: org.apache.maven.wagon.ResourceDoesNotExistException: Unable to download
the artifact from any repository
     [exec] 	at org.apache.maven.artifact.manager.DefaultWagonManager.getArtifact(DefaultWagonManager.java:349)
     [exec] 	at org.apache.maven.artifact.resolver.DefaultArtifactResolver.resolve(DefaultArtifactResolver.java:200)
     [exec] 	... 24 more
     [exec] [INFO] ------------------------------------------------------------------------
     [exec] [INFO] Total time: < 1 second
     [exec] [INFO] Finished at: Fri Jan 30 13:27:38 CST 2009
     [exec] [INFO] Final Memory: 1M/2M
     [exec] [INFO] ------------------------------------------------------------------------
     [exec] 	at org.apache.maven.it.Verifier.executeGoals(Verifier.java:1274)
     [exec] 	at org.apache.maven.it.Verifier.executeGoal(Verifier.java:1126)
     [exec] 	at org.apache.maven.it.Verifier.executeGoal(Verifier.java:1120)
     [exec] 	at org.apache.maven.it.MavenIT0113ServerAuthzAvailableToWagonMgrInPluginTest.testit0113(MavenIT0113ServerAuthzAvailableToWagonMgrInPluginTest.java:50)
     [exec] 	at org.apache.maven.it.MavenIT0113ServerAuthzAvailableToWagonMgrInPluginTest.testit0113(MavenIT0113ServerAuthzAvailableToWagonMgrInPluginTest.java:50)
     [exec] 	at sun.reflect.NativeMethodAccessorImpl.invoke0(Native Method)
     [exec] 	at sun.reflect.NativeMethodAccessorImpl.invoke(NativeMethodAccessorImpl.java:39)
     [exec] 	at sun.reflect.DelegatingMethodAccessorImpl.invoke(DelegatingMethodAccessorImpl.java:25)
     [exec] 	at java.lang.reflect.Method.invoke(Method.java:324)
     [exec] 	at junit.framework.TestCase.runTest(TestCase.java:164)
     [exec] 	at org.apache.maven.it.AbstractMavenIntegrationTestCase.runTest(AbstractMavenIntegrationTestCase.java:164)
     [exec] 	at junit.framework.TestCase.runBare(TestCase.java:130)
     [exec] 	at junit.framework.TestResult$1.protect(TestResult.java:106)
     [exec] 	at junit.framework.TestResult.runProtected(TestResult.java:124)
     [exec] 	at junit.framework.TestResult.run(TestResult.java:109)
     [exec] 	at junit.framework.TestCase.run(TestCase.java:120)
     [exec] 	at junit.framework.TestSuite.runTest(TestSuite.java:230)
     [exec] 	at junit.framework.TestSuite.run(TestSuite.java:225)
     [exec] 	at junit.framework.TestSuite.runTest(TestSuite.java:230)
     [exec] 	at junit.framework.TestSuite.run(TestSuite.java:225)
     [exec] 	at sun.reflect.NativeMethodAccessorImpl.invoke0(Native Method)
     [exec] 	at sun.reflect.NativeMethodAccessorImpl.invoke(NativeMethodAccessorImpl.java:39)
     [exec] 	at sun.reflect.DelegatingMethodAccessorImpl.invoke(DelegatingMethodAccessorImpl.java:25)
     [exec] 	at java.lang.reflect.Method.invoke(Method.java:324)
     [exec] 	at org.apache.maven.surefire.junit.JUnitTestSet.execute(JUnitTestSet.java:213)
     [exec] 	at org.apache.maven.surefire.suite.AbstractDirectoryTestSuite.executeTestSet(AbstractDirectoryTestSuite.java:138)
     [exec] 	at org.apache.maven.surefire.suite.AbstractDirectoryTestSuite.execute(AbstractDirectoryTestSuite.java:125)
     [exec] 	at org.apache.maven.surefire.Surefire.run(Surefire.java:132)
     [exec] 	at sun.reflect.NativeMethodAccessorImpl.invoke0(Native Method)
     [exec] 	at sun.reflect.NativeMethodAccessorImpl.invoke(NativeMethodAccessorImpl.java:39)
     [exec] 	at sun.reflect.DelegatingMethodAccessorImpl.invoke(DelegatingMethodAccessorImpl.java:25)
     [exec] 	at java.lang.reflect.Method.invoke(Method.java:324)
     [exec] 	at org.apache.maven.surefire.booter.SurefireBooter.runSuitesInProcess(SurefireBooter.java:290)
     [exec] 	at org.apache.maven.surefire.booter.SurefireBooter.run(SurefireBooter.java:198)
     [exec] 	at org.apache.maven.plugin.surefire.SurefirePlugin.execute(SurefirePlugin.java:398)
     [exec] 	at org.apache.maven.plugin.DefaultPluginManager.executeMojo(DefaultPluginManager.java:460)
     [exec] 	at org.apache.maven.lifecycle.DefaultLifecycleExecutor.executeGoals(DefaultLifecycleExecutor.java:677)
     [exec] 	at org.apache.maven.lifecycle.DefaultLifecycleExecutor.executeGoalWithLifecycle(DefaultLifecycleExecutor.java:539)
     [exec] 	at org.apache.maven.lifecycle.DefaultLifecycleExecutor.executeGoal(DefaultLifecycleExecutor.java:518)
     [exec] 	at org.apache.maven.lifecycle.DefaultLifecycleExecutor.executeGoalAndHandleFailures(DefaultLifecycleExecutor.java:370)
     [exec] 	at org.apache.maven.lifecycle.DefaultLifecycleExecutor.executeTaskSegments(DefaultLifecycleExecutor.java:331)
     [exec] 	at org.apache.maven.lifecycle.DefaultLifecycleExecutor.execute(DefaultLifecycleExecutor.java:181)
     [exec] 	at org.apache.maven.DefaultMaven.doExecute(DefaultMaven.java:345)
     [exec] 	at org.apache.maven.DefaultMaven.execute(DefaultMaven.java:132)
     [exec] 	at org.apache.maven.cli.MavenCli.main(MavenCli.java:291)
     [exec] 	at sun.reflect.NativeMethodAccessorImpl.invoke0(Native Method)
     [exec] 	at sun.reflect.NativeMethodAccessorImpl.invoke(NativeMethodAccessorImpl.java:39)
     [exec] 	at sun.reflect.DelegatingMethodAccessorImpl.invoke(DelegatingMethodAccessorImpl.java:25)
     [exec] 	at java.lang.reflect.Method.invoke(Method.java:324)
     [exec] 	at org.codehaus.classworlds.Launcher.launchEnhanced(Launcher.java:315)
     [exec] 	at org.codehaus.classworlds.Launcher.launch(Launcher.java:255)
     [exec] 	at org.codehaus.classworlds.Launcher.mainWithExitCode(Launcher.java:430)
     [exec] 	at org.codehaus.classworlds.Launcher.main(Launcher.java:375)
     [exec] 
     [exec] 
     [exec] Results :
     [exec] 
     [exec] Tests in error: 
     [exec]   testitMNG2861(org.apache.maven.it.MavenITmng2861RelocationsAndRangesTest)
     [exec]   testitMNG2605(org.apache.maven.it.MavenITmng2605BogusProfileActivationTest)
     [exec]   testit0553(org.apache.maven.it.MavenITmng0553SettingsAuthzEncryptionTest)
     [exec]   testit0113(org.apache.maven.it.MavenIT0113ServerAuthzAvailableToWagonMgrInPluginTest)
     [exec] 
     [exec] Tests run: 308, Failures: 0, Errors: 4, Skipped: 0
     [exec] 
     [exec] [INFO] ------------------------------------------------------------------------
     [exec] [ERROR] BUILD FAILURE
     [exec] [INFO] ------------------------------------------------------------------------
     [exec] [INFO] There are test failures.
     [exec] [INFO] ------------------------------------------------------------------------
     [exec] [INFO] For more information, run Maven with the -e switch
     [exec] [INFO] ------------------------------------------------------------------------
     [exec] [INFO] Total time: 30 minutes 15 seconds
     [exec] [INFO] Finished at: Fri Jan 30 13:28:42 CST 2009
     [exec] [INFO] Final Memory: 30M/63M
     [exec] [INFO] ------------------------------------------------------------------------

BUILD FAILED
http://grid.sonatype.org/ci/job/Maven-2.1.x-bootstrap/./jdk=1.4,label=osx/ws/maven-2.1.x/build.xml
:279: exec returned: 1

Total time: 33 minutes 13 seconds


Mime
View raw message