maven-notifications mailing list archives

Site index · List index
Message view « Date » · « Thread »
Top « Date » · « Thread »
From Hudson <Hud...@sonatype.org>
Subject Build failed in Hudson: Maven-2.0.x-with-bootstrap » 1.4,ubuntu #77
Date Thu, 29 Jan 2009 06:45:15 GMT
See http://grid.sonatype.org/ci/job/Maven-2.0.x-with-bootstrap/./jdk=1.4,label=ubuntu/77/changes

Changes:

[brett] [MNG-3920] block out the component api from plugins since they are only going to be
exposed to the one from the core (it is not shaded). This prevents the confusing scenario
of double loading the interfaces and having the container not register them properly
Merged from: r738753

[brett] [MNG-3810] improve error message when you forget to add a required field in model
that modello isn't picking up
Merged from: r738723

------------------------------------------
[...truncated 3373 lines...]
     [exec] 0143TransitiveDependencyScopes(itTestScope).................OK (2.6 s)
     [exec] 0142DirectDependencyScopes(it0142)..........................OK (2.8 s)
     [exec] 0140(it0140)................................................OK (3.5 s)
     [exec] 0139(it0139)................................................OK (2.9 s)
     [exec] 0138PluginLifecycle(it0138).................................OK (4.0 s)
     [exec] 0137EarLifecycle(it0137)....................................OK (3.9 s)
     [exec] 0136RarLifecycle(it0136)....................................OK (4.8 s)
     [exec] 0135EjbLifecycle(it0135)....................................OK (4.8 s)
     [exec] 0134WarLifecycle(it0134)....................................OK (4.5 s)
     [exec] 0133JarLifecycle(it0133)....................................OK (5.3 s)
     [exec] 0132PomLifecycle(it0132)....................................OK (3.3 s)
     [exec] 0131SiteLifecycle(it0131)...................................OK (2.8 s)
     [exec] 0130CleanLifecycle(it0130)..................................OK (2.6 s)
     [exec] 0113ServerAuthzAvailableToWagonMgrInPlugin(it0113)..........OK (2.4 s)
     [exec] 0090(it0090)................................................OK (2.2 s)
     [exec] 0087(it0087)................................................OK (3.0 s)
     [exec] 0086(it0086)................................................OK (3.6 s)
     [exec] 0085(it0085)................................................OK (3.0 s)
     [exec] 0072(it0072)................................................OK (2.8 s)
     [exec] 0071(it0071)................................................OK (3.2 s)
     [exec] 0064(it0064)................................................OK (2.3 s)
     [exec] 0063(it0063)................................................OK (3.1 s)
     [exec] 0056(it0056)................................................OK (1.8 s)
     [exec] 0052(it0052)................................................OK (2.9 s)
     [exec] 0051(it0051)................................................OK (4.5 s)
     [exec] 0041(it0041)................................................OK (2.6 s)
     [exec] 0040(it0040)................................................OK (1.7 s)
     [exec] 0039(it0039)................................................OK (2.1 s)
     [exec] 0038(it0038)................................................OK (1.7 s)
     [exec] 0037(it0037)................................................OK (2.1 s)
     [exec] 0036(it0036)................................................OK (1.8 s)
     [exec] 0032(it0032)................................................OK (1.5 s)
     [exec] 0030(it0030)................................................OK (9.0 s)
     [exec] 0025(it0025)................................................OK (2.0 s)
     [exec] 0024(it0024)................................................OK (1.6 s)
     [exec] 0023(it0023)................................................OK (2.2 s)
     [exec] 0021(it0021)................................................OK (2.2 s)
     [exec] 0019(it0019)................................................OK (3.1 s)
     [exec] 0018(it0018)................................................OK (1.9 s)
     [exec] 0012(it0012)................................................OK (1.7 s)
     [exec] 0011(it0011)................................................OK (1.8 s)
     [exec] 0010(it0010)................................................OK (2.1 s)
     [exec] 0009(it0009)................................................OK (2.1 s)
     [exec] 0008(it0008)................................................OK (2.2 s)
     [exec] 0007(it0007)................................................OK (0.9 s)
     [exec] Tests run: 307, Failures: 0, Errors: 1, Skipped: 0, Time elapsed: 1,421.871 sec
<<< FAILURE!
     [exec] testitMNG0820(org.apache.maven.it.MavenITmng0820ConflictResolutionTest)  Time
elapsed: 8.381 sec  <<< ERROR!
     [exec] org.apache.maven.it.VerificationException: Exit code was non-zero: 1; command
line and log = 
     [exec] /tmp/apache-maven-2.0.11-SNAPSHOT/bin/mvn -e --batch-mode -Dmaven.repo.local=/opt/repos/local-repository
org.apache.maven.plugins:maven-clean-plugin:clean package
     [exec] + Error stacktraces are turned on.
     [exec] [INFO] Scanning for projects...
     [exec] [INFO] Reactor build order: 
     [exec] [INFO]   Maven Integration Test :: it0084
     [exec] [INFO]   Test Component A
     [exec] [INFO]   Test Component B
     [exec] [INFO]   Test Component C
     [exec] [INFO] ------------------------------------------------------------------------
     [exec] [INFO] Building Maven Integration Test :: it0084
     [exec] [INFO]    task-segment: [org.apache.maven.plugins:maven-clean-plugin:clean, package]
     [exec] [INFO] ------------------------------------------------------------------------
     [exec] [INFO] [clean:clean]
     [exec] [INFO] [site:attach-descriptor]
     [exec] [INFO] ------------------------------------------------------------------------
     [exec] [INFO] Building Test Component A
     [exec] [INFO]    task-segment: [org.apache.maven.plugins:maven-clean-plugin:clean, package]
     [exec] [INFO] ------------------------------------------------------------------------
     [exec] [INFO] [clean:clean]
     [exec] [INFO] [resources:resources]
     [exec] [WARNING] Using platform encoding (UTF-8 actually) to copy filtered resources,
i.e. build is platform dependent!
     [exec] [INFO] skip non existing resourceDirectory /tmp/maven-integration-tests-2.0.x/core-it-suite/target/test-classes/mng-0820/test-component-a/src/main/resources
     [exec] [INFO] [compiler:compile]
     [exec] [INFO] Compiling 1 source file to /tmp/maven-integration-tests-2.0.x/core-it-suite/target/test-classes/mng-0820/test-component-a/target/classes
     [exec] [INFO] [resources:testResources]
     [exec] [WARNING] Using platform encoding (UTF-8 actually) to copy filtered resources,
i.e. build is platform dependent!
     [exec] [INFO] skip non existing resourceDirectory /tmp/maven-integration-tests-2.0.x/core-it-suite/target/test-classes/mng-0820/test-component-a/src/test/resources
     [exec] [INFO] [compiler:testCompile]
     [exec] [INFO] No sources to compile
     [exec] [INFO] [surefire:test]
     [exec] [INFO] No tests to run.
     [exec] [INFO] [jar:jar]
     [exec] [INFO] Building jar: /tmp/maven-integration-tests-2.0.x/core-it-suite/target/test-classes/mng-0820/test-component-a/target/test-component-a-0.1.jar
     [exec] [INFO] ------------------------------------------------------------------------
     [exec] [INFO] Building Test Component B
     [exec] [INFO]    task-segment: [org.apache.maven.plugins:maven-clean-plugin:clean, package]
     [exec] [INFO] ------------------------------------------------------------------------
     [exec] [INFO] [clean:clean]
     [exec] [INFO] [resources:resources]
     [exec] [WARNING] Using platform encoding (UTF-8 actually) to copy filtered resources,
i.e. build is platform dependent!
     [exec] [INFO] skip non existing resourceDirectory /tmp/maven-integration-tests-2.0.x/core-it-suite/target/test-classes/mng-0820/test-component-b/src/main/resources
     [exec] [INFO] [compiler:compile]
     [exec] [INFO] Compiling 1 source file to /tmp/maven-integration-tests-2.0.x/core-it-suite/target/test-classes/mng-0820/test-component-b/target/classes
     [exec] [INFO] [resources:testResources]
     [exec] [WARNING] Using platform encoding (UTF-8 actually) to copy filtered resources,
i.e. build is platform dependent!
     [exec] [INFO] skip non existing resourceDirectory /tmp/maven-integration-tests-2.0.x/core-it-suite/target/test-classes/mng-0820/test-component-b/src/test/resources
     [exec] [INFO] [compiler:testCompile]
     [exec] [INFO] No sources to compile
     [exec] [INFO] [surefire:test]
     [exec] [INFO] No tests to run.
     [exec] [INFO] [jar:jar]
     [exec] [INFO] Building jar: /tmp/maven-integration-tests-2.0.x/core-it-suite/target/test-classes/mng-0820/test-component-b/target/test-component-b-0.1.jar
     [exec] [INFO] ------------------------------------------------------------------------
     [exec] [INFO] Building Test Component C
     [exec] [INFO]    task-segment: [org.apache.maven.plugins:maven-clean-plugin:clean, package]
     [exec] [INFO] ------------------------------------------------------------------------
     [exec] [INFO] [clean:clean]
     [exec] [INFO] [resources:resources]
     [exec] [WARNING] Using platform encoding (UTF-8 actually) to copy filtered resources,
i.e. build is platform dependent!
     [exec] [INFO] skip non existing resourceDirectory /tmp/maven-integration-tests-2.0.x/core-it-suite/target/test-classes/mng-0820/test-component-c/src/main/resources
     [exec] [INFO] [compiler:compile]
     [exec] [INFO] Compiling 1 source file to /tmp/maven-integration-tests-2.0.x/core-it-suite/target/test-classes/mng-0820/test-component-c/target/classes
     [exec] [INFO] [resources:testResources]
     [exec] [WARNING] Using platform encoding (UTF-8 actually) to copy filtered resources,
i.e. build is platform dependent!
     [exec] [INFO] skip non existing resourceDirectory /tmp/maven-integration-tests-2.0.x/core-it-suite/target/test-classes/mng-0820/test-component-c/src/test/resources
     [exec] [INFO] [compiler:testCompile]
     [exec] [INFO] No sources to compile
     [exec] [INFO] [surefire:test]
     [exec] [INFO] No tests to run.
     [exec] [INFO] [war:war]
     [exec] [INFO] Packaging webapp
     [exec] [INFO] Assembling webapp[test-component-c] in [/tmp/maven-integration-tests-2.0.x/core-it-suite/target/test-classes/mng-0820/test-component-c/target/test-component-c-0.1]
     [exec] [INFO] Processing war project
     [exec] [INFO] Copying webapp resources[/tmp/maven-integration-tests-2.0.x/core-it-suite/target/test-classes/mng-0820/test-component-c/src/main/webapp]
     [exec] [INFO] ------------------------------------------------------------------------
     [exec] [ERROR] BUILD ERROR
     [exec] [INFO] ------------------------------------------------------------------------
     [exec] [INFO] Failed to copy file for artifact[org.apache.maven:maven-core-it-support:jar:1.4:compile]
     [exec] Embedded error: File /opt/repos/local-repository/org/apache/maven/maven-core-it-support/1.4/maven-core-it-support-1.4.jar
does not exist
     [exec] [INFO] ------------------------------------------------------------------------
     [exec] [INFO] Trace
     [exec] org.apache.maven.lifecycle.LifecycleExecutionException: Failed to copy file for
artifact[org.apache.maven:maven-core-it-support:jar:1.4:compile]
     [exec] 	at org.apache.maven.lifecycle.DefaultLifecycleExecutor.executeGoals(DefaultLifecycleExecutor.java:584)
     [exec] 	at org.apache.maven.lifecycle.DefaultLifecycleExecutor.executeGoalWithLifecycle(DefaultLifecycleExecutor.java:500)
     [exec] 	at org.apache.maven.lifecycle.DefaultLifecycleExecutor.executeGoal(DefaultLifecycleExecutor.java:479)
     [exec] 	at org.apache.maven.lifecycle.DefaultLifecycleExecutor.executeGoalAndHandleFailures(DefaultLifecycleExecutor.java:331)
     [exec] 	at org.apache.maven.lifecycle.DefaultLifecycleExecutor.executeTaskSegments(DefaultLifecycleExecutor.java:292)
     [exec] 	at org.apache.maven.lifecycle.DefaultLifecycleExecutor.execute(DefaultLifecycleExecutor.java:142)
     [exec] 	at org.apache.maven.DefaultMaven.doExecute(DefaultMaven.java:336)
     [exec] 	at org.apache.maven.DefaultMaven.execute(DefaultMaven.java:129)
     [exec] 	at org.apache.maven.cli.MavenCli.main(MavenCli.java:288)
     [exec] 	at sun.reflect.NativeMethodAccessorImpl.invoke0(Native Method)
     [exec] 	at sun.reflect.NativeMethodAccessorImpl.invoke(NativeMethodAccessorImpl.java:39)
     [exec] 	at sun.reflect.DelegatingMethodAccessorImpl.invoke(DelegatingMethodAccessorImpl.java:25)
     [exec] 	at java.lang.reflect.Method.invoke(Method.java:324)
     [exec] 	at org.codehaus.classworlds.Launcher.launchEnhanced(Launcher.java:315)
     [exec] 	at org.codehaus.classworlds.Launcher.launch(Launcher.java:255)
     [exec] 	at org.codehaus.classworlds.Launcher.mainWithExitCode(Launcher.java:430)
     [exec] 	at org.codehaus.classworlds.Launcher.main(Launcher.java:375)
     [exec] Caused by: org.apache.maven.plugin.MojoExecutionException: Failed to copy file
for artifact[org.apache.maven:maven-core-it-support:jar:1.4:compile]
     [exec] 	at org.apache.maven.plugin.war.packaging.ArtifactsPackagingTask.performPackaging(ArtifactsPackagingTask.java:125)
     [exec] 	at org.apache.maven.plugin.war.packaging.WarProjectPackagingTask.handleArtifacts(WarProjectPackagingTask.java:183)
     [exec] 	at org.apache.maven.plugin.war.packaging.WarProjectPackagingTask.performPackaging(WarProjectPackagingTask.java:103)
     [exec] 	at org.apache.maven.plugin.war.AbstractWarMojo.buildWebapp(AbstractWarMojo.java:439)
     [exec] 	at org.apache.maven.plugin.war.AbstractWarMojo.buildExplodedWebapp(AbstractWarMojo.java:375)
     [exec] 	at org.apache.maven.plugin.war.WarMojo.performPackaging(WarMojo.java:181)
     [exec] 	at org.apache.maven.plugin.war.WarMojo.execute(WarMojo.java:143)
     [exec] 	at org.apache.maven.plugin.DefaultPluginManager.executeMojo(DefaultPluginManager.java:453)
     [exec] 	at org.apache.maven.lifecycle.DefaultLifecycleExecutor.executeGoals(DefaultLifecycleExecutor.java:559)
     [exec] 	... 16 more
     [exec] Caused by: java.io.IOException: File /opt/repos/local-repository/org/apache/maven/maven-core-it-support/1.4/maven-core-it-support-1.4.jar
does not exist
     [exec] 	at org.codehaus.plexus.util.FileUtils.copyFile(FileUtils.java:955)
     [exec] 	at org.apache.maven.plugin.war.packaging.AbstractWarPackagingTask.copyFile(AbstractWarPackagingTask.java:293)
     [exec] 	at org.apache.maven.plugin.war.packaging.AbstractWarPackagingTask$1.registered(AbstractWarPackagingTask.java:150)
     [exec] 	at org.apache.maven.plugin.war.util.WebappStructure.registerFile(WebappStructure.java:176)
     [exec] 	at org.apache.maven.plugin.war.packaging.AbstractWarPackagingTask.copyFile(AbstractWarPackagingTask.java:145)
     [exec] 	at org.apache.maven.plugin.war.packaging.ArtifactsPackagingTask.performPackaging(ArtifactsPackagingTask.java:100)
     [exec] 	... 24 more
     [exec] [INFO] ------------------------------------------------------------------------
     [exec] [INFO] Total time: 7 seconds
     [exec] [INFO] Finished at: Thu Jan 29 00:41:44 GMT-06:00 2009
     [exec] [INFO] Final Memory: 14M/29M
     [exec] [INFO] ------------------------------------------------------------------------
     [exec] 	at org.apache.maven.it.Verifier.executeGoals(Verifier.java:1268)
     [exec] 	at org.apache.maven.it.Verifier.executeGoal(Verifier.java:1120)
     [exec] 	at org.apache.maven.it.Verifier.executeGoal(Verifier.java:1114)
     [exec] 	at org.apache.maven.it.MavenITmng0820ConflictResolutionTest.testitMNG0820(MavenITmng0820ConflictResolutionTest.java:45)
     [exec] 	at org.apache.maven.it.MavenITmng0820ConflictResolutionTest.testitMNG0820(MavenITmng0820ConflictResolutionTest.java:45)
     [exec] 	at sun.reflect.NativeMethodAccessorImpl.invoke0(Native Method)
     [exec] 	at sun.reflect.NativeMethodAccessorImpl.invoke(NativeMethodAccessorImpl.java:39)
     [exec] 	at sun.reflect.DelegatingMethodAccessorImpl.invoke(DelegatingMethodAccessorImpl.java:25)
     [exec] 	at java.lang.reflect.Method.invoke(Method.java:324)
     [exec] 	at junit.framework.TestCase.runTest(TestCase.java:164)
     [exec] 	at org.apache.maven.it.AbstractMavenIntegrationTestCase.runTest(AbstractMavenIntegrationTestCase.java:164)
     [exec] 	at junit.framework.TestCase.runBare(TestCase.java:130)
     [exec] 	at junit.framework.TestResult$1.protect(TestResult.java:106)
     [exec] 	at junit.framework.TestResult.runProtected(TestResult.java:124)
     [exec] 	at junit.framework.TestResult.run(TestResult.java:109)
     [exec] 	at junit.framework.TestCase.run(TestCase.java:120)
     [exec] 	at junit.framework.TestSuite.runTest(TestSuite.java:230)
     [exec] 	at junit.framework.TestSuite.run(TestSuite.java:225)
     [exec] 	at junit.framework.TestSuite.runTest(TestSuite.java:230)
     [exec] 	at junit.framework.TestSuite.run(TestSuite.java:225)
     [exec] 	at sun.reflect.NativeMethodAccessorImpl.invoke0(Native Method)
     [exec] 	at sun.reflect.NativeMethodAccessorImpl.invoke(NativeMethodAccessorImpl.java:39)
     [exec] 	at sun.reflect.DelegatingMethodAccessorImpl.invoke(DelegatingMethodAccessorImpl.java:25)
     [exec] 	at java.lang.reflect.Method.invoke(Method.java:324)
     [exec] 	at org.apache.maven.surefire.junit.JUnitTestSet.execute(JUnitTestSet.java:213)
     [exec] 	at org.apache.maven.surefire.suite.AbstractDirectoryTestSuite.executeTestSet(AbstractDirectoryTestSuite.java:138)
     [exec] 	at org.apache.maven.surefire.suite.AbstractDirectoryTestSuite.execute(AbstractDirectoryTestSuite.java:125)
     [exec] 	at org.apache.maven.surefire.Surefire.run(Surefire.java:132)
     [exec] 	at sun.reflect.NativeMethodAccessorImpl.invoke0(Native Method)
     [exec] 	at sun.reflect.NativeMethodAccessorImpl.invoke(NativeMethodAccessorImpl.java:39)
     [exec] 	at sun.reflect.DelegatingMethodAccessorImpl.invoke(DelegatingMethodAccessorImpl.java:25)
     [exec] 	at java.lang.reflect.Method.invoke(Method.java:324)
     [exec] 	at org.apache.maven.surefire.booter.SurefireBooter.runSuitesInProcess(SurefireBooter.java:290)
     [exec] 	at org.apache.maven.surefire.booter.SurefireBooter.run(SurefireBooter.java:198)
     [exec] 	at org.apache.maven.plugin.surefire.SurefirePlugin.execute(SurefirePlugin.java:398)
     [exec] 	at org.apache.maven.plugin.DefaultPluginManager.executeMojo(DefaultPluginManager.java:453)
     [exec] 	at org.apache.maven.lifecycle.DefaultLifecycleExecutor.executeGoals(DefaultLifecycleExecutor.java:559)
     [exec] 	at org.apache.maven.lifecycle.DefaultLifecycleExecutor.executeGoalWithLifecycle(DefaultLifecycleExecutor.java:500)
     [exec] 	at org.apache.maven.lifecycle.DefaultLifecycleExecutor.executeGoal(DefaultLifecycleExecutor.java:479)
     [exec] 	at org.apache.maven.lifecycle.DefaultLifecycleExecutor.executeGoalAndHandleFailures(DefaultLifecycleExecutor.java:331)
     [exec] 	at org.apache.maven.lifecycle.DefaultLifecycleExecutor.executeTaskSegments(DefaultLifecycleExecutor.java:292)
     [exec] 	at org.apache.maven.lifecycle.DefaultLifecycleExecutor.execute(DefaultLifecycleExecutor.java:142)
     [exec] 	at org.apache.maven.DefaultMaven.doExecute(DefaultMaven.java:336)
     [exec] 	at org.apache.maven.DefaultMaven.execute(DefaultMaven.java:129)
     [exec] 	at org.apache.maven.cli.MavenCli.main(MavenCli.java:288)
     [exec] 	at sun.reflect.NativeMethodAccessorImpl.invoke0(Native Method)
     [exec] 	at sun.reflect.NativeMethodAccessorImpl.invoke(NativeMethodAccessorImpl.java:39)
     [exec] 	at sun.reflect.DelegatingMethodAccessorImpl.invoke(DelegatingMethodAccessorImpl.java:25)
     [exec] 	at java.lang.reflect.Method.invoke(Method.java:324)
     [exec] 	at org.codehaus.classworlds.Launcher.launchEnhanced(Launcher.java:315)
     [exec] 	at org.codehaus.classworlds.Launcher.launch(Launcher.java:255)
     [exec] 	at org.codehaus.classworlds.Launcher.mainWithExitCode(Launcher.java:430)
     [exec] 	at org.codehaus.classworlds.Launcher.main(Launcher.java:375)
     [exec] 
     [exec] 
     [exec] Results :
     [exec] 
     [exec] Tests in error: 
     [exec]   testitMNG0820(org.apache.maven.it.MavenITmng0820ConflictResolutionTest)
     [exec] 
     [exec] Tests run: 307, Failures: 0, Errors: 1, Skipped: 0
     [exec] 
     [exec] [INFO] ------------------------------------------------------------------------
     [exec] [ERROR] BUILD FAILURE
     [exec] [INFO] ------------------------------------------------------------------------
     [exec] [INFO] There are test failures.
     [exec] [INFO] ------------------------------------------------------------------------
     [exec] [INFO] For more information, run Maven with the -e switch
     [exec] [INFO] ------------------------------------------------------------------------
     [exec] [INFO] Total time: 24 minutes 29 seconds
     [exec] [INFO] Finished at: Thu Jan 29 00:45:14 GMT-06:00 2009
     [exec] [INFO] Final Memory: 28M/86M
     [exec] [INFO] ------------------------------------------------------------------------

BUILD FAILED
/home/hudson/workspace/Maven-2.0.x-with-bootstrap/jdk/1.4/label/ubuntu/maven-2.0.x/build.xml:271:
exec returned: 1

Total time: 27 minutes 28 seconds


Mime
View raw message